Tesauro SIPA
type: Ontology
type: ConceptScheme
label: SIPA Thesaurus @en
description: O Tesauro SIPA apresenta como principal objetivo controlar a terminologia utilizada na produção, representação, pesquisa e exploração de conteúdos no âmbito do sistema de informação para o património arquitetónico, urbanístico e paisagístico português e de origem ou matriz portuguesas, tendo em conta que este património, enquanto relevante componente da riqueza cultural de um país, de uma região ou de uma comunidade, é um poderoso fator de distinção e de identificação sociais de indivíduos e de populações, bem como um motor de qualificação e de desenvolvimento de lugares e territórios. Assim sendo, este tesauro enquadra-se no propósito fundamental do SIPA: constituir-se como ferramenta de informação de suporte às políticas, às estratégias e às ações de intervenção no ambiente construído, de qualificação e reabilitação urbanas e de salvaguarda e valorização do património arquitetónico, urbanístico e paisagístico.
description: The main objective of the SIPA Thesaurus is to control the terminology used in the production, representation, search and exploration of content within the scope of the information system for Portuguese architectural, town planning and landscape heritage of Portuguese origin or influence, bearing in mind that this heritage, as an important component of the cultural treasure of a country, region or community, is a powerful factor in the social distinction and identification of individuals and populations, as well as an engine for the qualification and development of places and territories. As such, this thesaurus fits in with SIPA's fundamental purpose: to be an information tool to support policies, strategies and actions for intervention in the built environment, urban qualification and rehabilitation, as well as a resource to assure the appreciation and safeguarding of architectural, urbanistic and landscape heritage. @en
creator: c c880e806
has top concept: Atividades, eventos, fenómenos, processos e técnicas
has top concept: Aglomerados Urbanos
has top concept: Atributos e propriedades
has top concept: Compartimentos e espaços
has top concept: Elementos arquitetónicos
has top concept: Entidades
has top concept: Materiais e produtos
has top concept: Objetos, Equipamentos, Mobiliário e Veículos
has top concept: c 2a059c3a
has top concept: c 7e244aff
has top concept: c 46f3f69b
has top concept: c 22b78461
has top concept: c 4947ba4e
has top concept: c d2d228e5
has top concept: c 65005b47
created: 2024-05-07T13:27:16
modified: 2025-09-23T13:03:47
publisher: c 3d0f0c8c
language: eng
language: por
language: ita
language: fra
rights: https://creativecommons.org/licenses/by-nc-nd/3.0/
rights: Conforme estipulado nos Termos e Condições de Utilização dos Conteúdos SIPA – documento disponível em http://www.monumentos.gov.pt/Site/APP_PagesUser/SitePageContents.aspx?id=08a335ea-db85-4fdd-862b-fe6e623e44a8 -, "3. As versões dos registos e documentos integrantes do SIPA disponibilizadas no sítio www.monumentos.gov.pt podem ser publicamente utilizadas nos termos e condições estabelecidos pela licença pública Creative Commons : CC BY-NC-ND-3.0." Assim, poderá utilizar a ficha de inventário ou as imagens descarregadas diretamente do site, desde que, naturalmente, garanta a referência à autoria (quando explícita) e a proveniência dos documentos reproduzidos.

Atividades, eventos, fenómenos, processos e técnicas
type: Concept
scope note: A hierarquia integra descritores que representam ações ou conjuntos complexos de ações de natureza social e organizacional, assim como Eventos e Processos. Engloba ainda um conjunto de descritores referentes a Sectores de Atividades e técnicas.
in scheme: Tesauro SIPA
top concept of: Tesauro SIPA
preferred label: Activities, events, phenomena, processes and techniques @en
preferred label: Activités, événements, phénomènes, processus et techniques @fr
preferred label: Attività, eventi, fenomeni, processi e tecniche @it
hidden label: Actividades, eventos, fenómenos, processos e técnicas
narrower: Atividades
narrower: Disciplinas e áreas de conhecimento
narrower: Eventos
narrower: Fenómenos naturais
narrower: Processos
narrower: Processos e técnicas
related: Atributos e propriedades
related: Objetos, Equipamentos, Mobiliário e Veículos
related: c 7e244aff
related: c 65005b47
modified: 2025-09-23T13:09:18

Atividades
type: Concept
scope note: A hierarquia Atividades integra descritores que representam ações ou conjuntos complexos de ações de natureza física, mental/intelectual ou legal/administrativa executadas por uma entidade – uma pessoa, um grupo social ou uma organização - de acordo com metodologias específicas e fazendo uso de Instrumentos adequados tendo em vista a consecução de determinado objetivo estratégico ou tático.
in scheme: Tesauro SIPA
preferred label: Activities @en
preferred label: Activités @fr
preferred label: Attività @it
hidden label: Actividades
broader: Atividades, eventos, fenómenos, processos e técnicas
narrower: Atividades genéricas
narrower: Atividades segundo a função

Atividades genéricas
type: Concept
in scheme: Tesauro SIPA
preferred label: Generic activities @en
preferred label: Activités génériques @fr
preferred label: Attività generiche @it
hidden label: Actividades genéricas
broader: Atividades
narrower: Associativismo
narrower: Avaliação

Associativismo
type: Concept
scope note: Organização de um grupo de indivíduos que tem como objetivo a promoção de assistência social, cultural, representação política, defesa de interesses de classe e filantropia.
in scheme: Tesauro SIPA
preferred label: Associativism @en
preferred label: Associationnisme @fr
broader: Atividades genéricas

Avaliação
type: Concept
in scheme: Tesauro SIPA
preferred label: Assessment (Evaluation) @en
preferred label: Évaluation @fr
preferred label: Valutazione @it
broader: Atividades genéricas
narrower: Avaliação ambiental
narrower: Avaliação de desempenho
narrower: Avaliação de riscos
narrower: Avaliação estrutural

Avaliação ambiental
type: Concept
in scheme: Tesauro SIPA
preferred label: Environmental evaluation @en
preferred label: Évaluation environnementale @fr
preferred label: Valutazione ambientale @it
broader: Avaliação

Avaliação de desempenho
type: Concept
in scheme: Tesauro SIPA
preferred label: Assessment of performance @en
preferred label: Évaluation des performances @fr
preferred label: Valutazione delle prestazioni @it
broader: Avaliação

Avaliação de riscos
type: Concept
in scheme: Tesauro SIPA
preferred label: Risk assessment @en
preferred label: Évaluation des risques @fr
preferred label: Valutazione dei rischi @it
broader: Avaliação

Avaliação estrutural
type: Concept
in scheme: Tesauro SIPA
preferred label: Structure evaluation @en
preferred label: Évaluation structurelle @fr
preferred label: Valutazione strutturale @it
broader: Avaliação

Atividades segundo a função
type: Concept
in scheme: Tesauro SIPA
preferred label: Activities according to function @en
preferred label: Activités selon la fonction @fr
preferred label: Attività secondo la funzione @it
hidden label: Actividades segundo a função
broader: Atividades
narrower: Atividades agrícolas
narrower: Atividades agroindustriais
narrower: Atividades agropecuárias
narrower: Atividades artesanais
narrower: Atividades assistenciais
narrower: Atividades científicas e tecnológicas
narrower: Atividades cinegéticas e piscatórias
narrower: Atividades comemorativas e evocativas
narrower: Atividades de armazenamento e distribuição
narrower: Atividades comerciais
narrower: Atividades de carga e transporte
narrower: Atividades de criação e exploração animal
narrower: Atividades de cultura e lazer
narrower: Atividades de serviços
narrower: Atividades de vigilância
narrower: Atividades desportivas
narrower: Atividades educativas e formativas
narrower: Atividades físicas e mentais
narrower: Atividades florestais
narrower: Atividades funerárias
narrower: Atividades funerárias, rituais e simbólicas pré-históricas
narrower: Atividades gastronómicas
narrower: Atividades hospitalares
narrower: Atividades industriais
narrower: Atividades militares
narrower: Atividades políticas e administrativas
narrower: Atividades religiosas

Atividades agrícolas
type: Concept
in scheme: Tesauro SIPA
preferred label: Farming activity @en
preferred label: Activité agricole @fr
preferred label: Attività agricola @it
hidden label: Actividades agrícolas
broader: Atividades segundo a função
narrower: Atividades agrícolas segundo o tipo
narrower: Ceifar

Atividades agrícolas segundo o tipo
type: Concept
in scheme: Tesauro SIPA
preferred label: Agricultural activities according to type @en
preferred label: Activités agricoles selon le type @fr
preferred label: Attività agricole secondo la tipologia @it
hidden label: Actividades agrícolas segundo o tipo
broader: Atividades agrícolas
narrower: Agricultura biológica
narrower: Agricultura de subsistência
narrower: Agricultura familiar
narrower: Agricultura medicinal
narrower: Agricultura sustentável

Agricultura biológica
type: Concept
scope note: Tipo de agricultura que utiliza técnicas e métodos que respeitam o equilíbrio natural, privilegiando o cultivo de espécies resistentes e recorrendo à fertilização orgânica.
in scheme: Tesauro SIPA
preferred label: Organic agriculture @en
preferred label: Agriculture biologique @fr
preferred label: Agricoltura biologica @it
broader: Atividades agrícolas segundo o tipo

Agricultura de subsistência
type: Concept
in scheme: Tesauro SIPA
preferred label: Subsistence agriculture @en
preferred label: Agriculture de subsistance @fr
preferred label: Agricoltura di sussistenza @it
alternative label: Agricultura tradicional
broader: Atividades agrícolas segundo o tipo

Agricultura familiar
type: Concept
in scheme: Tesauro SIPA
preferred label: Family-based agriculture @en
preferred label: Agriculture familiale @fr
preferred label: Agricoltura familiare @it
broader: Atividades agrícolas segundo o tipo

Agricultura medicinal
type: Concept
in scheme: Tesauro SIPA
preferred label: Medicinal agriculture @en
preferred label: Agriculture médicinale @fr
preferred label: Agricoltura medicinale @it
broader: Atividades agrícolas segundo o tipo

Agricultura sustentável
type: Concept
scope note: Tipo de agricultura que utiliza técnicas e métodos de conservação do solo e de energia, minimizando o consumo dos recursos ambientais, não afetando a qualidade dos produtos produzidos.
in scheme: Tesauro SIPA
preferred label: Sustainable agriculture @en
preferred label: Agriculture durable @fr
preferred label: Agricoltura sostenibile @it
broader: Atividades agrícolas segundo o tipo

Ceifar
type: Concept
in scheme: Tesauro SIPA
preferred label: Reap @en
preferred label: Moissoner @fr
preferred label: Mietere @it
broader: Atividades agrícolas

Atividades agroindustriais
type: Concept
in scheme: Tesauro SIPA
preferred label: Agro-industry @en
preferred label: Agro-industrie @fr
preferred label: Agroindustria @it
hidden label: Actividades agro-industriais
broader: Atividades segundo a função

Atividades agropecuárias
type: Concept
in scheme: Tesauro SIPA
preferred label: Farming and cattle rising @en
preferred label: Agro-pastoral @fr
preferred label: Industria dell'agricoltura e dell'allevamento @it
hidden label: Actividades agro-pecuárias
broader: Atividades segundo a função

Atividades artesanais
type: Concept
in scheme: Tesauro SIPA
preferred label: Crafts activity @en
preferred label: Artisanat @fr
preferred label: Attività artigianale @it
hidden label: Actividades artesanais
broader: Atividades segundo a função
narrower: Alfaiataria
narrower: Alta-costura
narrower: Carpintaria
narrower: Cerâmica
narrower: Marcenaria
narrower: Olaria
narrower: Têxtil

Alfaiataria
type: Concept
scope note: Oficina onde se confecionam fatos masculinos.
in scheme: Tesauro SIPA
preferred label: Tailors @en
preferred label: Couturier @fr
preferred label: Sarto @it
broader: Atividades artesanais

Alta-costura
type: Concept
in scheme: Tesauro SIPA
preferred label: Haute couture (High fashion) @en
preferred label: Haute couture @fr
broader: Atividades artesanais

Carpintaria
type: Concept
scope note: Oficina onde o carpinteiro exerce a sua atividade.
in scheme: Tesauro SIPA
preferred label: Carpentry @en
preferred label: Charpenterie @fr
preferred label: Falegnameria @it
broader: Atividades artesanais

Cerâmica
type: Concept
in scheme: Tesauro SIPA
preferred label: Ceramics @en
preferred label: Céramique @fr
preferred label: Ceramica @it
broader: Atividades artesanais
narrower: Cerâmica segundo o tipo
related: Produtos de revestimento cerâmicos

Cerâmica segundo o tipo
type: Concept
in scheme: Tesauro SIPA
preferred label: Ceramics according to type @en
preferred label: Céramique selon le type @fr
preferred label: Ceramica per tipologia @it
broader: Cerâmica
narrower: Cerâmica campaniense
narrower: Cerâmica campaniforme

Cerâmica campaniense
type: Concept
scope note: Tipo de cerâmica desenvolvida na região de Campania desde os Etruscos até ao séc. I a.C., caraterizada pela utilização de um vidrado preto. A cerâmica está categorizada em 3 fases, denominadas Campaniense A, Campaniense B e Campaniense C.
in scheme: Tesauro SIPA
preferred label: Campanian ceramics @en
preferred label: Céramique campanienne @fr
preferred label: Ceramica campana @it
broader: Cerâmica segundo o tipo

Cerâmica campaniforme
type: Concept
scope note: Tipo de cerâmica caracterizada pela produção de vasos em forma de sino invertido, datada do III Milénio a.C.
in scheme: Tesauro SIPA
preferred label: Bell beaker ceramics @en
preferred label: Céramique campaniforme @fr
preferred label: Ceramica campaniforme @it
broader: Cerâmica segundo o tipo

Marcenaria
type: Concept
in scheme: Tesauro SIPA
preferred label: Carpentry art @en
preferred label: Art de la menuiserie @fr
preferred label: Arte della falegnameria @it
broader: Atividades artesanais

Olaria
type: Concept
in scheme: Tesauro SIPA
preferred label: Pottery @en
preferred label: Poterie @fr
preferred label: Ceramiche @it
alternative label: Alfareria
broader: Atividades artesanais

Têxtil
type: Concept
in scheme: Tesauro SIPA
preferred label: Textile @en
preferred label: Tessile @it
broader: Atividades artesanais
narrower: Bordado
narrower: Paramentaria
narrower: Tapeçaria
narrower: Tecidos

Bordado
type: Concept
scope note: Lavor em relevo feito com linha de algodão, acrílica, seda ou metal nobre, feito com uma agulha numa superfície têxtil, couro ou papel.
in scheme: Tesauro SIPA
preferred label: Embrodery @en
preferred label: Broderie @fr
preferred label: Ricamo @it
broader: Têxtil

Paramentaria
type: Concept
scope note: Atividade que executa as peças ornamentais, incluindo passamanaria, e vestes litúrgicas sacerdotais, utilizadas pela Igreja Católica.
in scheme: Tesauro SIPA
preferred label: Liturgical vestments @en
preferred label: Paramentaire @fr
preferred label: Vesti liturgiche @it
broader: Têxtil

Tapeçaria
type: Concept
scope note: Atividade relacionada com a feitura de tapetes.
in scheme: Tesauro SIPA
preferred label: Tapestry @en
preferred label: Tapisserie @fr
preferred label: Arazzi @it
broader: Têxtil

Tecidos
type: Concept
in scheme: Tesauro SIPA
preferred label: Tissu @fr
preferred label: Tessuto @it
preferred label: Fabrics @en
broader: Têxtil

Atividades assistenciais
type: Concept
in scheme: Tesauro SIPA
preferred label: Welfare activities @en
preferred label: Activités sociales @fr
preferred label: Attività assistenziali @it
hidden label: Actividades assistenciais
broader: Atividades segundo a função

Atividades científicas e tecnológicas
type: Concept
in scheme: Tesauro SIPA
preferred label: Scientific and technological activities @en
preferred label: Activités scientifiques et technologiques @fr
preferred label: Attività scientifiche e tecnologiche @it
hidden label: Actividades científicas e tecnológicas
broader: Atividades segundo a função
narrower: Analisar

Analisar
type: Concept
in scheme: Tesauro SIPA
preferred label: Analysing @en
preferred label: Analyse @fr
preferred label: Analisi @it
broader: Atividades científicas e tecnológicas
narrower: Análise antropológica
narrower: Análise arqueológica
narrower: Análise arquitetónica
narrower: Análise comparativa
narrower: Análise de conteúdo
narrower: Análise de custos
narrower: Análise de dados
narrower: Análise de estruturas
narrower: Análise de projetos
narrower: Análise de risco
narrower: Análise de sistemas
narrower: Análise demográfica
narrower: Análise documental
narrower: Análise dos materiais
narrower: Análise ecológica
narrower: Análise económica
narrower: Análise espacial
narrower: Análise estatística
narrower: Análise geológica
narrower: Análise histórica
narrower: Análise laboratorial
narrower: Análise literária
narrower: Análise métrica
narrower: Análise paisagística
narrower: Análise patogénica
narrower: Análise política
narrower: Análise populacional
narrower: Análise regional
narrower: Análise sensorial
narrower: Análise social
narrower: Análise socioeconómica
narrower: Análise sociológica
narrower: Análise térmica
narrower: Análise urbana

Análise antropológica
type: Concept
in scheme: Tesauro SIPA
preferred label: Anthropological analysis @en
preferred label: Analyse anthropologique @fr
preferred label: Analisi antropologica @it
broader: Analisar

Análise arqueológica
type: Concept
in scheme: Tesauro SIPA
preferred label: Archeological analysis @en
preferred label: Analyse archéologique @fr
preferred label: Analisi archeologica @it
broader: Analisar

Análise arquitetónica
type: Concept
in scheme: Tesauro SIPA
preferred label: Architectural analysis @en
preferred label: Analyse architecturale @fr
preferred label: Analisi architettonica @it
hidden label: Análise arquitectónica
broader: Analisar

Análise comparativa
type: Concept
in scheme: Tesauro SIPA
preferred label: Comparative analysis @en
preferred label: Analyse comparative @fr
preferred label: Analisi comparativa @it
broader: Analisar

Análise de conteúdo
type: Concept
in scheme: Tesauro SIPA
preferred label: Content analysis @en
preferred label: Analyse du contenu @fr
preferred label: Analisi del contenuto @it
broader: Analisar

Análise de custos
type: Concept
in scheme: Tesauro SIPA
preferred label: Costs analysis @en
preferred label: Analyse des coûts @fr
preferred label: Analisi dei costi @it
broader: Analisar

Análise de dados
type: Concept
in scheme: Tesauro SIPA
preferred label: Data analysis @en
preferred label: Analyse des données @fr
preferred label: Analisi dei dati @it
broader: Analisar

Análise de estruturas
type: Concept
in scheme: Tesauro SIPA
preferred label: Structural analysis @en
preferred label: Analyse des structures @fr
preferred label: Analisi della struttura @it
broader: Analisar
narrower: Análise do comportamento estrutural

Análise do comportamento estrutural
type: Concept
in scheme: Tesauro SIPA
preferred label: Structural behavior analysis @en
preferred label: Analyse du comportement structurel @fr
preferred label: Analisi del comportamento strutturale @it
broader: Análise de estruturas

Análise de projetos
type: Concept
in scheme: Tesauro SIPA
preferred label: Project analysis @en
preferred label: Analyse de projet @fr
preferred label: Analisi del progetto @it
hidden label: Análise de projectos
broader: Analisar

Análise de risco
type: Concept
in scheme: Tesauro SIPA
preferred label: Risk analysis @en
preferred label: Analyse des risques @fr
preferred label: Analisi dei rischi @it
broader: Analisar

Análise de sistemas
type: Concept
in scheme: Tesauro SIPA
preferred label: Sistems analysis @en
preferred label: Analyse des systèmes @fr
preferred label: Analisi dei sistemi @it
broader: Analisar

Análise demográfica
type: Concept
in scheme: Tesauro SIPA
preferred label: Demographic analysis @en
preferred label: Analyse démographique @fr
preferred label: Analisi demografica @it
broader: Analisar

Análise documental
type: Concept
in scheme: Tesauro SIPA
preferred label: Documental analysis @en
preferred label: Analyse des documents @fr
preferred label: Analisi dei documenti @it
broader: Analisar

Análise dos materiais
type: Concept
in scheme: Tesauro SIPA
preferred label: Material analysis @en
preferred label: Analyse des matériaux @fr
preferred label: Analisi dei materiali @it
broader: Analisar

Análise ecológica
type: Concept
in scheme: Tesauro SIPA
preferred label: Ecological analysis @en
preferred label: Analyse écologique @fr
preferred label: Analisi ecologica @it
broader: Analisar

Análise económica
type: Concept
in scheme: Tesauro SIPA
preferred label: Economical analysis @en
preferred label: Analyse économique @fr
preferred label: Analisi economica @it
broader: Analisar

Análise espacial
type: Concept
in scheme: Tesauro SIPA
preferred label: Spatial analysis @en
preferred label: Analyse spatiale @fr
preferred label: Analisi spaziale @it
broader: Analisar

Análise estatística
type: Concept
in scheme: Tesauro SIPA
preferred label: Statistical analysis @en
preferred label: Analyse statistique @fr
preferred label: Analisi statistica @it
broader: Analisar

Análise geológica
type: Concept
in scheme: Tesauro SIPA
preferred label: Geological analysis @en
preferred label: Analyse géologique @fr
preferred label: Analisi geologica @it
broader: Analisar

Análise histórica
type: Concept
in scheme: Tesauro SIPA
preferred label: Historical analysis @en
preferred label: Analyse historique @fr
preferred label: Analisi storica @it
broader: Analisar

Análise laboratorial
type: Concept
in scheme: Tesauro SIPA
preferred label: Laboratory analysis @en
preferred label: Analyse en laboratoire @fr
preferred label: Analisi di laboratorio @it
broader: Analisar
narrower: Análise química
narrower: Exame radiológico

Análise química
type: Concept
in scheme: Tesauro SIPA
preferred label: Chemical analysis @en
preferred label: Analyse chimique @fr
preferred label: Analisi chimica @it
broader: Análise laboratorial

Exame radiológico
type: Concept
in scheme: Tesauro SIPA
preferred label: Radiological examination (Imaging) @en
preferred label: Examen radiologique @fr
preferred label: Esame radiologico @it
broader: Análise laboratorial

Análise literária
type: Concept
in scheme: Tesauro SIPA
preferred label: Literary analysis @en
preferred label: Analyse littéraire @fr
preferred label: Analisi letteraria @it
broader: Analisar

Análise métrica
type: Concept
in scheme: Tesauro SIPA
preferred label: Metric analysis @en
preferred label: Analyse métrique @fr
preferred label: Analisi metrica @it
broader: Analisar

Análise paisagística
type: Concept
in scheme: Tesauro SIPA
preferred label: Landscape analysis @en
preferred label: Analyse du paysage @fr
preferred label: Analisi del paesaggio @it
broader: Analisar

Análise patogénica
type: Concept
in scheme: Tesauro SIPA
preferred label: Pathogenic analysis @en
preferred label: Analyse pathogénique @fr
preferred label: Analisi patogenetica @it
broader: Analisar

Análise política
type: Concept
in scheme: Tesauro SIPA
preferred label: Political analysis @en
preferred label: Analyse politique @fr
preferred label: Analisi politica @it
broader: Analisar

Análise populacional
type: Concept
in scheme: Tesauro SIPA
preferred label: Populational analysis @en
preferred label: Analyse de la population @fr
preferred label: Analisi della popolazione @it
broader: Analisar

Análise regional
type: Concept
in scheme: Tesauro SIPA
preferred label: Local analysis @en
preferred label: Analyse régionale @fr
preferred label: Analisi regionale @it
broader: Analisar

Análise sensorial
type: Concept
in scheme: Tesauro SIPA
preferred label: Sensory analysis @en
preferred label: Analyse sensorielle @fr
preferred label: Analisi sensoriale @it
broader: Analisar

Análise social
type: Concept
in scheme: Tesauro SIPA
preferred label: Social analysis @en
preferred label: Analyse sociale @fr
preferred label: Analisi sociale @it
broader: Analisar

Análise socioeconómica
type: Concept
in scheme: Tesauro SIPA
preferred label: Socioeconomic analysis @en
preferred label: Analyse socio-économique @fr
preferred label: Analisi socioeconomica @it
broader: Analisar

Análise sociológica
type: Concept
in scheme: Tesauro SIPA
preferred label: Sociological analysis @en
preferred label: Analyse sociologique @fr
preferred label: Analisi sociologica @it
broader: Analisar

Análise térmica
type: Concept
in scheme: Tesauro SIPA
preferred label: Thermic analysis @en
preferred label: Analyse thermique @fr
preferred label: Analisi termica @it
broader: Analisar

Análise urbana
type: Concept
in scheme: Tesauro SIPA
preferred label: Urban analysis @en
preferred label: Analyse urbaine @fr
preferred label: Analisi urbana @it
broader: Analisar

Atividades cinegéticas e piscatórias
type: Concept
scope note: Atividades relacionadas com a caça e a pesca.
in scheme: Tesauro SIPA
preferred label: Hunting and fishing activities @en
preferred label: Activités de chasse et de pêche @fr
preferred label: Attività di caccia e di pesca @it
hidden label: Actividades cinegéticas e piscatórias
broader: Atividades segundo a função
narrower: Caça
narrower: Pesca

Caça
type: Concept
in scheme: Tesauro SIPA
preferred label: Chasse @fr
preferred label: Hunting @en
preferred label: Caccia @it
broader: Atividades cinegéticas e piscatórias

Pesca
type: Concept
in scheme: Tesauro SIPA
preferred label: Fishing @en
preferred label: Pêche @fr
broader: Atividades cinegéticas e piscatórias

Atividades comemorativas e evocativas
type: Concept
in scheme: Tesauro SIPA
preferred label: Activités de commémoration et d'évocation @en
preferred label: Commemorative and evocative activities @fr
preferred label: Attività commemorative ed evocative @it
hidden label: Actividades comemorativas e evocativas
broader: Atividades segundo a função

Atividades de armazenamento e distribuição
type: Concept
in scheme: Tesauro SIPA
preferred label: Activités de stockage et de distribution @en
preferred label: Storage and distribution activities @fr
preferred label: Attività di stoccaggio e distribuzione @it
hidden label: Actividades de armazenamento e distribuição
broader: Atividades segundo a função
narrower: Acomodar
narrower: Acondicionar

Acomodar
type: Concept
in scheme: Tesauro SIPA
preferred label: Accommodation @en
preferred label: Accomodamento (Alloggio) @it
broader: Atividades de armazenamento e distribuição

Acondicionar
type: Concept
in scheme: Tesauro SIPA
preferred label: Packaging (Storage) @en
preferred label: Emballage (Conditionnement) @fr
preferred label: Imballaggio (Condizionamento) @it
broader: Atividades de armazenamento e distribuição

Atividades comerciais
type: Concept
in scheme: Tesauro SIPA
preferred label: Commercial activities @en
preferred label: Activités commerciales @fr
preferred label: Attività commerciali @it
hidden label: Actividades comerciais
broader: Atividades segundo a função
narrower: Alienação
narrower: Arrendamento

Alienação
type: Concept
in scheme: Tesauro SIPA
preferred label: Alienation (Disposal) @en
preferred label: Aliénation @fr
preferred label: Alienazione @it
broader: Atividades comerciais
narrower: Alienação de fogos

Alienação de fogos
type: Concept
in scheme: Tesauro SIPA
preferred label: Alienation of properties @en
preferred label: Cession de biens immobiliers @fr
preferred label: Alienazione di beni @it
broader: Alienação

Arrendamento
type: Concept
in scheme: Tesauro SIPA
preferred label: Rental (Lease) @en
preferred label: Location @fr
preferred label: Affitto di proprietà @it
broader: Atividades comerciais

Atividades de carga e transporte
type: Concept
in scheme: Tesauro SIPA
preferred label: Freight and transport activity @en
preferred label: Activités de chargement et de transport @fr
preferred label: Attività di carico e trasporto @it
alternative label: Transporte
hidden label: Actividades de carga e transporte
broader: Atividades segundo a função
narrower: Acarretar
narrower: Alar
narrower: Baldear
narrower: Carreto
narrower: Guindar

Acarretar
type: Concept
scope note: Transportar materiais em carros de bois ou carretas de madeira.
in scheme: Tesauro SIPA
preferred label: Carrying @en
preferred label: Porter (Transporter) @fr
preferred label: Portare (Trasportare) @it
alternative label: Carretar
broader: Atividades de carga e transporte

Alar
type: Concept
scope note: Erguer materiais por meio de cordas, roldanas ou guindaste.
in scheme: Tesauro SIPA
preferred label: Loading @en
preferred label: Chargement en cours @fr
preferred label: Caricamento in corso @it
broader: Atividades de carga e transporte

Baldear
type: Concept
scope note: Separar materiais e mudá-los de sítio.
in scheme: Tesauro SIPA
preferred label: Transfer; Transship @en
preferred label: Transborder; Transverser @fr
preferred label: Trasbordare; Travasare @it
broader: Atividades de carga e transporte

Carreto
type: Concept
scope note: Transportar materiais em carros, independentemente do tipo de tração utilizada.
in scheme: Tesauro SIPA
preferred label: Carriage @en
preferred label: Moulinet @fr
preferred label: Mulinello @it
broader: Atividades de carga e transporte

Guindar
type: Concept
in scheme: Tesauro SIPA
preferred label: Hoist @en
preferred label: Ghindare @it
preferred label: Guinder; Hisser @fr
broader: Atividades de carga e transporte

Atividades de criação e exploração animal
type: Concept
in scheme: Tesauro SIPA
preferred label: Animal breeding and exploitation activities @en
preferred label: Activités d'élevage et d'exploitation des animaux @fr
preferred label: Attività di allevamento e sfruttamento degli animali @it
hidden label: Actividades de criação e exploração animal
broader: Atividades segundo a função
narrower: Aquacultura
narrower: Atividade pecuária

Aquacultura
type: Concept
scope note: Cultura de organismos aquáticos, incluindo peixes, moluscos, crustáceos e plantas aquáticas.
in scheme: Tesauro SIPA
preferred label: Aquaculture @en
preferred label: Acquacoltura @it
broader: Atividades de criação e exploração animal

Atividade pecuária
type: Concept
in scheme: Tesauro SIPA
preferred label: Livestock farming @en
preferred label: Activité d’élevage @fr
preferred label: Attività di allevamento @it
hidden label: Actividade pecuária
broader: Atividades de criação e exploração animal
narrower: Apicultura
narrower: Avicultura
narrower: Criação de gado

Apicultura
type: Concept
in scheme: Tesauro SIPA
preferred label: Beekeeping @en
preferred label: Apiculture @fr
preferred label: Apicoltura @it
broader: Atividade pecuária

Avicultura
type: Concept
in scheme: Tesauro SIPA
preferred label: Poultry farming @en
preferred label: Aviculture @fr
preferred label: Avicoltura @it
broader: Atividade pecuária

Criação de gado
type: Concept
in scheme: Tesauro SIPA
preferred label: Livestock breeding @en
preferred label: Unité de production agricole @fr
preferred label: Unità di produzione agricola @it
broader: Atividade pecuária
narrower: Exploração pecuária
narrower: Pastorícia
narrower: Transumância

Exploração pecuária
type: Concept
in scheme: Tesauro SIPA
preferred label: Agricultural unit @en
preferred label: Élevage @fr
preferred label: Allevamento @it
broader: Criação de gado

Pastorícia
type: Concept
in scheme: Tesauro SIPA
preferred label: Herding @en
preferred label: Pastoralisme @fr
preferred label: Pastorizia @it
broader: Criação de gado

Transumância
type: Concept
in scheme: Tesauro SIPA
preferred label: Transhumance @en
preferred label: Transumanza @it
broader: Criação de gado

Atividades de cultura e lazer
type: Concept
in scheme: Tesauro SIPA
preferred label: Activités culturelles e de loisirs @fr
preferred label: Attività culturali e ricreative @it
preferred label: Cultural and leisure activities @en
hidden label: Actividades de cultura e lazer
broader: Atividades segundo a função
narrower: Animação cultural
narrower: Animação sociocultural
narrower: Associativismo cultural
narrower: Atividade artística
narrower: Atividade de investigação
narrower: Atividade museológica
narrower: Colecionismo
narrower: Concerto
narrower: Exposições
narrower: Modelismo

Animação cultural
type: Concept
in scheme: Tesauro SIPA
preferred label: Cultural entertainment @en
preferred label: Animation culturelle @fr
preferred label: Animazione culturale @it
broader: Atividades de cultura e lazer

Animação sociocultural
type: Concept
in scheme: Tesauro SIPA
preferred label: Sociocultural entertainment @en
preferred label: Animation socioculturelle @fr
preferred label: Animazione socio-culturale @it
broader: Atividades de cultura e lazer

Associativismo cultural
type: Concept
in scheme: Tesauro SIPA
preferred label: Cultural associativism @en
preferred label: Associationnisme culturelle @fr
broader: Atividades de cultura e lazer

Atividade artística
type: Concept
in scheme: Tesauro SIPA
preferred label: Artistic activity @en
preferred label: Activité artistique @fr
preferred label: Attività artistica @it
hidden label: Actividade artística
broader: Atividades de cultura e lazer

Atividade de investigação
type: Concept
in scheme: Tesauro SIPA
preferred label: Research activity @en
preferred label: Activité de recherche @fr
preferred label: Attività di ricerca @it
hidden label: Actividade de investigação
broader: Atividades de cultura e lazer
narrower: Antiquariato

Antiquariato
type: Concept
in scheme: Tesauro SIPA
preferred label: Antiquarianism @en
preferred label: Commerce d'antiquités @fr
preferred label: Commercio di antichità @it
broader: Atividade de investigação

Atividade museológica
type: Concept
in scheme: Tesauro SIPA
preferred label: Museum activity @en
preferred label: Activité muséale @fr
preferred label: Attività museale @it
hidden label: Actividade museológica
broader: Atividades de cultura e lazer

Colecionismo
type: Concept
in scheme: Tesauro SIPA
preferred label: Collecting @en
preferred label: Collezionismo @it
hidden label: Coleccionismo
broader: Atividades de cultura e lazer
narrower: Cartofilia
narrower: Filatelia
narrower: Numismática

Cartofilia
type: Concept
in scheme: Tesauro SIPA
preferred label: Cartophilia @en
preferred label: Cartophilie @fr
broader: Colecionismo

Filatelia
type: Concept
scope note: Estudo e, por extensão, coleção de selos postais e outros objetos com eles relacionados.
in scheme: Tesauro SIPA
preferred label: Philately @en
preferred label: Philatélie @fr
broader: Colecionismo

Numismática
type: Concept
scope note: Estudo e, por extensão, coleção de moedas e medalhas.
in scheme: Tesauro SIPA
preferred label: Numismatics @en
preferred label: Numismatique @fr
preferred label: Numismatica @it
broader: Colecionismo

Concerto
type: Concept
in scheme: Tesauro SIPA
preferred label: Concert @en
broader: Atividades de cultura e lazer

Exposições
type: Concept
in scheme: Tesauro SIPA
preferred label: Exhibitions @en
preferred label: Expositions @fr
preferred label: Mostre @it
broader: Atividades de cultura e lazer

Modelismo
type: Concept
in scheme: Tesauro SIPA
preferred label: Modelling; Model-making @en
preferred label: Modélisme @fr
broader: Atividades de cultura e lazer
narrower: Aeromodelismo

Aeromodelismo
type: Concept
in scheme: Tesauro SIPA
preferred label: Aeromodeling @en
preferred label: Aeromodélisme @fr
preferred label: Aeromodellismo @it
broader: Modelismo

Atividades de serviços
type: Concept
in scheme: Tesauro SIPA
preferred label: Service activity @en
preferred label: Activité de service @fr
preferred label: Attività di servizio @it
hidden label: Actividades de serviços
broader: Atividades segundo a função

Atividades de vigilância
type: Concept
in scheme: Tesauro SIPA
preferred label: Surveillance activities @en
preferred label: Activités de surveillance @fr
preferred label: Attività di sorveglianza @it
hidden label: Actividades de vigilância
broader: Atividades segundo a função

Atividades desportivas
type: Concept
in scheme: Tesauro SIPA
preferred label: Sports activities @en
preferred label: Activités sportives @fr
preferred label: Attività sportive @it
hidden label: Actividades desportivas
broader: Atividades segundo a função

Atividades educativas e formativas
type: Concept
in scheme: Tesauro SIPA
preferred label: Educational and training activities @en
preferred label: Activités d'enseignement et de formation @fr
preferred label: Attività educative e formative @it
hidden label: Actividades educativas e formativas
broader: Atividades segundo a função

Atividades físicas e mentais
type: Concept
in scheme: Tesauro SIPA
preferred label: Physical and mental activity @en
preferred label: Activité physique et mentale @fr
preferred label: Attività fisica e mentale @it
hidden label: Actividades físicas e mentais
broader: Atividades segundo a função

Atividades florestais
type: Concept
in scheme: Tesauro SIPA
preferred label: Forestry activities @en
preferred label: Activités forestières @fr
preferred label: Attività forestali @it
hidden label: Actividades florestais
broader: Atividades segundo a função
narrower: Atividade silvícola
narrower: Exploração florestal

Atividade silvícola
type: Concept
in scheme: Tesauro SIPA
preferred label: Forestry activity @en
preferred label: Activité forestière @fr
preferred label: Attività forestale @it
hidden label: Actividade silvícola
broader: Atividades florestais
narrower: Arborização

Arborização
type: Concept
scope note: Plantação e manutenção de árvores em áreas urbanas, contribuindo para melhorar o ambiente dos aglomerados urbanos.
in scheme: Tesauro SIPA
preferred label: Boisement @fr
preferred label: Imboschimento @it
preferred label: Afforestation @en
broader: Atividade silvícola

Exploração florestal
type: Concept
in scheme: Tesauro SIPA
preferred label: Forestry @en
preferred label: Exploitation forestière @fr
preferred label: Sfruttamento forestale/ Disboscamento @it
broader: Atividades florestais
narrower: Desflorestação
narrower: Florestação

Desflorestação
type: Concept
scope note: Processo de extinguir de forma permanente uma florestas, permitindo a utilização do terreno outros fins, como agricultura, pecuária ou urbanização.
in scheme: Tesauro SIPA
preferred label: Deforestation @en
preferred label: Déforestation @fr
preferred label: Deforestazione @it
broader: Exploração florestal
narrower: Abate florestal

Abate florestal
type: Concept
in scheme: Tesauro SIPA
preferred label: Forest felling @en
preferred label: Abattage forestier @fr
preferred label: Abbattimento forestale @it
broader: Desflorestação

Florestação
type: Concept
in scheme: Tesauro SIPA
preferred label: Forestring @en
preferred label: Boisement @fr
preferred label: Imboschimento @it
broader: Exploração florestal

Atividades funerárias
type: Concept
in scheme: Tesauro SIPA
preferred label: Funeral activities @en
preferred label: Activités funéraires @fr
preferred label: Attività funerarie @it
hidden label: Actividades funerárias
broader: Atividades segundo a função
narrower: Enterramento

Enterramento
type: Concept
in scheme: Tesauro SIPA
preferred label: Burial @en
preferred label: Enterrement @fr
broader: Atividades funerárias

Atividades funerárias, rituais e simbólicas pré-históricas
type: Concept
in scheme: Tesauro SIPA
preferred label: Prehistoric funeral, ritual and symbolic activities @en
preferred label: Activités funéraires, rituelles et symboliques préhistoriques @fr
preferred label: Attività funerarie, rituali e simboliche preistoriche @it
hidden label: Actividades funerárias, rituais e simbólicas pré-históricas
broader: Atividades segundo a função

Atividades gastronómicas
type: Concept
in scheme: Tesauro SIPA
preferred label: Gastronomic activity @en
preferred label: Activité gastronomique @fr
preferred label: Attività gastronomica @it
hidden label: Actividades gastronómicas
broader: Atividades segundo a função

Atividades hospitalares
type: Concept
in scheme: Tesauro SIPA
preferred label: Hospital activities @en
preferred label: Activités hospitalières @fr
preferred label: Attività ospedaliere @it
hidden label: Actividades hospitalares
broader: Atividades segundo a função

Atividades industriais
type: Concept
in scheme: Tesauro SIPA
preferred label: Industrial activity @en
preferred label: Activité industrielle @fr
preferred label: Attività industriale @it
hidden label: Actividades industriais
broader: Atividades segundo a função
narrower: Atividade de extração de inertes

Atividade de extração de inertes
type: Concept
in scheme: Tesauro SIPA
preferred label: Inert extraction activity @en
preferred label: Activité d'extraction d'inertes @fr
preferred label: Attività di estrazione di inerti @it
hidden label: Actividade de extracção de inertes
broader: Atividades industriais
narrower: Atividade mineira

Atividade mineira
type: Concept
in scheme: Tesauro SIPA
preferred label: Mining @en
preferred label: Activité minière @fr
preferred label: Attività estrattiva @it
hidden label: Actividade mineira
broader: Atividade de extração de inertes

Atividades militares
type: Concept
in scheme: Tesauro SIPA
preferred label: Military activities @en
preferred label: Activités militaires @fr
preferred label: Attività militari @it
hidden label: Actividades militares
broader: Atividades segundo a função

Atividades políticas e administrativas
type: Concept
in scheme: Tesauro SIPA
preferred label: Political and administrative activities @en
preferred label: Activités politiques et administratives @fr
preferred label: Attività politiche e amministrative @it
hidden label: Actividades políticas e administrativas
broader: Atividades segundo a função
narrower: Administração da justiça
narrower: Administração militar
narrower: Administração pública
narrower: Atividade política e administrativa segundo o contexto

Administração da justiça
type: Concept
in scheme: Tesauro SIPA
preferred label: Administration of justice @en
preferred label: Administration de la justice @fr
preferred label: Amministrazione della giustizia @it
broader: Atividades políticas e administrativas

Administração militar
type: Concept
in scheme: Tesauro SIPA
preferred label: Military administration @en
preferred label: Administration militaire @fr
preferred label: Amministrazione militare @it
broader: Atividades políticas e administrativas

Administração pública
type: Concept
in scheme: Tesauro SIPA
preferred label: Public administration (Government) @en
preferred label: Administration publique @fr
preferred label: Amministrazione pubblica @it
broader: Atividades políticas e administrativas
narrower: Administração autárquica
narrower: Administração do território
narrower: Administração regional

Administração autárquica
type: Concept
in scheme: Tesauro SIPA
preferred label: Local administration @en
preferred label: Administration locale @fr
preferred label: Amministrazione comunale @it
alternative label: Administração local
broader: Administração pública

Administração do território
type: Concept
in scheme: Tesauro SIPA
preferred label: Territorial administration @en
preferred label: Administration du territoire @fr
preferred label: Amministrazione fondiaria @it
broader: Administração pública

Administração regional
type: Concept
in scheme: Tesauro SIPA
preferred label: Local administration @en
preferred label: Administration régionale @fr
preferred label: Amministrazione regionale @it
broader: Administração pública

Atividade política e administrativa segundo o contexto
type: Concept
in scheme: Tesauro SIPA
preferred label: Political and administrative activity according to context @en
preferred label: Activités politiques et administratives selon le contexte @fr
preferred label: Attività politica e amministrativa secondo il contesto @it
hidden label: Actividade política e administrativa segundo o contexto
broader: Atividades políticas e administrativas
narrower: Administração colonial
narrower: Administração régia
narrower: Administração senhorial

Administração colonial
type: Concept
in scheme: Tesauro SIPA
preferred label: Colonial administration @en
preferred label: Administration coloniale @fr
preferred label: Amministrazione coloniale @it
broader: Atividade política e administrativa segundo o contexto

Administração régia
type: Concept
in scheme: Tesauro SIPA
preferred label: Royal administration @en
preferred label: Administration royale @fr
preferred label: Amministrazione reale @it
broader: Atividade política e administrativa segundo o contexto

Administração senhorial
type: Concept
in scheme: Tesauro SIPA
preferred label: Amministrazione comunale @it
preferred label: Manorial administration @en
preferred label: Administration seigneuriale @fr
broader: Atividade política e administrativa segundo o contexto

Atividades religiosas
type: Concept
in scheme: Tesauro SIPA
preferred label: Religious activities @en
preferred label: Activités religieuses @fr
preferred label: Attività religiose @it
hidden label: Actividades religiosas
broader: Atividades segundo a função
narrower: Pregação

Pregação
type: Concept
in scheme: Tesauro SIPA
preferred label: Preaching @en
broader: Atividades religiosas

Disciplinas e áreas de conhecimento
type: Concept
in scheme: Tesauro SIPA
preferred label: Subjects and knowledge areas @en
preferred label: Disciplines et domaines de connaissances @fr
preferred label: Discipline e aree di conoscenza @it
broader: Atividades, eventos, fenómenos, processos e técnicas
narrower: Áreas de conhecimento interdisplinares
narrower: Ciências
narrower: Ciências ocultas
narrower: Ciências sociais
narrower: Humanidades

Áreas de conhecimento interdisplinares
type: Concept
in scheme: Tesauro SIPA
preferred label: Interdisciplinary knowledge areas @en
preferred label: Domaines de connaissances interdisciplinaires @fr
preferred label: Aree di conoscenza interdisciplinari @it
broader: Disciplinas e áreas de conhecimento
narrower: Ciência forense
narrower: Conservação
narrower: História natural
narrower: Informática

Ciência forense
type: Concept
in scheme: Tesauro SIPA
preferred label: Forensic science @en
preferred label: Sciences médico-légales @fr
preferred label: Scienze forensi @it
broader: Áreas de conhecimento interdisplinares

Conservação
type: Concept
in scheme: Tesauro SIPA
preferred label: Conservation @en
preferred label: Conservazione @it
broader: Áreas de conhecimento interdisplinares
narrower: Conservação arqueológica
narrower: Conservação arquitetónica
narrower: Conservação etnográfica
narrower: Conservação preventiva
narrower: Conservação sustentável

Conservação arqueológica
type: Concept
in scheme: Tesauro SIPA
preferred label: Archaeologial conservation @en
preferred label: Conservation archéologique @fr
preferred label: Conservazione archeologica @it
broader: Conservação

Conservação arquitetónica
type: Concept
in scheme: Tesauro SIPA
preferred label: Architectural conservation @en
preferred label: Conservation architecturale @fr
preferred label: Conservazione architettonica @it
hidden label: Conservação arquitectónica
broader: Conservação

Conservação etnográfica
type: Concept
in scheme: Tesauro SIPA
preferred label: Ethnographic conservation @en
preferred label: Conservation ethnographique @fr
preferred label: Conservazione etnografica @it
broader: Conservação

Conservação preventiva
type: Concept
in scheme: Tesauro SIPA
preferred label: Preventive conservation @en
preferred label: Conservation préventive @fr
preferred label: Conservazione preventiva @it
broader: Conservação

Conservação sustentável
type: Concept
in scheme: Tesauro SIPA
preferred label: Sustainable conservation @en
preferred label: Conservation durable @fr
preferred label: Conservazione sostenibile @it
broader: Conservação

História natural
type: Concept
in scheme: Tesauro SIPA
preferred label: Natural history @en
preferred label: Histoire naturelle @fr
preferred label: Storia naturale @it
broader: Áreas de conhecimento interdisplinares
narrower: Botânica
narrower: Zoologia

Botânica
type: Concept
scope note: Ramo de conhecimento que se dedica ao estudo das plantas, abrangendo diversos aspetos como a sua morfologia, fisiologia, ecologia e classificação.
in scheme: Tesauro SIPA
preferred label: Botany @en
preferred label: Botanique @fr
preferred label: Botanica @it
broader: História natural

Zoologia
type: Concept
scope note: Ramo de conhecimento que se dedica ao estudo dos animais.
in scheme: Tesauro SIPA
preferred label: Zoology @en
preferred label: Zoologie @fr
broader: História natural

Informática
type: Concept
in scheme: Tesauro SIPA
preferred label: Information technology; Computer science @en
preferred label: Informatique @fr
preferred label: Informatica @it
broader: Áreas de conhecimento interdisplinares

Ciências
type: Concept
in scheme: Tesauro SIPA
preferred label: Sciences @en
preferred label: Scienze @it
broader: Disciplinas e áreas de conhecimento
narrower: Aerodinâmica
narrower: Aeronáutica
narrower: Cartografia
narrower: Cibernética
narrower: Ciências ambientais
narrower: Ciências da saúde
narrower: Ciências naturais
narrower: Engenharia
narrower: Matemática

Aerodinâmica
type: Concept
in scheme: Tesauro SIPA
preferred label: Aerodynamics @en
preferred label: Aérodynamique @fr
preferred label: Aerodinamica @it
broader: Ciências
narrower: Aerotecnia

Aerotecnia
type: Concept
in scheme: Tesauro SIPA
preferred label: Aerospace engineering @en
preferred label: Aérotechnique @fr
broader: Aerodinâmica

Aeronáutica
type: Concept
in scheme: Tesauro SIPA
preferred label: Aeronautics @en
preferred label: Aéronautique @fr
preferred label: Aeronautica @it
broader: Ciências

Cartografia
type: Concept
scope note: Ciência e arte de desenhar, segundo determinados sistemas de projeção e uma escala, a totalidade ou partes da superfície terrestre num plano, ou seja, traçar cartas ou mapas geográficos em reprodução bidimensional ou até tridimensional.
in scheme: Tesauro SIPA
preferred label: Cartography @en
preferred label: Cartographie @fr
broader: Ciências

Cibernética
type: Concept
in scheme: Tesauro SIPA
preferred label: Cybernetics @en
preferred label: Cybernétique @fr
preferred label: Cibernetica @it
broader: Ciências

Ciências ambientais
type: Concept
in scheme: Tesauro SIPA
preferred label: Sciences de l'environnement @fr
preferred label: Scienze ambientali @it
preferred label: Environmental sciences @en
broader: Ciências
narrower: Ecologia
narrower: Silvicultura

Ecologia
type: Concept
in scheme: Tesauro SIPA
preferred label: Ecology @en
preferred label: Écologie @fr
broader: Ciências ambientais

Silvicultura
type: Concept
in scheme: Tesauro SIPA
preferred label: Silviculture @en
preferred label: Sylviculture @fr
preferred label: Selvicoltura @it
broader: Ciências ambientais

Ciências da saúde
type: Concept
in scheme: Tesauro SIPA
preferred label: Health sciences @en
preferred label: Sciences de la santé @fr
preferred label: Scienze della salute @it
broader: Ciências
narrower: Enfermagem
narrower: Farmácia
narrower: Medicina
narrower: Medicina dentária
narrower: Psicologia
narrower: Terapia ocupacional
narrower: Veterinária

Enfermagem
type: Concept
in scheme: Tesauro SIPA
preferred label: Nursing @en
preferred label: Soins infirmiers @fr
preferred label: Infermieristica @it
broader: Ciências da saúde

Farmácia
type: Concept
in scheme: Tesauro SIPA
preferred label: Pharmacy @en
preferred label: Pharmacie @fr
preferred label: Farmacia @it
broader: Ciências da saúde

Medicina
type: Concept
in scheme: Tesauro SIPA
preferred label: Medicine @en
preferred label: Médecine @fr
broader: Ciências da saúde
narrower: Estomatologia
narrower: Psiquiatria
narrower: Radiologia

Estomatologia
type: Concept
in scheme: Tesauro SIPA
preferred label: Stomatology @en
preferred label: Stomatologie @fr
preferred label: Stomatologia @it
broader: Medicina

Psiquiatria
type: Concept
in scheme: Tesauro SIPA
preferred label: Psychiatry @en
preferred label: Psychiatrie @fr
preferred label: Psichiatria @it
broader: Medicina

Radiologia
type: Concept
in scheme: Tesauro SIPA
preferred label: Radiology @en
preferred label: Radiologie @fr
broader: Medicina

Medicina dentária
type: Concept
in scheme: Tesauro SIPA
preferred label: Dentistry @en
preferred label: Médecine dentaire @fr
preferred label: Odontoiatria @it
broader: Ciências da saúde

Psicologia
type: Concept
in scheme: Tesauro SIPA
preferred label: Psychology @en
preferred label: Psychologie @fr
broader: Ciências da saúde

Terapia ocupacional
type: Concept
in scheme: Tesauro SIPA
preferred label: Occupational therapy @en
preferred label: Ergothérapie @fr
preferred label: Terapia occupazionale @it
broader: Ciências da saúde

Veterinária
type: Concept
in scheme: Tesauro SIPA
preferred label: Veterinary medicine @en
preferred label: Médecine vétérinaire @fr
preferred label: Medicina veterinaria @it
broader: Ciências da saúde

Ciências naturais
type: Concept
in scheme: Tesauro SIPA
preferred label: Natural sciences @en
preferred label: Sciences naturelles @fr
preferred label: Scienze naturali @it
broader: Ciências
narrower: Agricultura
narrower: Ciências biológicas
narrower: Ciências físicas

Agricultura
type: Concept
in scheme: Tesauro SIPA
preferred label: Agriculture @en
preferred label: Agricoltura @it
broader: Ciências naturais
narrower: Agronomia
narrower: Horticultura
narrower: Viticultura

Agronomia
type: Concept
in scheme: Tesauro SIPA
preferred label: Agronomy @en
preferred label: Agronomie @fr
broader: Agricultura

Horticultura
type: Concept
in scheme: Tesauro SIPA
preferred label: Horticulture @en
preferred label: Orticoltura @it
broader: Agricultura

Viticultura
type: Concept
in scheme: Tesauro SIPA
preferred label: Viticulture @en
preferred label: Viticoltura @it
broader: Agricultura

Ciências biológicas
type: Concept
in scheme: Tesauro SIPA
preferred label: Biological sciences @en
preferred label: Sciences biologiques @fr
preferred label: Scienze biologiche @it
broader: Ciências naturais
narrower: Anatomia
narrower: Biologia
narrower: Botânica
narrower: Engenharia genética
narrower: Paleontologia
narrower: Patologia

Anatomia
type: Concept
in scheme: Tesauro SIPA
preferred label: Anatomy @en
preferred label: Anatomie @fr
broader: Ciências biológicas
narrower: Anatomia patológica

Anatomia patológica
type: Concept
in scheme: Tesauro SIPA
preferred label: Pathological anatomy @en
preferred label: Anatomie pathologique @fr
preferred label: Anatomia patologica @it
broader: Anatomia

Biologia
type: Concept
in scheme: Tesauro SIPA
preferred label: Biology @en
preferred label: Biologie @fr
broader: Ciências biológicas
narrower: Antropometria
narrower: Biologia marinha
narrower: Biologia molecular
narrower: Microbiologia

Antropometria
type: Concept
in scheme: Tesauro SIPA
preferred label: Anthropometry @en
preferred label: Anthropométrie @fr
broader: Biologia

Biologia marinha
type: Concept
in scheme: Tesauro SIPA
preferred label: Marine biology @en
preferred label: Biologie marine @fr
preferred label: Biologia marina @it
broader: Biologia

Biologia molecular
type: Concept
in scheme: Tesauro SIPA
preferred label: Molecular biology @en
preferred label: Biologie moléculaire @fr
preferred label: Biologia molecolare @it
broader: Biologia

Microbiologia
type: Concept
in scheme: Tesauro SIPA
preferred label: Microbiology @en
preferred label: Microbiologie @fr
broader: Biologia

Botânica
type: Concept
in scheme: Tesauro SIPA
preferred label: Botany @en
preferred label: Botanique @fr
preferred label: Botanica @it
broader: Ciências biológicas
narrower: Carpologia

Carpologia
type: Concept
in scheme: Tesauro SIPA
preferred label: Carpology @en
preferred label: Carpologie @fr
broader: Botânica

Engenharia genética
type: Concept
in scheme: Tesauro SIPA
preferred label: Bioengineering @en
preferred label: Bioingénierie @fr
preferred label: Bioingegneria @it
broader: Ciências biológicas

Paleontologia
type: Concept
in scheme: Tesauro SIPA
preferred label: Paleontology @en
preferred label: Paléontologie @fr
broader: Ciências biológicas

Patologia
type: Concept
in scheme: Tesauro SIPA
preferred label: Pathology @en
preferred label: Pathologie @fr
broader: Ciências biológicas

Ciências físicas
type: Concept
in scheme: Tesauro SIPA
preferred label: Physical sciences @en
preferred label: Sciences physiques @fr
preferred label: Scienze fisiche @it
broader: Ciências naturais
narrower: Astronomia
narrower: Física
narrower: Química
narrower: Ciências da terra
narrower: Cosmografia

Astronomia
type: Concept
in scheme: Tesauro SIPA
preferred label: Astronomy @en
preferred label: Astronomie @fr
broader: Ciências físicas
narrower: Astrofísica

Astrofísica
type: Concept
in scheme: Tesauro SIPA
preferred label: Astrophysics @en
preferred label: Astrophysique @fr
preferred label: Astrofisica @it
broader: Astronomia

Física
type: Concept
in scheme: Tesauro SIPA
preferred label: Physics @en
preferred label: Physique @fr
preferred label: Fisica @it
broader: Ciências físicas
narrower: Acústica
narrower: Biofísica
narrower: Eletrónica
narrower: Geofísica
narrower: Óptica

Acústica
type: Concept
in scheme: Tesauro SIPA
preferred label: Acoustics @en
preferred label: Acoustique @fr
preferred label: Acustica @it
broader: Física

Biofísica
type: Concept
in scheme: Tesauro SIPA
preferred label: Biophysics @en
preferred label: Biophysique @fr
preferred label: Biofisica @it
broader: Física

Eletrónica
type: Concept
in scheme: Tesauro SIPA
preferred label: Eletronics @en
preferred label: Électronique @fr
preferred label: Elettronica @it
broader: Física

Geofísica
type: Concept
in scheme: Tesauro SIPA
preferred label: Geophysics @en
preferred label: Géophysique @fr
preferred label: Geofisica @it
broader: Física

Óptica
type: Concept
in scheme: Tesauro SIPA
preferred label: Optics @en
preferred label: Optique @fr
preferred label: Ottica @it
broader: Física

Química
type: Concept
in scheme: Tesauro SIPA
preferred label: Chemistry @en
preferred label: Chimie @fr
preferred label: Chimica @it
broader: Ciências físicas
narrower: Farmocologia

Farmocologia
type: Concept
in scheme: Tesauro SIPA
preferred label: Pharmocology @en
preferred label: Pharmocologie @fr
broader: Química

Ciências da terra
type: Concept
in scheme: Tesauro SIPA
preferred label: Earth sciences @en
preferred label: Sciences de la terre @fr
preferred label: Scienze della Terra @it
broader: Ciências físicas
narrower: Geobiologia
narrower: Geologia
narrower: Hidrologia
narrower: Meteorologia
narrower: Mineralogia
narrower: Oceanografia

Geobiologia
type: Concept
in scheme: Tesauro SIPA
preferred label: Geobiology @en
preferred label: Géobiologie @fr
broader: Ciências da terra

Geologia
type: Concept
in scheme: Tesauro SIPA
preferred label: Geology @en
preferred label: Géologie @fr
broader: Ciências da terra
narrower: Biogeofísica

Biogeofísica
type: Concept
in scheme: Tesauro SIPA
preferred label: Biogeophysics @en
preferred label: Biogéophysique @fr
preferred label: Biogeofisica @it
broader: Geologia

Hidrologia
type: Concept
in scheme: Tesauro SIPA
preferred label: Hudrology @en
preferred label: Hudrologie @fr
preferred label: Hudrologia @it
broader: Ciências da terra

Meteorologia
type: Concept
in scheme: Tesauro SIPA
preferred label: Meteorology @en
preferred label: Météorologie @fr
broader: Ciências da terra

Mineralogia
type: Concept
in scheme: Tesauro SIPA
preferred label: Mineralogy @en
preferred label: Minéralogie @fr
broader: Ciências da terra

Oceanografia
type: Concept
in scheme: Tesauro SIPA
preferred label: Oceanography @en
preferred label: Océanographie @fr
broader: Ciências da terra

Cosmografia
type: Concept
in scheme: Tesauro SIPA
preferred label: Cosmography @en
preferred label: Cosmographie @fr
broader: Ciências físicas

Engenharia
type: Concept
in scheme: Tesauro SIPA
preferred label: Engineering @en
preferred label: Ingénierie @fr
preferred label: Ingegneria @it
broader: Ciências
narrower: Engenharia civil
narrower: Engenharia de sistemas
narrower: Engenharia eletrotécnica
narrower: Engenharia industrial
narrower: Engenharia informática
narrower: Engenharia mecânica
narrower: Engenharia militar
narrower: Engenharia química
narrower: Robótica

Engenharia civil
type: Concept
in scheme: Tesauro SIPA
preferred label: Civil engineering @en
preferred label: Ingénierie civile @fr
preferred label: Ingegneria civile @it
broader: Engenharia
narrower: Engenharia do ambiente
narrower: Engenharia hidráulica

Engenharia do ambiente
type: Concept
in scheme: Tesauro SIPA
preferred label: Environmental engineering @en
preferred label: Ingénierie environnementale @fr
preferred label: Ingegneria ambientale @it
broader: Engenharia civil

Engenharia hidráulica
type: Concept
in scheme: Tesauro SIPA
preferred label: Hydraulic engineering @en
preferred label: Ingénierie hydraulique @fr
preferred label: Ingegneria idraulica @it
broader: Engenharia civil

Engenharia de sistemas
type: Concept
in scheme: Tesauro SIPA
preferred label: Systems engineering @en
preferred label: Ingénierie des systèmes @fr
preferred label: Ingegneria dei sistemi @it
broader: Engenharia

Engenharia eletrotécnica
type: Concept
in scheme: Tesauro SIPA
preferred label: Eletric engineering @en
preferred label: Ingénierie électrique @fr
preferred label: Ingegneria elettrica @it
hidden label: Engenharia electrotécnica
broader: Engenharia

Engenharia industrial
type: Concept
in scheme: Tesauro SIPA
preferred label: Industrial engineering @en
preferred label: Ingénierie industrielle @fr
preferred label: Ingegneria industriale @it
broader: Engenharia

Engenharia informática
type: Concept
in scheme: Tesauro SIPA
preferred label: Computer-aided engineering @en
preferred label: Ingénierie assistée par ordinateur @fr
preferred label: Ingegneria informatica @it
broader: Engenharia

Engenharia mecânica
type: Concept
in scheme: Tesauro SIPA
preferred label: Mechanical engineering @en
preferred label: Ingénierie mécanique @fr
preferred label: Ingegneria meccanica @it
broader: Engenharia

Engenharia militar
type: Concept
in scheme: Tesauro SIPA
preferred label: Militar engineering @en
preferred label: Ingénierie militaire @fr
preferred label: Ingegneria militare @it
broader: Engenharia

Engenharia química
type: Concept
in scheme: Tesauro SIPA
preferred label: Chemical engineering @en
preferred label: Ingénierie chimique @fr
preferred label: Ingegneria chimica @it
broader: Engenharia

Robótica
type: Concept
in scheme: Tesauro SIPA
preferred label: Robotics @en
preferred label: Robotique @fr
preferred label: Robotica @it
broader: Engenharia

Matemática
type: Concept
in scheme: Tesauro SIPA
preferred label: Mathematics @en
preferred label: Mathématiques @fr
preferred label: Matematica @it
broader: Ciências
narrower: Álgebra
narrower: Artimética
narrower: Estatística
narrower: Geometria
narrower: Trigonometria

Álgebra
type: Concept
in scheme: Tesauro SIPA
preferred label: Algebra @en
broader: Matemática

Artimética
type: Concept
in scheme: Tesauro SIPA
preferred label: Arithmetic @en
preferred label: Arithmétique @fr
preferred label: Aritmetica @it
broader: Matemática

Estatística
type: Concept
in scheme: Tesauro SIPA
preferred label: Statistics @en
preferred label: Statistiques @fr
preferred label: Statistica @it
broader: Matemática

Geometria
type: Concept
in scheme: Tesauro SIPA
preferred label: Geometry @en
preferred label: Géométrie @fr
broader: Matemática

Trigonometria
type: Concept
in scheme: Tesauro SIPA
preferred label: Trigonometry @en
preferred label: Trigonométrie @fr
broader: Matemática

Ciências ocultas
type: Concept
in scheme: Tesauro SIPA
preferred label: Hidden sciences @en
preferred label: Sciences occultes @fr
preferred label: Scienze occulte @it
broader: Disciplinas e áreas de conhecimento
narrower: Adivinhação
narrower: Alquimia
narrower: Astrologia
narrower: Cabala
narrower: Geometria sagrada
narrower: Gnose
narrower: Hermetismo
narrower: Magia
narrower: Numerologia
narrower: Ocultismo

Adivinhação
type: Concept
in scheme: Tesauro SIPA
preferred label: Foretelling @en
preferred label: Divination @fr
preferred label: Divinazione @it
broader: Ciências ocultas

Alquimia
type: Concept
in scheme: Tesauro SIPA
preferred label: Alchemy @en
preferred label: Alchimie @fr
preferred label: Alchimia @it
broader: Ciências ocultas

Astrologia
type: Concept
in scheme: Tesauro SIPA
preferred label: Astrology @en
preferred label: Astrologie @fr
broader: Ciências ocultas

Cabala
type: Concept
in scheme: Tesauro SIPA
preferred label: Kabbalah @en
preferred label: Kabbale @fr
broader: Ciências ocultas

Geometria sagrada
type: Concept
in scheme: Tesauro SIPA
preferred label: Sacred Geometry @en
preferred label: Géométrie sacrée @fr
preferred label: Geometria sacra @it
broader: Ciências ocultas

Gnose
type: Concept
in scheme: Tesauro SIPA
preferred label: Gnosis @en
preferred label: Gnosi @it
broader: Ciências ocultas

Hermetismo
type: Concept
in scheme: Tesauro SIPA
preferred label: Hermeticism @en
preferred label: Hermétisme @fr
preferred label: Ermetismo @it
broader: Ciências ocultas

Magia
type: Concept
in scheme: Tesauro SIPA
preferred label: Magic @en
preferred label: Magie @fr
broader: Ciências ocultas
narrower: Bruxaria
narrower: Feitiçaria

Bruxaria
type: Concept
in scheme: Tesauro SIPA
preferred label: Witchcraft @en
broader: Magia

Feitiçaria
type: Concept
in scheme: Tesauro SIPA
preferred label: Sorcery @en
preferred label: Sorcellerie @fr
preferred label: Stregoneria @it
broader: Magia

Numerologia
type: Concept
in scheme: Tesauro SIPA
preferred label: Numerology @en
preferred label: Numérologie @fr
broader: Ciências ocultas

Ocultismo
type: Concept
in scheme: Tesauro SIPA
preferred label: Occultism @en
preferred label: Occulte @fr
preferred label: Occulto @it
broader: Ciências ocultas

Ciências sociais
type: Concept
in scheme: Tesauro SIPA
preferred label: Social sciences @en
preferred label: Sciences sociales @fr
preferred label: Scienze sociali @it
broader: Disciplinas e áreas de conhecimento
narrower: Arqueologia
narrower: Ciências da educação
narrower: Ciências do comportamento
narrower: Ciências documentais
narrower: Ciências políticas
narrower: Comunicação
narrower: Criminologia
narrower: Demografia
narrower: Direito
narrower: Disciplinas culturais
narrower: Disciplinas de planeamento
narrower: Economia
narrower: Geografia
narrower: História
narrower: Urbanismo

Arqueologia
type: Concept
in scheme: Tesauro SIPA
preferred label: Archaeology @en
preferred label: Archéologie @fr
preferred label: Archeologia @it
broader: Ciências sociais
narrower: Arqueobotânica
narrower: Arqueociência
narrower: Arqueofísica
narrower: Arqueogeografia
narrower: Arqueologia da arquitetura
narrower: Arqueologia espacial
narrower: Arqueologia funerária
narrower: Arqueologia histórica
narrower: Arqueologia industrial
narrower: Arqueologia náutica e subaquática
narrower: Arqueometalurgia
narrower: Arqueometria
narrower: Arqueozoologia

Arqueobotânica
type: Concept
in scheme: Tesauro SIPA
preferred label: Archaeobotany @en
preferred label: Archéobotanique @fr
preferred label: Archeobotanica @it
broader: Arqueologia

Arqueociência
type: Concept
in scheme: Tesauro SIPA
preferred label: Archaeoscience @en
preferred label: Archéoscience @fr
preferred label: Archeoscienza @it
alternative label: Arqueologia científica
broader: Arqueologia

Arqueofísica
type: Concept
in scheme: Tesauro SIPA
preferred label: Archaeophysics @en
preferred label: Archéophysique @fr
preferred label: Archeofisica @it
broader: Arqueologia

Arqueogeografia
type: Concept
in scheme: Tesauro SIPA
preferred label: Archaeogeography @en
preferred label: Archéogéographie @fr
preferred label: Archeogeografia @it
broader: Arqueologia

Arqueologia da arquitetura
type: Concept
in scheme: Tesauro SIPA
preferred label: Architectural archaeology @en
preferred label: Archéologie de l'architecture @fr
preferred label: Archeologia dell'architettura @it
alternative label: Arqueologia arquitetónica
hidden label: Arqueologia da arquitectura
broader: Arqueologia

Arqueologia espacial
type: Concept
in scheme: Tesauro SIPA
preferred label: Spatial archaeology @en
preferred label: Archéologie spatiale @fr
preferred label: Archeologia spaziale @it
broader: Arqueologia

Arqueologia funerária
type: Concept
in scheme: Tesauro SIPA
preferred label: Funerary archaeology @en
preferred label: Archéologie funéraire @fr
preferred label: Archeologia funeraria @it
alternative label: Arqueotanatologia
broader: Arqueologia

Arqueologia histórica
type: Concept
in scheme: Tesauro SIPA
preferred label: Historical archaeology @en
preferred label: Archéologie historique @fr
preferred label: Archeologia storica @it
broader: Arqueologia

Arqueologia industrial
type: Concept
in scheme: Tesauro SIPA
preferred label: Industrial archaeology @en
preferred label: Archéologie industrielle @fr
preferred label: Archeologia industriale @it
broader: Arqueologia

Arqueologia náutica e subaquática
type: Concept
in scheme: Tesauro SIPA
preferred label: Nautical and underwater archaeology @en
preferred label: Archéologie nautique et subaquatique @fr
preferred label: Archeologia nautica e subacquea @it
broader: Arqueologia

Arqueometalurgia
type: Concept
in scheme: Tesauro SIPA
preferred label: Archaeometallurgy @en
preferred label: Archéométallurgie @fr
preferred label: Archeometallurgia @it
broader: Arqueologia

Arqueometria
type: Concept
in scheme: Tesauro SIPA
preferred label: Archaeometry @en
preferred label: Archéométrie @fr
preferred label: Archeometria @it
broader: Arqueologia

Arqueozoologia
type: Concept
in scheme: Tesauro SIPA
preferred label: Archaeozoology @en
preferred label: Archéozoologie @fr
preferred label: Archeozoologia @it
broader: Arqueologia

Ciências da educação
type: Concept
in scheme: Tesauro SIPA
preferred label: Education sciences @en
preferred label: Sciences de l'éducation @fr
preferred label: Scienze dell'educazione @it
broader: Ciências sociais

Ciências do comportamento
type: Concept
in scheme: Tesauro SIPA
preferred label: Behavioral sciences @en
preferred label: Sciences du comportement @fr
preferred label: Scienze del comportamento @it
broader: Ciências sociais
narrower: Antropologia
narrower: Sociologia

Antropologia
type: Concept
in scheme: Tesauro SIPA
preferred label: Anthropology @en
preferred label: Anthropologie @fr
broader: Ciências do comportamento
narrower: Antropologia aplicada
narrower: Antropologia comparada
narrower: Antropologia cultural
narrower: Antropologia da arte
narrower: Antropologia da comunicação
narrower: Antropologia da educação
narrower: Antropologia da família
narrower: Antropologia da informação
narrower: Antropologia da morte
narrower: Antropologia da religião
narrower: Antropologia da saúde
narrower: Antropologia de género
narrower: Antropologia do conhecimento
narrower: Antropologia do consumo
narrower: Antropologia do desenvolvimento
narrower: Antropologia do desporto
narrower: Antropologia do simbólico
narrower: Antropologia do trabalho
narrower: Antropologia empresarial
narrower: Antropologia física
narrower: Antropologia forense
narrower: Antropologia funerária
narrower: Antropologia industrial
narrower: Antropologia marítima
narrower: Antropologia médica
narrower: Antropologia política
narrower: Antropologia religiosa
narrower: Antropologia rural
narrower: Antropologia teatral
narrower: Antropologia urbana
narrower: Antropologia visual
narrower: Antropossociologia
narrower: Etnologia
narrower: Paleontologia humana

Antropologia aplicada
type: Concept
in scheme: Tesauro SIPA
preferred label: Applied anthropology @en
preferred label: Anthropologie appliquée @fr
preferred label: Antropologia applicata @it
broader: Antropologia

Antropologia comparada
type: Concept
in scheme: Tesauro SIPA
preferred label: Comparative anthropology @en
preferred label: Anthropologie comparée @fr
preferred label: Antropologia comparata @it
broader: Antropologia

Antropologia cultural
type: Concept
in scheme: Tesauro SIPA
preferred label: Cultural anthropology @en
preferred label: Anthropologie culturelle @fr
preferred label: Antropologia culturale @it
alternative label: Antropologia social
alternative label: Antropologia social e cultural
broader: Antropologia

Antropologia da arte
type: Concept
in scheme: Tesauro SIPA
preferred label: Anthroplology of arts @en
preferred label: Anthropologie de l'art @fr
preferred label: Antropologia dell'arte @it
broader: Antropologia

Antropologia da comunicação
type: Concept
in scheme: Tesauro SIPA
preferred label: Anthropology of communication @en
preferred label: Anthropologie de la communication @fr
preferred label: Antropologia della comunicazione @it
broader: Antropologia

Antropologia da educação
type: Concept
in scheme: Tesauro SIPA
preferred label: Anthropology of education @en
preferred label: Anthropologie de l'éducation @fr
preferred label: Antropologia dell'educazione @it
broader: Antropologia

Antropologia da família
type: Concept
in scheme: Tesauro SIPA
preferred label: Anthropology of family @en
preferred label: Anthropologie de la famille @fr
preferred label: Antropologia della famiglia @it
broader: Antropologia

Antropologia da informação
type: Concept
in scheme: Tesauro SIPA
preferred label: Anthropology of information @en
preferred label: Anthropologie de l'information @fr
preferred label: Antropologia dell'informazione @it
broader: Antropologia

Antropologia da morte
type: Concept
in scheme: Tesauro SIPA
preferred label: Anthropology of death @en
preferred label: Anthropologie de la mort @fr
preferred label: Antropologia della morte @it
broader: Antropologia

Antropologia da religião
type: Concept
in scheme: Tesauro SIPA
preferred label: Anthropology of religion @en
preferred label: Anthropologie de la religion @fr
preferred label: Antropologia della religione @it
broader: Antropologia

Antropologia da saúde
type: Concept
in scheme: Tesauro SIPA
preferred label: Anthropology of health @en
preferred label: Anthropologie de la santé @fr
preferred label: Antropologia della salute @it
broader: Antropologia

Antropologia de género
type: Concept
in scheme: Tesauro SIPA
preferred label: Anthropology of gender @en
preferred label: Anthropologie du genre @fr
preferred label: Antropologia di genere @it
broader: Antropologia

Antropologia do conhecimento
type: Concept
in scheme: Tesauro SIPA
preferred label: Anthropology of knowledge @en
preferred label: Anthropologie de la connaissance @fr
preferred label: Antropologia della conoscenza @it
broader: Antropologia

Antropologia do consumo
type: Concept
in scheme: Tesauro SIPA
preferred label: Consumer anthropology @en
preferred label: Anthropologie de la consommation @fr
preferred label: Antropologia del consumo @it
broader: Antropologia

Antropologia do desenvolvimento
type: Concept
in scheme: Tesauro SIPA
preferred label: Anthropology of development @en
preferred label: Anthropologie du développement @fr
preferred label: Antropologia dello sviluppo @it
broader: Antropologia

Antropologia do desporto
type: Concept
in scheme: Tesauro SIPA
preferred label: Anthropology of sports @en
preferred label: Anthropologie du sport @fr
preferred label: Antropologia dello sport @it
broader: Antropologia

Antropologia do simbólico
type: Concept
in scheme: Tesauro SIPA
preferred label: Anthropology of the symbolic @en
preferred label: Anthropologie du symbolique @fr
preferred label: Antropologia del simbolico @it
broader: Antropologia

Antropologia do trabalho
type: Concept
in scheme: Tesauro SIPA
preferred label: Anthropology of work @en
preferred label: Anthropologie du travail @fr
preferred label: Antropologia del lavoro @it
broader: Antropologia

Antropologia empresarial
type: Concept
in scheme: Tesauro SIPA
preferred label: Business anthropology @en
preferred label: Anthropologie entrepreneuriale @fr
preferred label: Antropologia aziendale @it
broader: Antropologia

Antropologia física
type: Concept
in scheme: Tesauro SIPA
preferred label: Physical anthropology @en
preferred label: Anthropologie physique @fr
preferred label: Antropologia fisica @it
alternative label: Antropobiologia
alternative label: Antropologia biológica
broader: Antropologia

Antropologia forense
type: Concept
in scheme: Tesauro SIPA
preferred label: Forensic anthropology @en
preferred label: Anthropologie médico-légale @fr
broader: Antropologia

Antropologia funerária
type: Concept
in scheme: Tesauro SIPA
preferred label: Funerary anthropology @en
preferred label: Anthropologie funéraire @fr
preferred label: Antropologia funeraria @it
broader: Antropologia

Antropologia industrial
type: Concept
in scheme: Tesauro SIPA
preferred label: Industrial anthropology @en
preferred label: Anthropologie industrielle @fr
preferred label: Antropologia industriale @it
broader: Antropologia

Antropologia marítima
type: Concept
in scheme: Tesauro SIPA
preferred label: Maritime anthropology @en
preferred label: Anthropologie maritime @fr
preferred label: Antropologia marittima @it
broader: Antropologia

Antropologia médica
type: Concept
in scheme: Tesauro SIPA
preferred label: Medical anthropology @en
preferred label: Anthropologie médicale @fr
preferred label: Antropologia medica @it
broader: Antropologia

Antropologia política
type: Concept
in scheme: Tesauro SIPA
preferred label: Anthropology of politics @en
preferred label: Anthropologie politique @fr
preferred label: Antropologia politica @it
broader: Antropologia

Antropologia religiosa
type: Concept
in scheme: Tesauro SIPA
preferred label: Anthropology of religions @en
preferred label: Anthropologie religieuse @fr
broader: Antropologia

Antropologia rural
type: Concept
in scheme: Tesauro SIPA
preferred label: Rural anthropology @en
preferred label: Anthropologie rurale @fr
preferred label: Antropologia rurale @it
broader: Antropologia

Antropologia teatral
type: Concept
in scheme: Tesauro SIPA
preferred label: Anthropology of theater @en
preferred label: Anthropologie théâtrale @fr
preferred label: Antropologia teatrale @it
broader: Antropologia

Antropologia urbana
type: Concept
in scheme: Tesauro SIPA
preferred label: Urban anthropology @en
preferred label: Anthropologie urbaine @fr
broader: Antropologia

Antropologia visual
type: Concept
in scheme: Tesauro SIPA
preferred label: Visual anthropology @en
preferred label: Anthropologie visuelle @fr
preferred label: Antropologia visiva @it
broader: Antropologia

Antropossociologia
type: Concept
in scheme: Tesauro SIPA
preferred label: Anthroposociology @en
preferred label: Anthroposociologie @fr
preferred label: Antroposociologia @it
broader: Antropologia

Etnologia
type: Concept
in scheme: Tesauro SIPA
preferred label: Ethnology @en
preferred label: Ethnologie @fr
broader: Antropologia

Paleontologia humana
type: Concept
in scheme: Tesauro SIPA
preferred label: Human palaeontology @en
preferred label: Paléontologie humaine @fr
preferred label: Paleontologia umana @it
broader: Antropologia

Sociologia
type: Concept
in scheme: Tesauro SIPA
preferred label: Sociology @en
preferred label: Sociologie @fr
broader: Ciências do comportamento

Ciências documentais
type: Concept
in scheme: Tesauro SIPA
preferred label: Documentary science @en
preferred label: Science documentaire @fr
preferred label: Scienza documentaria @it
broader: Ciências sociais
narrower: Arquivística
narrower: Biblioteconomia

Arquivística
type: Concept
in scheme: Tesauro SIPA
preferred label: Archival science @en
preferred label: Archivistique @fr
preferred label: Archivistica @it
broader: Ciências documentais

Biblioteconomia
type: Concept
in scheme: Tesauro SIPA
preferred label: Library science @en
preferred label: Bibliothéconomie @fr
broader: Ciências documentais

Ciências políticas
type: Concept
in scheme: Tesauro SIPA
preferred label: Sciences politiques @fr
preferred label: Political sciences @en
preferred label: Scienzes politiche @it
broader: Ciências sociais
narrower: Administração pública
narrower: Geopolítica

Administração pública
type: Concept
in scheme: Tesauro SIPA
preferred label: Administration publique @fr
preferred label: Amministrazione pubblica @it
preferred label: Public administration @en
broader: Ciências políticas

Geopolítica
type: Concept
in scheme: Tesauro SIPA
preferred label: Geopolitics @en
preferred label: Géopolitique @fr
preferred label: Geopolitica @it
broader: Ciências políticas

Comunicação
type: Concept
in scheme: Tesauro SIPA
preferred label: Communication @en
preferred label: Comunicazione @it
broader: Ciências sociais
narrower: Jornalismo
narrower: Publicidade
narrower: Relações públicas

Jornalismo
type: Concept
in scheme: Tesauro SIPA
preferred label: Journalism @en
preferred label: Journalisme @fr
preferred label: Giornalismo @it
broader: Comunicação
narrower: Fotojornalismo

Fotojornalismo
type: Concept
in scheme: Tesauro SIPA
preferred label: Photojournalism @en
preferred label: Photojournalisme @fr
preferred label: Fotogiornalismo @it
broader: Jornalismo

Publicidade
type: Concept
in scheme: Tesauro SIPA
preferred label: Advertising @en
preferred label: Publicité @fr
preferred label: Pubblicità @it
broader: Comunicação

Relações públicas
type: Concept
in scheme: Tesauro SIPA
preferred label: Public relations @en
preferred label: Relations publiques @fr
preferred label: Relazioni pubbliche @it
broader: Comunicação

Criminologia
type: Concept
in scheme: Tesauro SIPA
preferred label: Criminology @en
preferred label: Criminologie @fr
broader: Ciências sociais

Demografia
type: Concept
in scheme: Tesauro SIPA
preferred label: Demography @en
preferred label: Démographie @fr
broader: Ciências sociais

Direito
type: Concept
in scheme: Tesauro SIPA
preferred label: Law @en
preferred label: Droit @fr
preferred label: Giurisprudenza (Diritto) @it
broader: Ciências sociais
narrower: Direito ambiental
narrower: Direito criminal
narrower: Direito internacional

Direito ambiental
type: Concept
in scheme: Tesauro SIPA
preferred label: Environmental law @en
preferred label: Droit de l'environnement @fr
preferred label: Diritto ambientale @it
broader: Direito

Direito criminal
type: Concept
in scheme: Tesauro SIPA
preferred label: Criminal law @en
preferred label: Droit pénal @fr
preferred label: Diritto penale @it
broader: Direito

Direito internacional
type: Concept
in scheme: Tesauro SIPA
preferred label: International law @en
preferred label: Droit international @fr
preferred label: Diritto internazionale @it
broader: Direito

Disciplinas culturais
type: Concept
in scheme: Tesauro SIPA
preferred label: Cultural disciplines @en
preferred label: Disciplines culturelles @fr
preferred label: Discipline culturali @it
broader: Ciências sociais
narrower: Folclore

Folclore
type: Concept
in scheme: Tesauro SIPA
preferred label: Folklore @en
broader: Disciplinas culturais

Disciplinas de planeamento
type: Concept
in scheme: Tesauro SIPA
preferred label: Planning disciplines @en
preferred label: Disciplines de planification @fr
preferred label: Discipline della pianificazione @it
broader: Ciências sociais
narrower: Ordenamento do território

Ordenamento do território
type: Concept
in scheme: Tesauro SIPA
preferred label: Town and country planning @en
preferred label: Aménagement du territoire @fr
preferred label: Pianificazione territoriale @it
broader: Disciplinas de planeamento
narrower: Planeamento rural
narrower: Planeamento urbano

Planeamento rural
type: Concept
in scheme: Tesauro SIPA
preferred label: Rural planning @en
preferred label: Aménagement rural @fr
preferred label: Pianificazione rurale @it
broader: Ordenamento do território

Planeamento urbano
type: Concept
in scheme: Tesauro SIPA
preferred label: Urban planning @en
preferred label: Aménagement urbain @fr
preferred label: Pianificazione urbana @it
broader: Ordenamento do território

Economia
type: Concept
in scheme: Tesauro SIPA
preferred label: Economics @en
preferred label: Économie @fr
broader: Ciências sociais
narrower: Finanças
narrower: Finanças públicas

Finanças
type: Concept
in scheme: Tesauro SIPA
preferred label: Finance @en
preferred label: Finances @fr
preferred label: Finanza @it
broader: Economia

Finanças públicas
type: Concept
in scheme: Tesauro SIPA
preferred label: Public finance @en
preferred label: Finances publiques @fr
preferred label: Finanza pubblica @it
broader: Economia

Geografia
type: Concept
in scheme: Tesauro SIPA
preferred label: Geography @en
preferred label: Géographie @fr
broader: Ciências sociais
narrower: Altimetria
narrower: Biogeografia

Altimetria
type: Concept
in scheme: Tesauro SIPA
preferred label: Altimetry @en
preferred label: Altimétrie @fr
broader: Geografia

Biogeografia
type: Concept
in scheme: Tesauro SIPA
preferred label: Biogeography @en
preferred label: Biogéographie @fr
broader: Geografia

História
type: Concept
in scheme: Tesauro SIPA
preferred label: History @en
preferred label: Histoire @fr
preferred label: Storia @it
broader: Ciências sociais
narrower: História da Arquitetura
narrower: História da Arte

História da Arquitetura
type: Concept
in scheme: Tesauro SIPA
preferred label: Architectural history @en
preferred label: Histoire de l'architecture @fr
preferred label: Storia dell'architettura @it
hidden label: História da Arquitectura
broader: História

História da Arte
type: Concept
in scheme: Tesauro SIPA
preferred label: Art history @en
preferred label: Histoire de l'art @fr
preferred label: Storia dell'arte @it
broader: História
narrower: Iconografia
narrower: Iconologia

Iconografia
type: Concept
scope note: Área de conhecimento que identifica e classifica os temas de uma obra de arte.
in scheme: Tesauro SIPA
preferred label: Iconography @en
preferred label: Iconographie @fr
broader: História da Arte

Iconologia
type: Concept
scope note: Área de conhecimento que descreve e classifica os temas de uma obra de arte, investigando o seu significado enquanto documentos culturais de um gosto, uma época ou uma conjuntura socioeconómica, política e cultural.
in scheme: Tesauro SIPA
preferred label: Iconology @en
preferred label: Iconologie @fr
broader: História da Arte

Urbanismo
type: Concept
in scheme: Tesauro SIPA
preferred label: Urbanism @en
preferred label: Urbanisme @fr
preferred label: Urbanistica @it
broader: Ciências sociais

Humanidades
type: Concept
in scheme: Tesauro SIPA
preferred label: Humanities @en
preferred label: Humanités @fr
broader: Disciplinas e áreas de conhecimento
narrower: Artes
narrower: Filosofia
narrower: Linguística
narrower: Literatura
narrower: Museologia
narrower: Religião
narrower: Retórica

Artes
type: Concept
in scheme: Tesauro SIPA
preferred label: Arts @en
preferred label: Arti @it
broader: Humanidades
narrower: Artes performativas
narrower: Artes visuais

Artes performativas
type: Concept
in scheme: Tesauro SIPA
preferred label: Performing arts @en
preferred label: Arts du spectacle @fr
preferred label: Arti dello spettacolo @it
broader: Artes
narrower: Arte equestre
narrower: Cinema
narrower: Circo
narrower: Dança (Artes performativas)
narrower: Música
narrower: Teatro (Arte cénica)

Arte equestre
type: Concept
in scheme: Tesauro SIPA
preferred label: Equestrian art @en
preferred label: Art équestre @fr
broader: Artes performativas

Cinema
type: Concept
in scheme: Tesauro SIPA
preferred label: Cinéma @fr
broader: Artes performativas
narrower: Cinema segundo a sonoridade
narrower: Cinema segundo o tipo

Cinema segundo a sonoridade
type: Concept
in scheme: Tesauro SIPA
preferred label: Cinema according to sound @en
preferred label: Cinéma selon le son @fr
preferred label: Cinema secondo il suono @it
broader: Cinema
narrower: Cinema mudo
narrower: Cinema sonoro

Cinema mudo
type: Concept
in scheme: Tesauro SIPA
preferred label: Silent movie @en
preferred label: Cinéma muet @fr
preferred label: Cinema muto @it
broader: Cinema segundo a sonoridade

Cinema sonoro
type: Concept
in scheme: Tesauro SIPA
preferred label: Sound movie (Talking picture) @en
preferred label: Cinéma sonore @fr
broader: Cinema segundo a sonoridade

Cinema segundo o tipo
type: Concept
in scheme: Tesauro SIPA
preferred label: Cinema according to type @en
preferred label: Cinéma par type @fr
preferred label: Cinema per tipologia @it
broader: Cinema
narrower: Cinema de animação

Cinema de animação
type: Concept
in scheme: Tesauro SIPA
preferred label: Animation cinema @en
preferred label: Cinéma d'animation @fr
preferred label: Cinema d'animazione @it
broader: Cinema segundo o tipo

Circo
type: Concept
in scheme: Tesauro SIPA
preferred label: Circus @en
preferred label: Cirque @fr
broader: Artes performativas

Dança (Artes performativas)
type: Concept
in scheme: Tesauro SIPA
preferred label: Dance (Performing arts) @en
preferred label: Danse (Arts du spectacle) @fr
preferred label: Danza (Arti performative) @it
broader: Artes performativas
narrower: Ballet

Ballet
type: Concept
in scheme: Tesauro SIPA
preferred label: Balletto @it
broader: Dança (Artes performativas)
narrower: Ballet clássico
narrower: Ballet romântico

Ballet clássico
type: Concept
in scheme: Tesauro SIPA
preferred label: Classic ballet @en
preferred label: Ballet classique @fr
preferred label: Balletto classico @it
broader: Ballet

Ballet romântico
type: Concept
in scheme: Tesauro SIPA
preferred label: Romantic ballet @en
preferred label: Ballet romantique @fr
preferred label: Balletto romantico @it
broader: Ballet

Música
type: Concept
in scheme: Tesauro SIPA
preferred label: Music @en
preferred label: Musique @fr
preferred label: Musica @it
broader: Artes performativas
narrower: Música segundo o género

Música segundo o género
type: Concept
in scheme: Tesauro SIPA
preferred label: Music by genre @en
preferred label: Musique par genre @fr
preferred label: Musica per genere @it
broader: Música
narrower: Blues
narrower: Cante alentejano
narrower: Fado
narrower: Jazz
narrower: Música eletrónica
narrower: Musical
narrower: Ópera (Música segundo o género)
narrower: Samba

Blues
type: Concept
in scheme: Tesauro SIPA
broader: Música segundo o género

Cante alentejano
type: Concept
in scheme: Tesauro SIPA
broader: Música segundo o género

Fado
type: Concept
in scheme: Tesauro SIPA
broader: Música segundo o género

Jazz
type: Concept
in scheme: Tesauro SIPA
broader: Música segundo o género

Música eletrónica
type: Concept
in scheme: Tesauro SIPA
preferred label: Electronic music @en
preferred label: Musique électronique @fr
preferred label: Musica elettronica @it
hidden label: Música electrónica
broader: Música segundo o género

Musical
type: Concept
in scheme: Tesauro SIPA
broader: Música segundo o género

Ópera (Música segundo o género)
type: Concept
in scheme: Tesauro SIPA
preferred label: Opera (Music by genre) @en
preferred label: Opéra (Musique par genre) @fr
preferred label: Opera (Musica per genere) @it
broader: Música segundo o género

Samba
type: Concept
in scheme: Tesauro SIPA
broader: Música segundo o género

Teatro (Arte cénica)
type: Concept
in scheme: Tesauro SIPA
preferred label: Theatre (Performing arts) @en
preferred label: Théâtre (Arts de la scène) @fr
preferred label: Teatro (Arti dello spettacolo) @it
broader: Artes performativas
narrower: Arremedilho
narrower: Comédia
narrower: Tragédia

Arremedilho
type: Concept
in scheme: Tesauro SIPA
preferred label: Arremedilhos @en
preferred label: Arremedilho (Pièce de théâtre) @fr
preferred label: Arremedilho (Opera teatrale) @it
broader: Teatro (Arte cénica)

Comédia
type: Concept
in scheme: Tesauro SIPA
preferred label: Comedy @en
preferred label: Comédie @fr
preferred label: Commedia @it
broader: Teatro (Arte cénica)

Tragédia
type: Concept
in scheme: Tesauro SIPA
preferred label: Tragedy @en
preferred label: Tragédie @fr
preferred label: Tragedia @it
broader: Teatro (Arte cénica)

Artes visuais
type: Concept
in scheme: Tesauro SIPA
preferred label: Visual arts @en
preferred label: Arts visuels @fr
preferred label: Arti visive @it
broader: Artes
narrower: Arquitetura
narrower: Artes decorativas
narrower: Desenho
narrower: Design gráfico
narrower: Escultura (Artes visuais)
narrower: Fotografia
narrower: Ourivesaria
narrower: Pintura (Artes visuais)

Arquitetura
type: Concept
in scheme: Tesauro SIPA
preferred label: Architecture @en
preferred label: Architettura @it
hidden label: Arquitectura
broader: Artes visuais
narrower: Arquitetura de interiores
narrower: Arquitetura paisagista
narrower: Arquitetura naval

Arquitetura de interiores
type: Concept
in scheme: Tesauro SIPA
preferred label: Interior architecture @en
preferred label: Architecture d'intérieur @fr
preferred label: Architettura d'interni @it
hidden label: Arquitectura de interiores
broader: Arquitetura

Arquitetura paisagista
type: Concept
in scheme: Tesauro SIPA
preferred label: Landscape architecture @en
preferred label: Architecture paysagère @fr
preferred label: Architettura del paesaggio @it
hidden label: Arquitectura paisagista
broader: Arquitetura

Arquitetura naval
type: Concept
in scheme: Tesauro SIPA
preferred label: Naval architecture @en
preferred label: Architecture navale @fr
preferred label: Architettura navale @it
hidden label: Arquitectura naval
broader: Arquitetura

Artes decorativas
type: Concept
in scheme: Tesauro SIPA
preferred label: Decorative arts @en
preferred label: Arts décoratifs @fr
preferred label: Arti decorative @it
broader: Artes visuais
narrower: Azulejaria
narrower: Azulejaria islâmica

Azulejaria
type: Concept
in scheme: Tesauro SIPA
preferred label: Carrelage @fr
preferred label: Azulejo @en
preferred label: Piastrellatura @it
broader: Artes decorativas
narrower: Azulejaria barroca
narrower: Azulejaria hispano-árabe

Azulejaria barroca
type: Concept
in scheme: Tesauro SIPA
preferred label: Baroque "Azulejo" craft @en
preferred label: Carrelage baroque @fr
preferred label: Piastrellatura barocca @it
broader: Azulejaria

Azulejaria hispano-árabe
type: Concept
scope note: Designação genérica do azulejo produzido em Espanha, sobretudo em Sevilha e Toledo, nos séculos XV e XVI, nas técnicas de aresta ou corda seca. Este azulejo imita os efeitos do alicatado mas graças à utilização da aresta ou da corda-seca permitia realizar as várias formas coloridas dentro de um quadrado sem que as cores se misturassem durante a cozedura. Os motivos decorativos são quase sempre geométricos.
in scheme: Tesauro SIPA
preferred label: Hispano-arabic "Azulejo" craft @en
preferred label: Carrelage hispano-arabe @fr
preferred label: Piastrellatura arabo-spagnola @it
broader: Azulejaria

Azulejaria islâmica
type: Concept
in scheme: Tesauro SIPA
preferred label: Islamic "Azulejo" craft (Ceramic tile works) @en
preferred label: Carrelage islamique @fr
preferred label: Piastrellatura islamica @it
broader: Artes decorativas

Desenho
type: Concept
in scheme: Tesauro SIPA
preferred label: Drawing @en
preferred label: Dessin @fr
preferred label: Disegno @it
broader: Artes visuais

Design gráfico
type: Concept
in scheme: Tesauro SIPA
preferred label: Graphic design @en
preferred label: Graphisme @fr
preferred label: Design grafico @it
broader: Artes visuais

Escultura (Artes visuais)
type: Concept
in scheme: Tesauro SIPA
preferred label: Sculpture (Visual arts) @en
preferred label: Sculpture (Arts visuels) @fr
preferred label: Scultura (Arti visive) @it
broader: Artes visuais
related: Imaginária

Fotografia
type: Concept
in scheme: Tesauro SIPA
preferred label: Photography @en
preferred label: Photographie @fr
broader: Artes visuais

Ourivesaria
type: Concept
in scheme: Tesauro SIPA
preferred label: Jewellery @en
preferred label: Bijouterie @fr
preferred label: Gioielli @it
broader: Artes visuais

Pintura (Artes visuais)
type: Concept
in scheme: Tesauro SIPA
preferred label: Painting (Visual arts) @en
preferred label: Peinture (Arts visuels) @fr
preferred label: Pittura (Arti visive) @it
broader: Artes visuais

Filosofia
type: Concept
in scheme: Tesauro SIPA
preferred label: Philosophy @en
preferred label: Philosophie @fr
broader: Humanidades
narrower: Epistemologia
narrower: Estética
narrower: Ética
narrower: Lógica
narrower: Metafísica

Epistemologia
type: Concept
in scheme: Tesauro SIPA
preferred label: Epistemology @en
preferred label: Épistémologie @fr
broader: Filosofia

Estética
type: Concept
in scheme: Tesauro SIPA
preferred label: Aesthetics @en
preferred label: Esthétique @fr
preferred label: Estetica @it
broader: Filosofia

Ética
type: Concept
in scheme: Tesauro SIPA
preferred label: Ethics @en
preferred label: Éthique @fr
preferred label: Etica @it
broader: Filosofia

Lógica
type: Concept
in scheme: Tesauro SIPA
preferred label: Logic @en
preferred label: Logique @fr
preferred label: Logica @it
broader: Filosofia

Metafísica
type: Concept
in scheme: Tesauro SIPA
preferred label: Metaphysics @en
preferred label: Métaphysique @fr
preferred label: Metafisica @it
broader: Filosofia

Linguística
type: Concept
in scheme: Tesauro SIPA
preferred label: Linguistics @en
preferred label: Linguistique @fr
preferred label: Linguistica @it
broader: Humanidades
narrower: Onomotalogia

Onomotalogia
type: Concept
in scheme: Tesauro SIPA
preferred label: Onomotalogy @en
preferred label: Onomasiologie @fr
broader: Linguística
narrower: Antroponímia

Antroponímia
type: Concept
in scheme: Tesauro SIPA
preferred label: Anthroponymy @en
preferred label: Anthroponymie @fr
preferred label: Antroponimia @it
broader: Onomotalogia

Literatura
type: Concept
in scheme: Tesauro SIPA
preferred label: Literature @en
preferred label: Littérature @fr
preferred label: Letteratura @it
broader: Humanidades

Museologia
type: Concept
in scheme: Tesauro SIPA
preferred label: Museology @en
preferred label: Muséologie @fr
broader: Humanidades
narrower: Museografia

Museografia
type: Concept
in scheme: Tesauro SIPA
preferred label: Museography @en
preferred label: Muséographie @fr
broader: Museologia

Religião
type: Concept
in scheme: Tesauro SIPA
preferred label: Religion @en
preferred label: Religione @it
broader: Humanidades
narrower: Escatologia
narrower: Ética religiosa
narrower: Hagiografia
narrower: Teologia

Escatologia
type: Concept
in scheme: Tesauro SIPA
preferred label: Eschatology @en
preferred label: Eschatologie @fr
broader: Religião

Ética religiosa
type: Concept
in scheme: Tesauro SIPA
preferred label: Religious ethics @en
preferred label: Éthique religieuse @fr
preferred label: Etica religiosa @it
broader: Religião

Hagiografia
type: Concept
in scheme: Tesauro SIPA
preferred label: Hagiography @en
preferred label: Hagiographie @fr
preferred label: Agiografia @it
broader: Religião

Teologia
type: Concept
in scheme: Tesauro SIPA
preferred label: Theology @en
preferred label: Théologie @fr
broader: Religião

Retórica
type: Concept
in scheme: Tesauro SIPA
preferred label: Rhetoric @en
preferred label: Rhétorique @fr
preferred label: Retorica @it
broader: Humanidades

Eventos
type: Concept
scope note: A hierarquia Eventos integra descritores que representam fenómenos e acontecimentos naturais e sociais que ocorrem pontualmente, num dado momento. Em muitos casos esses fenómenos são efeito ou resultado de Atividades. Eventos opõem-se, assim, a Processos, que são sequências naturais ou projetadas, contínuas ou descontínuas, de mudanças nos atributos de uma dada entidade, objeto, material, sistema ou contexto.
in scheme: Tesauro SIPA
preferred label: Events @en
preferred label: Evénements @fr
preferred label: Eventi @it
broader: Atividades, eventos, fenómenos, processos e técnicas
narrower: Eventos específicos
narrower: Eventos genéricos

Eventos específicos
type: Concept
in scheme: Tesauro SIPA
preferred label: Specific events @en
preferred label: Événements spécifiques @fr
preferred label: Eventi specifici @it
broader: Eventos
narrower: Eventos bélicos
narrower: Eventos biológicos
narrower: Eventos botânicos
narrower: Eventos comerciais
narrower: Eventos culturais
narrower: Eventos educativos
narrower: Eventos lúdicos e recreativos
narrower: Eventos políticos
narrower: Eventos religiosos

Eventos bélicos
type: Concept
in scheme: Tesauro SIPA
preferred label: War events @en
preferred label: Événements de guerre @fr
preferred label: Eventi bellici @it
broader: Eventos específicos
narrower: Ataque
narrower: Batalha
narrower: Combate
narrower: Guerra
narrower: Invasão
narrower: Motim
narrower: Rebelião
narrower: Revolução

Ataque
type: Concept
in scheme: Tesauro SIPA
preferred label: Attack @en
preferred label: Attaque @fr
preferred label: Attacco @it
broader: Eventos bélicos
narrower: Ataque terrorista

Ataque terrorista
type: Concept
in scheme: Tesauro SIPA
preferred label: Terrorist attack @en
preferred label: Attaque terroriste @fr
preferred label: Attacco terroristico @it
broader: Ataque

Batalha
type: Concept
in scheme: Tesauro SIPA
preferred label: Battle @en
preferred label: Bataille @fr
preferred label: Battaglia @it
broader: Eventos bélicos

Combate
type: Concept
in scheme: Tesauro SIPA
preferred label: Combat @en
preferred label: Combattimento @it
broader: Eventos bélicos
narrower: Duelo
narrower: Justa

Duelo
type: Concept
in scheme: Tesauro SIPA
preferred label: Duel @en
preferred label: Duello @it
broader: Combate

Justa
type: Concept
in scheme: Tesauro SIPA
preferred label: Joust @en
preferred label: Joute @fr
preferred label: Giostra @it
broader: Combate

Guerra
type: Concept
in scheme: Tesauro SIPA
preferred label: War @en
preferred label: Guerre @fr
broader: Eventos bélicos
narrower: Guerra civil
narrower: Guerra mundial

Guerra civil
type: Concept
in scheme: Tesauro SIPA
preferred label: Civil war @en
preferred label: Guerre civile @fr
preferred label: Guerra civile @it
broader: Guerra

Guerra mundial
type: Concept
in scheme: Tesauro SIPA
preferred label: World war @en
preferred label: Guerre mondiale @fr
preferred label: Guerra mondiale @it
broader: Guerra

Invasão
type: Concept
in scheme: Tesauro SIPA
preferred label: Invasion @en
preferred label: Invasione @it
broader: Eventos bélicos

Motim
type: Concept
in scheme: Tesauro SIPA
preferred label: Mutiny @en
preferred label: Mutinerie @fr
preferred label: Ammutinamento @it
broader: Eventos bélicos

Rebelião
type: Concept
in scheme: Tesauro SIPA
preferred label: Rebellion @en
preferred label: Rébellion @fr
preferred label: Ribellione @it
broader: Eventos bélicos

Revolução
type: Concept
in scheme: Tesauro SIPA
preferred label: Revolution @en
preferred label: Révolution @fr
preferred label: Rivoluzione @it
broader: Eventos bélicos
narrower: Contrarrevolução

Contrarrevolução
type: Concept
in scheme: Tesauro SIPA
preferred label: Counterrevolution @en
preferred label: Contrerévolution @fr
preferred label: Controrivoluzione @it
hidden label: Contra-revolução
broader: Revolução

Eventos biológicos
type: Concept
in scheme: Tesauro SIPA
preferred label: Biological events @en
preferred label: Événements biologiques @fr
preferred label: Eventi biologici @it
broader: Eventos específicos
narrower: Conceção
narrower: Metamorfose
narrower: Morte
narrower: Nascimento
narrower: Tentação

Conceção
type: Concept
in scheme: Tesauro SIPA
preferred label: Conception @en
preferred label: Concepimento @it
hidden label: Concepção
broader: Eventos biológicos

Metamorfose
type: Concept
in scheme: Tesauro SIPA
preferred label: Metamorphosis @en
preferred label: Métamorphose @fr
preferred label: Metamorfosi @it
broader: Eventos biológicos

Morte
type: Concept
in scheme: Tesauro SIPA
preferred label: Death @en
preferred label: Mort @fr
broader: Eventos biológicos
narrower: Assassínio
narrower: Execução

Assassínio
type: Concept
in scheme: Tesauro SIPA
preferred label: Murder @en
preferred label: Meurtre @fr
preferred label: Omicidio @it
broader: Morte
narrower: Regicídio

Regicídio
type: Concept
in scheme: Tesauro SIPA
preferred label: Regicide @en
preferred label: Régicide @fr
preferred label: Regicidio @it
broader: Assassínio

Execução
type: Concept
in scheme: Tesauro SIPA
preferred label: Execution @en
preferred label: Exécution @fr
preferred label: Esecuzione @it
broader: Morte
narrower: Auto de fé
narrower: Enforcamento
narrower: Flagelação

Auto de fé
type: Concept
in scheme: Tesauro SIPA
preferred label: Act of Faith @en
preferred label: Ordres de la Foi @fr
broader: Execução

Enforcamento
type: Concept
in scheme: Tesauro SIPA
preferred label: Hanging @en
preferred label: Pendaison @fr
preferred label: Impiccagione @it
broader: Execução

Flagelação
type: Concept
in scheme: Tesauro SIPA
preferred label: Flagellations @en
preferred label: Flagellazioni @it
broader: Execução

Nascimento
type: Concept
in scheme: Tesauro SIPA
preferred label: Birth @en
preferred label: Naissance @fr
preferred label: Nascita @it
broader: Eventos biológicos

Tentação
type: Concept
in scheme: Tesauro SIPA
preferred label: Temptation @en
preferred label: Tentation @fr
preferred label: Tentazione @it
broader: Eventos biológicos

Eventos botânicos
type: Concept
in scheme: Tesauro SIPA
preferred label: Botanical events @en
preferred label: Événements botaniques @fr
preferred label: Eventi botanici @it
broader: Eventos específicos
narrower: Fotossíntese

Fotossíntese
type: Concept
scope note: Processo bioquímico, que permite aos vegetais sintetizar substâncias orgânicas a partir de substâncias minerais simples, utilizando como fonte de energia a luz solar. Neste processo, a planta consome dióxido de carbono e liberta oxigénio.
in scheme: Tesauro SIPA
preferred label: Photosynthesis @en
preferred label: Photosynthèse @fr
preferred label: Fotosintesi @it
broader: Eventos botânicos

Eventos comerciais
type: Concept
in scheme: Tesauro SIPA
preferred label: Commercial events @en
preferred label: Manifestations commerciales @fr
preferred label: Eventi commerciali @it
broader: Eventos específicos
narrower: Feira
narrower: Leilão
narrower: Mercado (Atividades e eventos comerciais)

Feira
type: Concept
in scheme: Tesauro SIPA
preferred label: Foire @fr
preferred label: Fiera @it
preferred label: Trade fair @en
broader: Eventos comerciais
narrower: Feira franca

Feira franca
type: Concept
in scheme: Tesauro SIPA
preferred label: Free trade fair @en
preferred label: Foire commerciale libre @fr
preferred label: Fiera gratuita @it
broader: Feira

Leilão
type: Concept
in scheme: Tesauro SIPA
preferred label: Auction @en
preferred label: Vente aux enchères @fr
preferred label: Asta @it
broader: Eventos comerciais

Mercado (Atividades e eventos comerciais)
type: Concept
in scheme: Tesauro SIPA
preferred label: Market (Commercial activities and events) @en
preferred label: Marché (Activités et manifestations commerciales) @fr
preferred label: Mercato (Attività ed eventi commerciali) @it
broader: Eventos comerciais

Eventos culturais
type: Concept
in scheme: Tesauro SIPA
preferred label: Cultural events @en
preferred label: Manifestations culturelles @fr
preferred label: Eventi culturali @it
broader: Eventos específicos
narrower: Campanha
narrower: Celebração
narrower: Exposição

Campanha
type: Concept
in scheme: Tesauro SIPA
preferred label: Campaign @en
preferred label: Campagne @fr
preferred label: Campagna @it
broader: Eventos culturais
narrower: Campanha arqueológica
narrower: Campanha de obra
narrower: Campanha de restauro
narrower: Campanha de sondagens
narrower: Campanha eleitoral
narrower: Campanha militar

Campanha arqueológica
type: Concept
in scheme: Tesauro SIPA
preferred label: Archaeological campaign @en
preferred label: Campagne archéologique @fr
preferred label: Campagna archeologica @it
broader: Campanha

Campanha de obra
type: Concept
in scheme: Tesauro SIPA
preferred label: Work campaign @en
preferred label: Campagne de construction @fr
preferred label: Campagna di costruzione @it
broader: Campanha

Campanha de restauro
type: Concept
in scheme: Tesauro SIPA
preferred label: Restoration campaign @en
preferred label: Campagne de restauration @fr
preferred label: Campagna di restauro @it
broader: Campanha
narrower: Brigada

Brigada
type: Concept
in scheme: Tesauro SIPA
preferred label: Brigade @en
preferred label: Brigata @it
broader: Campanha de restauro

Campanha de sondagens
type: Concept
in scheme: Tesauro SIPA
preferred label: Survey campaign @en
preferred label: Campagne d'enquête @fr
preferred label: Campagna di sondaggio @it
broader: Campanha

Campanha eleitoral
type: Concept
in scheme: Tesauro SIPA
preferred label: Election campaign @en
preferred label: Campagne électorale @fr
preferred label: Campagna elettorale @it
broader: Campanha

Campanha militar
type: Concept
in scheme: Tesauro SIPA
preferred label: Military campaign @en
preferred label: Campagne militaire @fr
preferred label: Campagna militare @it
broader: Campanha

Celebração
type: Concept
in scheme: Tesauro SIPA
preferred label: Celebration @en
preferred label: Célébration @fr
preferred label: Celebrazione @it
broader: Eventos culturais
narrower: Aniversário
narrower: Festividade
narrower: Festival

Aniversário
type: Concept
in scheme: Tesauro SIPA
preferred label: Anniversaires @en
preferred label: Anniversaire @fr
preferred label: Anniversario @it
broader: Celebração
narrower: Centenário

Centenário
type: Concept
in scheme: Tesauro SIPA
preferred label: Centennial @en
preferred label: Centenaire @fr
preferred label: Centenario @it
broader: Aniversário

Festividade
type: Concept
in scheme: Tesauro SIPA
preferred label: Festivity @en
preferred label: Festivités @fr
preferred label: Festività @it
broader: Celebração

Festival
type: Concept
in scheme: Tesauro SIPA
broader: Celebração
narrower: Festival musical

Festival musical
type: Concept
in scheme: Tesauro SIPA
preferred label: Music festival @en
preferred label: Festival de musique @fr
preferred label: Festival musicale @it
broader: Festival

Exposição
type: Concept
in scheme: Tesauro SIPA
preferred label: Exhibition @en
preferred label: Exposition @fr
preferred label: Mostra @it
broader: Eventos culturais
narrower: Exposição de arte

Exposição de arte
type: Concept
in scheme: Tesauro SIPA
preferred label: Art exhibition @en
preferred label: Exposition d'art @fr
preferred label: Mostra d'arte @it
broader: Exposição

Eventos educativos
type: Concept
in scheme: Tesauro SIPA
preferred label: Educational events @en
preferred label: Événements éducatifs @fr
preferred label: Eventi educativi @it
broader: Eventos específicos
narrower: Aula
narrower: Cerimónia de agregação
narrower: Colóquio
narrower: Defesa de tese
narrower: Seminário

Aula
type: Concept
in scheme: Tesauro SIPA
preferred label: Class @en
preferred label: Classe @fr
broader: Eventos educativos

Cerimónia de agregação
type: Concept
in scheme: Tesauro SIPA
preferred label: Graduation ceremony; Aggregation ceremony @en
preferred label: Cérémonie d'agrégation @fr
preferred label: Cerimonia di aggregazione @it
broader: Eventos educativos

Colóquio
type: Concept
in scheme: Tesauro SIPA
preferred label: Coloquium; Conference @en
preferred label: Colloque @fr
preferred label: Colloquio @it
broader: Eventos educativos

Defesa de tese
type: Concept
in scheme: Tesauro SIPA
preferred label: Thesis defence @en
preferred label: Soutenance de thèse @fr
preferred label: Difesa della tesi @it
broader: Eventos educativos

Seminário
type: Concept
in scheme: Tesauro SIPA
preferred label: Seminar @en
preferred label: Séminaire @fr
preferred label: Seminario @it
broader: Eventos educativos
narrower: Webinar
narrower: Workshop

Webinar
type: Concept
in scheme: Tesauro SIPA
broader: Seminário

Workshop
type: Concept
in scheme: Tesauro SIPA
broader: Seminário

Eventos lúdicos e recreativos
type: Concept
in scheme: Tesauro SIPA
preferred label: Leisure and recreational events @en
preferred label: Manifestations de loisirs et de détente @fr
preferred label: Eventi per il tempo libero e la ricreazione @it
broader: Eventos específicos
narrower: Atividade tauromáquica
narrower: Baile
narrower: Carnaval
narrower: Gala
narrower: Parada

Atividade tauromáquica
type: Concept
in scheme: Tesauro SIPA
preferred label: Bullfighting @en
preferred label: Activité taurine @fr
preferred label: Attività della tauromachia @it
alternative label: Tauromaquia
hidden label: Actividade tauromáquica
broader: Eventos lúdicos e recreativos
narrower: Capeia arraiana
narrower: Garraiada
narrower: Largada
narrower: Novilhada
narrower: Tourada

Capeia arraiana
type: Concept
in scheme: Tesauro SIPA
preferred label: Ribacôa traditional bullfight @en
preferred label: Corrida traditionnelle de Ribacôa @fr
preferred label: Corrida tradizionale di Ribacôa @it
broader: Atividade tauromáquica

Garraiada
type: Concept
in scheme: Tesauro SIPA
preferred label: Steer fight @en
broader: Atividade tauromáquica

Largada
type: Concept
in scheme: Tesauro SIPA
preferred label: Bull release @en
broader: Atividade tauromáquica

Novilhada
type: Concept
in scheme: Tesauro SIPA
preferred label: Bullock fight @en
broader: Atividade tauromáquica

Tourada
type: Concept
in scheme: Tesauro SIPA
preferred label: Bullfight @en
preferred label: Corrida @fr
alternative label: Corrida de toiros
alternative label: Faena
alternative label: Festa brava
alternative label: Lide
alternative label: Toureio
broader: Atividade tauromáquica
narrower: Pega
narrower: Toureio a cavalo
narrower: Toureio a pé

Pega
type: Concept
in scheme: Tesauro SIPA
preferred label: Prise à main nue du taureau @fr
preferred label: Afferrare il toro @it
preferred label: Pega (Bull gappling) @en
broader: Tourada
narrower: Pega de caras
narrower: Pega de cernelha

Pega de caras
type: Concept
in scheme: Tesauro SIPA
preferred label: Face tack @en
broader: Pega

Pega de cernelha
type: Concept
in scheme: Tesauro SIPA
preferred label: Back withers @en
broader: Pega

Toureio a cavalo
type: Concept
in scheme: Tesauro SIPA
preferred label: Bullfighting on horseback @en
broader: Tourada

Toureio a pé
type: Concept
in scheme: Tesauro SIPA
preferred label: Bullfighting on foot @en
broader: Tourada

Baile
type: Concept
in scheme: Tesauro SIPA
preferred label: Ball @en
preferred label: Bal @fr
preferred label: Ballo @it
broader: Eventos lúdicos e recreativos

Carnaval
type: Concept
in scheme: Tesauro SIPA
preferred label: Carnival @en
preferred label: Carnevale @it
broader: Eventos lúdicos e recreativos

Gala
type: Concept
in scheme: Tesauro SIPA
broader: Eventos lúdicos e recreativos

Parada
type: Concept
in scheme: Tesauro SIPA
preferred label: Parade @en
preferred label: Parata @it
broader: Eventos lúdicos e recreativos

Eventos políticos
type: Concept
in scheme: Tesauro SIPA
preferred label: Political events @en
preferred label: Événements politiques @fr
preferred label: Eventi politici @it
broader: Eventos específicos
narrower: Conspiração
narrower: Insurreição
narrower: Mudança de regime
narrower: Rebelião
narrower: Sucessão

Conspiração
type: Concept
in scheme: Tesauro SIPA
preferred label: Conspiracy @en
preferred label: Conspiration @fr
preferred label: Cospirazione @it
broader: Eventos políticos

Insurreição
type: Concept
in scheme: Tesauro SIPA
preferred label: Insurrection @en
preferred label: Insurrezione @it
broader: Eventos políticos

Mudança de regime
type: Concept
in scheme: Tesauro SIPA
preferred label: Regime change @en
preferred label: Changement de régime @fr
preferred label: Cambio di regime @it
broader: Eventos políticos

Rebelião
type: Concept
in scheme: Tesauro SIPA
preferred label: Rebellion @en
preferred label: Rébellion @fr
preferred label: Ribellione @it
broader: Eventos políticos

Sucessão
type: Concept
in scheme: Tesauro SIPA
preferred label: Succession @en
preferred label: Successione @it
broader: Eventos políticos

Eventos religiosos
type: Concept
in scheme: Tesauro SIPA
preferred label: Religious events @en
preferred label: Événements religieux @fr
preferred label: Eventi religiosi @it
broader: Eventos específicos
narrower: Beatificação
narrower: Canonização
narrower: Excomunhão

Beatificação
type: Concept
in scheme: Tesauro SIPA
preferred label: Beatification @en
preferred label: Béatification @fr
preferred label: Beatificazione @it
broader: Eventos religiosos

Canonização
type: Concept
in scheme: Tesauro SIPA
preferred label: Canonisation @en
preferred label: Canonizzazione @it
broader: Eventos religiosos

Excomunhão
type: Concept
in scheme: Tesauro SIPA
preferred label: Excommunication @en
preferred label: Scomunicamento @it
broader: Eventos religiosos

Eventos genéricos
type: Concept
in scheme: Tesauro SIPA
preferred label: Generic events @en
preferred label: Événements génériques @fr
preferred label: Eventi generici @it
broader: Eventos
narrower: Aclamação
narrower: Cerimónia
narrower: Conquista
narrower: Exame
narrower: Inauguração

Aclamação
type: Concept
in scheme: Tesauro SIPA
preferred label: Acclaim @en
preferred label: Acclamation @fr
preferred label: Acclamazione @it
broader: Eventos genéricos

Cerimónia
type: Concept
in scheme: Tesauro SIPA
preferred label: Ceremony @en
preferred label: Cérémonie @fr
preferred label: Cerimonia @it
broader: Eventos genéricos
narrower: Cerimónia segundo o contexto

Cerimónia segundo o contexto
type: Concept
in scheme: Tesauro SIPA
preferred label: Ceremony according to context @en
preferred label: Cérémonie selon le contexte @fr
preferred label: Cerimonia in base al contesto @it
broader: Cerimónia
narrower: Cerimónia académica
narrower: Cerimónia cultural
narrower: Cerimónia político-administrativa
narrower: Cerimónia religiosa

Cerimónia académica
type: Concept
in scheme: Tesauro SIPA
preferred label: Academic ceremony @en
preferred label: Cérémonie académique @fr
preferred label: Cerimonia accademica @it
broader: Cerimónia segundo o contexto
narrower: Praxe
narrower: Queima das fitas

Praxe
type: Concept
in scheme: Tesauro SIPA
preferred label: Praxis @en
broader: Cerimónia académica

Queima das fitas
type: Concept
in scheme: Tesauro SIPA
preferred label: Ribbon burning @en
broader: Cerimónia académica

Cerimónia cultural
type: Concept
in scheme: Tesauro SIPA
preferred label: Cultural ceremony @en
preferred label: Cérémonie culturelle @fr
preferred label: Cerimonia culturale @it
broader: Cerimónia segundo o contexto
narrower: Procissão
narrower: Rito de passagem
narrower: Romaria

Procissão
type: Concept
in scheme: Tesauro SIPA
preferred label: Proccession @en
preferred label: Procession @fr
preferred label: Processione @it
broader: Cerimónia cultural

Rito de passagem
type: Concept
in scheme: Tesauro SIPA
preferred label: Rites of passage @en
broader: Cerimónia cultural

Romaria
type: Concept
in scheme: Tesauro SIPA
preferred label: March @en
preferred label: Pèlerinage @fr
preferred label: Pellegrinaggio @it
broader: Cerimónia cultural

Cerimónia político-administrativa
type: Concept
in scheme: Tesauro SIPA
preferred label: Political and administrative ceremony @en
preferred label: Cérémonie politique et administrative @fr
preferred label: Cerimonia politica e amministrativa @it
broader: Cerimónia segundo o contexto
narrower: Coroação
narrower: Tomada de posse

Coroação
type: Concept
in scheme: Tesauro SIPA
preferred label: Coronation @en
preferred label: Couronnement @fr
preferred label: Incoronazione @it
broader: Cerimónia político-administrativa

Tomada de posse
type: Concept
in scheme: Tesauro SIPA
preferred label: Swearing in @en
broader: Cerimónia político-administrativa

Cerimónia religiosa
type: Concept
in scheme: Tesauro SIPA
preferred label: Religious ceremonies @en
preferred label: Cérémonies religieuses @fr
preferred label: Cerimonie religiose @it
broader: Cerimónia segundo o contexto
narrower: Bar mitzvahs
narrower: Batizado
narrower: Casamento
narrower: Circuncisão
narrower: Consagração
narrower: Crisma
narrower: Desconsagração
narrower: Eucaristia
narrower: Extrema unção
narrower: Novena
narrower: Ordenação

Bar mitzvahs
type: Concept
in scheme: Tesauro SIPA
preferred label: Bar mitzvah @it
broader: Cerimónia religiosa

Batizado
type: Concept
in scheme: Tesauro SIPA
preferred label: Baptism @en
preferred label: Baptême @fr
preferred label: Battesimo @it
hidden label: Baptizado
broader: Cerimónia religiosa

Casamento
type: Concept
in scheme: Tesauro SIPA
preferred label: Wedding @en
preferred label: Mariage @fr
preferred label: Matrimonio @it
broader: Cerimónia religiosa

Circuncisão
type: Concept
in scheme: Tesauro SIPA
preferred label: Circumcisions @en
preferred label: Circoncision @fr
preferred label: Circoncisione @it
broader: Cerimónia religiosa

Consagração
type: Concept
in scheme: Tesauro SIPA
preferred label: Consecrations @en
preferred label: Consécration @fr
preferred label: Consacrazione @it
broader: Cerimónia religiosa

Crisma
type: Concept
in scheme: Tesauro SIPA
preferred label: Chrismation @en
preferred label: Confirmation @fr
preferred label: Cresima @it
broader: Cerimónia religiosa

Desconsagração
type: Concept
in scheme: Tesauro SIPA
preferred label: Deconsecrations @en
preferred label: Déconsécration @fr
preferred label: Sconsacrazione @it
broader: Cerimónia religiosa

Eucaristia
type: Concept
in scheme: Tesauro SIPA
preferred label: Eucharists @en
preferred label: Eucharistie @fr
broader: Cerimónia religiosa

Extrema unção
type: Concept
in scheme: Tesauro SIPA
preferred label: Extreme unction @en
preferred label: Extrême-onction @fr
preferred label: Estrema Unzione @it
broader: Cerimónia religiosa

Novena
type: Concept
in scheme: Tesauro SIPA
preferred label: Neuvaine @fr
broader: Cerimónia religiosa

Ordenação
type: Concept
in scheme: Tesauro SIPA
preferred label: Ordination @en
preferred label: Ordinazione @it
broader: Cerimónia religiosa

Conquista
type: Concept
in scheme: Tesauro SIPA
preferred label: Conquest @en
preferred label: Conquête @fr
broader: Eventos genéricos

Exame
type: Concept
in scheme: Tesauro SIPA
preferred label: Examen @en
preferred label: Esame @it
broader: Eventos genéricos

Inauguração
type: Concept
in scheme: Tesauro SIPA
preferred label: Inauguration @en
preferred label: Inaugurazione @it
broader: Eventos genéricos

Fenómenos naturais
type: Concept
in scheme: Tesauro SIPA
preferred label: Natural events @en
preferred label: Phénomènes naturels @fr
preferred label: Fenomeni naturali @it
broader: Atividades, eventos, fenómenos, processos e técnicas
narrower: Atividade sísmica
narrower: Fenómenos atmosféricos
narrower: Fenómenos do ciclo hidrológico

Atividade sísmica
type: Concept
in scheme: Tesauro SIPA
preferred label: Seismic activity @en
preferred label: Activité sismique @fr
preferred label: Attività sismica @it
hidden label: Actividade sísmica
broader: Fenómenos naturais
narrower: Erupção vulcânica
narrower: Maremoto
narrower: Tsunami

Erupção vulcânica
type: Concept
in scheme: Tesauro SIPA
preferred label: Volcanic eruption @en
broader: Atividade sísmica

Maremoto
type: Concept
in scheme: Tesauro SIPA
preferred label: Seaquake @en
preferred label: Raz de marée @fr
broader: Atividade sísmica

Tsunami
type: Concept
scope note: Onda gerada no oceano por um sismo cujo epicentro se localiza em fundo marinho ou próximo da costa. Em águas profundas, a sua altura é inferior a um metro, mas à medida que se aproxima das zonas costeiras aumenta consideravelmente de tamanho, podendo atingir alturas de dezenas de metros, provocando grandes destruições. No interior de bacias hidrográficas, as ondas do maremoto adquirem a forma de maré rápida com uma amplitude que pode atingir alguns metros, provocando inundações em zonas pouco protegidas.
in scheme: Tesauro SIPA
broader: Atividade sísmica

Fenómenos atmosféricos
type: Concept
in scheme: Tesauro SIPA
preferred label: Atmospheric Phenomena @en
preferred label: Phénomènes atmosphériques @fr
preferred label: Fenomeni atmosferici @it
broader: Fenómenos naturais
narrower: Bruma
narrower: Ciclone
narrower: Furacão
narrower: Geada
narrower: Gelo
narrower: Neblina
narrower: Névoa
narrower: Nevoeiro
narrower: Nuvem
narrower: Tempestade
narrower: Tornado
narrower: Tufão
narrower: Vento

Bruma
type: Concept
in scheme: Tesauro SIPA
preferred label: Nebbia @it
preferred label: Brouillard @fr
preferred label: Fog; Haze @en
broader: Fenómenos atmosféricos

Ciclone
type: Concept
in scheme: Tesauro SIPA
preferred label: Cyclone @en
broader: Fenómenos atmosféricos

Furacão
type: Concept
in scheme: Tesauro SIPA
preferred label: Hurricane @en
preferred label: Ouragan @fr
preferred label: Uragano @it
broader: Fenómenos atmosféricos

Geada
type: Concept
in scheme: Tesauro SIPA
preferred label: Frost @en
preferred label: Givre @fr
preferred label: Brina; Brinata @it
broader: Fenómenos atmosféricos

Gelo
type: Concept
in scheme: Tesauro SIPA
preferred label: Ice @en
preferred label: Glace @fr
preferred label: Ghiaccio @it
broader: Fenómenos atmosféricos

Neblina
type: Concept
in scheme: Tesauro SIPA
preferred label: Mist @en
preferred label: Brouillasse @fr
preferred label: Foschia @it
broader: Fenómenos atmosféricos

Névoa
type: Concept
in scheme: Tesauro SIPA
preferred label: Brume @fr
preferred label: Nebbia @it
preferred label: Mist @en
broader: Fenómenos atmosféricos

Nevoeiro
type: Concept
in scheme: Tesauro SIPA
preferred label: Fog @en
preferred label: Brouillard @fr
preferred label: Nebbione @it
broader: Fenómenos atmosféricos

Nuvem
type: Concept
in scheme: Tesauro SIPA
preferred label: Cloud @en
preferred label: Nuage @fr
preferred label: Nube @it
broader: Fenómenos atmosféricos

Tempestade
type: Concept
in scheme: Tesauro SIPA
preferred label: Storm @en
preferred label: Tempête @fr
preferred label: Tempesta @it
broader: Fenómenos atmosféricos
narrower: Trovoada

Trovoada
type: Concept
in scheme: Tesauro SIPA
preferred label: Thunderstorm @en
preferred label: Orage @fr
preferred label: Temporale @it
broader: Tempestade

Tornado
type: Concept
in scheme: Tesauro SIPA
preferred label: Tornade @fr
broader: Fenómenos atmosféricos

Tufão
type: Concept
in scheme: Tesauro SIPA
preferred label: Typhoon @en
preferred label: Typhon @fr
preferred label: Tifone @it
broader: Fenómenos atmosféricos

Vento
type: Concept
in scheme: Tesauro SIPA
preferred label: Wind @en
preferred label: Vent @fr
broader: Fenómenos atmosféricos

Fenómenos do ciclo hidrológico
type: Concept
in scheme: Tesauro SIPA
preferred label: Hydrological cycle events @en
preferred label: Phénomènes du cycle hydrologique @fr
preferred label: Fenomeni del ciclo idrologico @it
broader: Fenómenos naturais
narrower: Cheia
narrower: Inundação
narrower: Seca

Cheia
type: Concept
in scheme: Tesauro SIPA
preferred label: Flood @en
preferred label: Morbida @it
preferred label: Crue (Débordement) @fr
broader: Fenómenos do ciclo hidrológico

Inundação
type: Concept
in scheme: Tesauro SIPA
preferred label: Flood @en
preferred label: Inondation @fr
preferred label: Alluvione @it
broader: Fenómenos do ciclo hidrológico

Seca
type: Concept
in scheme: Tesauro SIPA
preferred label: Drought @en
preferred label: Sécheresse @fr
preferred label: Siccità @it
broader: Fenómenos do ciclo hidrológico

Processos
type: Concept
scope note: A hierarquia Processos integra descritores que representam sequências naturais ou intencionais e projetadas, contínuas ou descontínuas, de mudanças nos atributos de uma dada entidade ou grupo de entidades, objetos, materiais ou sistemas. Excluem-se, todavia, desta hierarquia os descritores referentes a processos relacionados com a intervenção e gestão política, técnico-científica e administrativa dessas mesmas entidades, objetos, materiais ou sistemas, processos esses que estão contemplados em descritores da hierarquia das Atividades.
in scheme: Tesauro SIPA
preferred label: Processes @en
preferred label: Processus @fr
preferred label: Processi @it
broader: Atividades, eventos, fenómenos, processos e técnicas
narrower: Processos climáticos
narrower: Processos genéricos
narrower: Processos demográficos
narrower: Processos individuais
narrower: Processos físico-químicos
narrower: Processos naturais
narrower: Processos sociais

Processos climáticos
type: Concept
in scheme: Tesauro SIPA
preferred label: Climatic processes @en
preferred label: Processus climatiques @fr
preferred label: Processi climatici @it
broader: Processos
narrower: Alteração climática

Alteração climática
type: Concept
in scheme: Tesauro SIPA
preferred label: Climate change @en
preferred label: Altération climatique @fr
preferred label: Alterazione climatica @it
broader: Processos climáticos
narrower: Aquecimento global

Aquecimento global
type: Concept
in scheme: Tesauro SIPA
preferred label: Global warming @en
preferred label: Chauffage global @fr
preferred label: Riscaldamento globale @it
broader: Alteração climática

Processos genéricos
type: Concept
in scheme: Tesauro SIPA
preferred label: Generic processes @en
preferred label: Processus génériques @fr
preferred label: Processi generici @it
broader: Processos
narrower: Aquecimento
narrower: Arrefecimento
narrower: Candidatura
narrower: Congelação

Aquecimento
type: Concept
in scheme: Tesauro SIPA
preferred label: Heating @en
preferred label: Chauffage @fr
preferred label: Riscaldamento @it
broader: Processos genéricos

Arrefecimento
type: Concept
in scheme: Tesauro SIPA
preferred label: Cooling; Refrigeration @en
preferred label: Refroidissement @fr
preferred label: Raffreddamento @it
broader: Processos genéricos

Candidatura
type: Concept
in scheme: Tesauro SIPA
preferred label: Candidacy @en
preferred label: Candidature @fr
broader: Processos genéricos
narrower: Candidatura a património mundial

Candidatura a património mundial
type: Concept
in scheme: Tesauro SIPA
preferred label: Candidacy to world heritage @en
preferred label: Candidature au patrimoine mondial @fr
preferred label: Candidatura al patrimonio mondiale @it
broader: Candidatura

Congelação
type: Concept
in scheme: Tesauro SIPA
preferred label: Freezing @en
preferred label: Congélation @fr
broader: Processos genéricos

Processos demográficos
type: Concept
in scheme: Tesauro SIPA
preferred label: Demographic processes @en
preferred label: Processus démographiques @fr
preferred label: Processi demografici @it
broader: Processos
narrower: Crescimento demográfico
narrower: Declínio demográfico
narrower: Estabilidade demográfica

Crescimento demográfico
type: Concept
in scheme: Tesauro SIPA
preferred label: Demographic growth @en
preferred label: Croissance démographique @fr
preferred label: Crescita demografica @it
broader: Processos demográficos

Declínio demográfico
type: Concept
in scheme: Tesauro SIPA
preferred label: Demographic decline @en
preferred label: Déclin démographique @fr
preferred label: Declino demografico @it
broader: Processos demográficos

Estabilidade demográfica
type: Concept
in scheme: Tesauro SIPA
preferred label: Demographic stability @en
preferred label: Stabilité démographique @fr
preferred label: Stabilità demografica @it
broader: Processos demográficos

Processos individuais
type: Concept
in scheme: Tesauro SIPA
preferred label: Individual processes @en
preferred label: Processus individuels @fr
preferred label: Processi individuali @it
broader: Processos

Processos físico-químicos
type: Concept
in scheme: Tesauro SIPA
preferred label: Physico-chemical processes @en
preferred label: Processus physico-chimiques @fr
preferred label: Processi fisico-chimici @it
broader: Processos
narrower: Absorção

Absorção
type: Concept
in scheme: Tesauro SIPA
preferred label: Absorption @en
preferred label: Assorbimento @it
broader: Processos físico-químicos
narrower: Absorção sonora

Absorção sonora
type: Concept
in scheme: Tesauro SIPA
preferred label: Sound absorption/ Sound insulation @en
preferred label: Absorption acoustique @fr
preferred label: Assorbimento acustico @it
broader: Absorção

Processos naturais
type: Concept
in scheme: Tesauro SIPA
preferred label: Natural processes @en
preferred label: Processus naturels @fr
preferred label: Processi naturali @it
broader: Processos
narrower: Processos atmosféricos
narrower: Processos do ciclo hidrológico
narrower: Processos biológicos
narrower: Processos do solo

Processos atmosféricos
type: Concept
in scheme: Tesauro SIPA
preferred label: Atmospheric processes @en
preferred label: Processus atmosphériques @fr
preferred label: Processi atmosferici @it
broader: Processos naturais
narrower: Inversão térmica

Inversão térmica
type: Concept
in scheme: Tesauro SIPA
preferred label: Thermal inversion @en
preferred label: Inversion thermique @fr
preferred label: Scambio termico @it
broader: Processos atmosféricos

Processos do ciclo hidrológico
type: Concept
in scheme: Tesauro SIPA
preferred label: Hydrological cycle processes @en
preferred label: Processus du cycle hydrologique @fr
preferred label: Processi del ciclo idrologico @it
broader: Processos naturais
narrower: Drenagem de água
narrower: Escoamento de água
narrower: Evaporação de água
narrower: Evapotranspiração
narrower: Infiltração de água no solo

Drenagem de água
type: Concept
in scheme: Tesauro SIPA
preferred label: Water drainage @en
preferred label: Drainage de l'eau @fr
preferred label: Drenaggio dell'acqua @it
broader: Processos do ciclo hidrológico

Escoamento de água
type: Concept
in scheme: Tesauro SIPA
preferred label: Water runoff @en
preferred label: Écoulement de l'eau @fr
preferred label: Deflusso dell'acqua @it
broader: Processos do ciclo hidrológico

Evaporação de água
type: Concept
in scheme: Tesauro SIPA
preferred label: Water evaporation @en
preferred label: Évaporation de l'eau @fr
preferred label: Evaporazione dell'acqua @it
broader: Processos do ciclo hidrológico

Evapotranspiração
type: Concept
in scheme: Tesauro SIPA
preferred label: Evapotranspiration @en
preferred label: Évapotranspiration @fr
preferred label: Evapotraspirazione @it
broader: Processos do ciclo hidrológico

Infiltração de água no solo
type: Concept
scope note: Processo de passagem da água através da superfície do solo.
in scheme: Tesauro SIPA
preferred label: Infiltration of water into the soil @en
preferred label: Infiltration d’eau dans le sol @fr
preferred label: Infiltrazione dell'acqua nel suolo @it
broader: Processos do ciclo hidrológico

Processos biológicos
type: Concept
in scheme: Tesauro SIPA
preferred label: Biological processes @en
preferred label: Processus biologiques @fr
preferred label: Processi biologici @it
broader: Processos naturais
narrower: Amensalismo
narrower: Comensalismo
narrower: Competição
narrower: Mutualismo
narrower: Neutralismo
narrower: Parasitismo
narrower: Predação
narrower: Protocooperação
narrower: Simbiose

Amensalismo
type: Concept
in scheme: Tesauro SIPA
preferred label: Amensalism @en
preferred label: Accessoires @fr
preferred label: Accessori @it
broader: Processos biológicos

Comensalismo
type: Concept
in scheme: Tesauro SIPA
preferred label: Commensalism @en
preferred label: Commensalisme @fr
preferred label: Commensalismo @it
broader: Processos biológicos

Competição
type: Concept
in scheme: Tesauro SIPA
preferred label: Competition @en
preferred label: Compétition @fr
preferred label: Competizione @it
broader: Processos biológicos

Mutualismo
type: Concept
in scheme: Tesauro SIPA
preferred label: Mutualism @en
preferred label: Mutualisme @fr
broader: Processos biológicos

Neutralismo
type: Concept
in scheme: Tesauro SIPA
preferred label: Neutralism @en
preferred label: Neutralisme @fr
broader: Processos biológicos

Parasitismo
type: Concept
in scheme: Tesauro SIPA
preferred label: Parasitism @en
preferred label: Parasitisme @fr
preferred label: Parassitismo @it
broader: Processos biológicos

Predação
type: Concept
in scheme: Tesauro SIPA
preferred label: Predation @en
preferred label: Prédation @fr
preferred label: Predazione @it
broader: Processos biológicos

Protocooperação
type: Concept
in scheme: Tesauro SIPA
preferred label: Protocooperation @en
preferred label: Protocoopération @fr
preferred label: Protocooperazione @it
broader: Processos biológicos

Simbiose
type: Concept
in scheme: Tesauro SIPA
preferred label: Symbiosis @en
preferred label: Symbiose @fr
preferred label: Simbiosi @it
broader: Processos biológicos

Processos do solo
type: Concept
in scheme: Tesauro SIPA
preferred label: Soil processes @en
preferred label: Processus du sol @fr
preferred label: Processi del suolo @it
broader: Processos naturais
narrower: Erosão do solo
narrower: Formação do solo
narrower: Lixiviação do solo
narrower: Mecânica do solo
narrower: Subsidiência do solo

Erosão do solo
type: Concept
in scheme: Tesauro SIPA
preferred label: Soil erosion @en
preferred label: Érosion du sol @fr
preferred label: Erosione del suolo @it
broader: Processos do solo

Formação do solo
type: Concept
in scheme: Tesauro SIPA
preferred label: Soil formation @en
preferred label: Formation du sol @fr
preferred label: Formazione del suolo @it
broader: Processos do solo

Lixiviação do solo
type: Concept
in scheme: Tesauro SIPA
preferred label: Soil leaching @en
preferred label: Lixiviation du sol @fr
preferred label: Lisciviazione del suolo @it
broader: Processos do solo

Mecânica do solo
type: Concept
in scheme: Tesauro SIPA
preferred label: Soil mechanics @en
preferred label: Mécanique du sol @fr
preferred label: Meccanica del suolo @it
broader: Processos do solo

Subsidiência do solo
type: Concept
in scheme: Tesauro SIPA
preferred label: Soil subsidence @en
preferred label: Subvention du sol @fr
preferred label: Sovvenzionamento del suolo @it
broader: Processos do solo

Processos sociais
type: Concept
in scheme: Tesauro SIPA
preferred label: Social processes @en
preferred label: Processus sociaux @fr
preferred label: Processi sociali @it
broader: Processos
narrower: Aculturação
narrower: Alfabetização
narrower: Migrações

Aculturação
type: Concept
in scheme: Tesauro SIPA
preferred label: Acculturation @en
preferred label: Acculturazione @it
broader: Processos sociais

Alfabetização
type: Concept
in scheme: Tesauro SIPA
preferred label: Literacy @en
preferred label: Alphabétisation @fr
preferred label: Alfabetizzazione @it
broader: Processos sociais

Migrações
type: Concept
in scheme: Tesauro SIPA
preferred label: Migrations @en
preferred label: Migrazione @it
broader: Processos sociais
narrower: Migrações internas

Migrações internas
type: Concept
in scheme: Tesauro SIPA
preferred label: Internal migrations @en
preferred label: Migration interne @fr
preferred label: Migrazioni interne @it
broader: Migrações
narrower: Êxodo rural
narrower: Movimento pendular

Êxodo rural
type: Concept
in scheme: Tesauro SIPA
preferred label: Rural exodus @en
preferred label: Exode rural @fr
preferred label: Esodo rurale @it
broader: Migrações internas

Movimento pendular
type: Concept
in scheme: Tesauro SIPA
preferred label: Mouvement pendulaire @fr
preferred label: Movimento pendolare @it
preferred label: Pendular movement; Commuting @en
broader: Migrações internas

Processos e técnicas
type: Concept
in scheme: Tesauro SIPA
preferred label: Processes and techniques @en
preferred label: Processus et techniques @fr
preferred label: Processi e tecniche @it
broader: Atividades, eventos, fenómenos, processos e técnicas
narrower: Processos e técnicas agrícolas
narrower: Processos e técnicas de acabamento, isolamento e revestimento
narrower: Processos e técnicas de aplicação de materiais
narrower: Processos e técnicas de construção e conservação
narrower: Processos e técnicas de ensamblagem
narrower: Processos e técnicas de fabricação
narrower: Processos e técnicas de modelação do terreno
narrower: Processos e técnicas de preparação de suporte
narrower: Processos e técnicas de registo e decoração
narrower: Processos e técnicas piscatórias
narrower: Processos destrutivos
narrower: Processos patológicos

Processos e técnicas agrícolas
type: Concept
in scheme: Tesauro SIPA
preferred label: Agricultural processes and techniques @en
preferred label: Procédés et techniques agricoles @fr
preferred label: Processi e tecniche agricole @it
broader: Processos e técnicas
narrower: Processos e técnicas de condução vegetal
narrower: Processos e técnicas de plantação
narrower: Processos e técnicas de poda
narrower: Processos e técnicas de preparação do solo

Processos e técnicas de condução vegetal
type: Concept
in scheme: Tesauro SIPA
preferred label: Conduction processes and techniques @en
preferred label: Procédures et techniques de conduite @fr
preferred label: Processi e tecniche di guida @it
broader: Processos e técnicas agrícolas
narrower: Arjão
narrower: Componentes de processos e técnicas de condução vegetal
narrower: Latada
narrower: Processos e técnicas de condução vegetal segundo o produto

Arjão
type: Concept
scope note: Técnica de condução da vinha nas bordaduras dos campos, junto a várias árvores, interligada por fios de arame dispostos na horizontal, até à altura de 6 ou 8 metros, a que se arma a videira de modo a permiti-la subir e estender-se ao longo dos mesmos. Esta técnica é utilizada em zonas de regime agrícola intensivo, combinada com outras culturas, tendo como desvantagens o grande perigo que apresenta durante a poda e a vindima e a maior probabilidade de contrair as doenças das árvores.
in scheme: Tesauro SIPA
preferred label: Propping @en
preferred label: Échalas @fr
preferred label: Puntellamento; Paletti; Impalatura @it
broader: Processos e técnicas de condução vegetal

Componentes de processos e técnicas de condução vegetal
type: Concept
in scheme: Tesauro SIPA
preferred label: Process components and conduction techniques @en
preferred label: Composants du processus et techniques de conduite @fr
preferred label: Componenti di processo e tecniche di controllo @it
broader: Processos e técnicas de condução vegetal
narrower: Esteio (Componentes de processos e técnicas de condução vegetal)
narrower: Poio

Esteio (Componentes de processos e técnicas de condução vegetal)
type: Concept
scope note: Suporte vertical de xisto, cantaria, madeira ou cimento interligado a outros dispostos espaçadamente em fila no terreno por arames, para a condução de plantas trepadeiras.
in scheme: Tesauro SIPA
preferred label: Prop (Process components and conduction techniques) @en
preferred label: Étai (Composants du processus et techniques de conduite) @fr
preferred label: Palo della vite; Puntello; Sostegno (Componenti di processo e tecniche di controllo) @it
broader: Componentes de processos e técnicas de condução vegetal

Poio
type: Concept
scope note: Regionalismo que designa o esteio na Região Demarcada do Douro, onde é predominantemente de xisto.
in scheme: Tesauro SIPA
preferred label: Ledge @en
broader: Componentes de processos e técnicas de condução vegetal

Latada
type: Concept
scope note: Suporte de plantas trepadeiras, originalmente vinha, composta por esteios verticais de granito ou de cimento geralmente acima dos dois metros, que culminam em barras (as brancas) de ferro ou de madeira colocadas na horizontal, obliquamente (ramada em "dente de serra"), em forma de "Y", ou de modo a apresentarem um ligeiro prolongamento da barra horizontal para trás (ramada tipo "pistola"). Sustentam as videiras ocupando pouca terra e tornando mais fáceis o tratamento da vinha e as. Têm também uma função recreativa criando lugares de sombra no Verão pelo que muitas ramadas têm as suas brancas com elementos decorativos esculpidos em ferro. Encontram-se nos campos, nos quintais das cidades, nas entradas das casas ou nos jardins de casas senhoriais.
in scheme: Tesauro SIPA
preferred label: Trellis @en
preferred label: Spalliera @it
preferred label: Espalier; Treille @fr
alternative label: Ramada
broader: Processos e técnicas de condução vegetal
narrower: Latada alta
narrower: Latada baixa

Latada alta
type: Concept
scope note: Suporte para condução da vinha em estruturas muito baixas, por vezes quase rastejantes.
in scheme: Tesauro SIPA
preferred label: High trellis @en
preferred label: Espalier haut (Ramée) @fr
broader: Latada

Latada baixa
type: Concept
scope note: Suporte para condução da vinha em estruturas altas, normalmente sobre espaços improdutivos, como caminhos, largos, logradouros públicos, tanques, ou sobre outras culturas, como batatas, na orla dos campos ou, mais raramente, em regime de vinha contínua.
in scheme: Tesauro SIPA
preferred label: Low trellis @en
preferred label: Espalier bas (Ramée) @fr
broader: Latada

Processos e técnicas de condução vegetal segundo o produto
type: Concept
in scheme: Tesauro SIPA
preferred label: Product-based conduction processes and techniques @en
preferred label: Procédés et techniques de conduite selon le produit @fr
preferred label: Procedure e tecniche di gestione del vigneto in funzione del prodotto @it
broader: Processos e técnicas de condução vegetal
narrower: Processos e técnicas de condução da vinha

Processos e técnicas de condução da vinha
type: Concept
in scheme: Tesauro SIPA
preferred label: Vine conduction processes and techniques @en
preferred label: Procédés et techniques de conduite de la vigne @fr
preferred label: Metodi e tecniche di allevamento della vigna @it
broader: Processos e técnicas de condução vegetal segundo o produto
narrower: Bardo
narrower: Cordão (Processos e técnicas de condução da vinha)
narrower: Cruzeta (Processos e técnicas de condução da vinha)
narrower: Dente de serra (Processos e técnicas de condução da vinha)
narrower: Vinha do enforcado

Bardo
type: Concept
scope note: Técnica de condução de vinha contínua baixa, bastante antiga, composta por uma fila de suportes verticais, os esteios, regularmente dispostos, sustentando 3 a 6 arames horizontais, a que se armam as videiras, plantadas geralmente num compasso apertado.
in scheme: Tesauro SIPA
preferred label: Trellis @en
preferred label: Barde @fr
broader: Processos e técnicas de condução da vinha

Cordão (Processos e técnicas de condução da vinha)
type: Concept
scope note: Técnica de condução da vinha desenvolvida na Região dos Vinhos Verdes e atualmente em fase de expansão, consistindo numa estrutura vertical de suporte, os esteios, dispostos em fila, e espaçados regularmente entre si (2,5 a 3 metros), onde se apoiam arames, a partir de 1,2 metros de altura, de modo que a videira chegue aos arames sem ramificar, e depois se deite e estenda sobre eles.
in scheme: Tesauro SIPA
preferred label: Cordon (Vine conduction processes and techniques) @en
preferred label: Cordon (Procédés et techniques de conduite de la vigne) @fr
preferred label: Cordone (Metodi e tecniche di allevamento della vigna) @it
broader: Processos e técnicas de condução da vinha
narrower: Cordão simples
narrower: Cordão duplo

Cordão simples
type: Concept
scope note: Técnica em que se emprega apenas um arame de apoio à videira (a cerca de 1,5 metros do solo) e um ou dois arames mais finos de modo que a zona vegetativa se agarre e permita uma melhor exposição ao sol.
in scheme: Tesauro SIPA
preferred label: Single cordon @en
preferred label: Cordon simple @fr
preferred label: Cordone singolo @it
broader: Cordão (Processos e técnicas de condução da vinha)
narrower: Cordão ascendente
narrower: Cordão descendente

Cordão ascendente
type: Concept
in scheme: Tesauro SIPA
preferred label: Upward cordon @en
preferred label: Cordon ascendant @fr
preferred label: Cordone ascendente @it
broader: Cordão simples

Cordão descendente
type: Concept
in scheme: Tesauro SIPA
preferred label: Descending cordon @en
preferred label: Cordon descendant @fr
preferred label: Cordone discendente @it
broader: Cordão simples

Cordão duplo
type: Concept
scope note: Técnica em que se emprega dois arames para suportar as videiras, e um outro de apoio ao desenvolvimento vegetativo da mesma que corre no arame superior. Nesta técnica, as videiras são normalmente plantadas duas a duas, ficando uma no primeiro arame e a outra no segundo.
in scheme: Tesauro SIPA
preferred label: Double cordon @en
preferred label: Cordone doppio @it
alternative label: Cordão sobreposto
broader: Cordão (Processos e técnicas de condução da vinha)
narrower: Lira

Lira
type: Concept
in scheme: Tesauro SIPA
preferred label: Vine lyre @en
preferred label: Lire @fr
broader: Cordão duplo

Cruzeta (Processos e técnicas de condução da vinha)
type: Concept
scope note: Técnica de condução da vinha contínua desenvolvida na Região dos Vinhos Verdes e em voga a partir da década de 70 do séc. XX, consistindo num esteio vertical com um horizontal, formando cruz, com as extremidades dos braços das sucessivas cruzes unidas por um fio de arame, e junto da qual se plantam quatro videiras que, aos pares, acompanham os braços da cruz, seguindo cada uma delas o seu arame. O esteio vertical tem normalmente 2 metros de altura ou mais e o horizontal 1,5 a 2 metros, o qual é disposto entre 1,5 e 1,80 metros do solo para formar a cruz, distando as várias extremidades dos braços das cruzes entre 5 a 8 metros. As videiras são podadas de modo que a folhagem e os frutos se desenvolvam apenas na zona apoiada no arame, formando longos cordões paralelos. Esta técnica tem a desvantagem de dificultar o tratamento das videiras, já que, por exemplo, a morte de uma vide causa frequentemente a morte de todas as outras plantadas na mesma cova e cujas raízes cresceram interligadas.
in scheme: Tesauro SIPA
preferred label: Guyot (Vine conduction processes and techniques) @en
preferred label: Croix (Guyot) (Procédés et techniques de conduite de la vigne) @fr
preferred label: Croce (Guyot) (Metodi e tecniche di allevamento della vigna) @it
broader: Processos e técnicas de condução da vinha

Dente de serra (Processos e técnicas de condução da vinha)
type: Concept
scope note: Técnica de condução da vinha em estruturas altas oblíquas relativamente ao solo, surgindo em zonas de sistema de vinha contínua
in scheme: Tesauro SIPA
preferred label: Sawtooth (Vine conduction processes and techniques) @en
broader: Processos e técnicas de condução da vinha

Vinha do enforcado
type: Concept
scope note: Técnica de condução da vinha muito antiga, especialmente utilizada na Região dos Vinhos Verdes, em que se planta 1 a 4 videiras junto a uma árvore, e se deixa crescer livremente entrelaçada aos ramos das árvores, que servem de suporte e é podada radicalmente para dar maior destaque à videira. Tem como inconvenientes a produção de um vinho de qualidade inferior, devido à maior probabilidade da videira contrair doenças, dificultar os tratamentos, podas e vindima e à maturação tardia das uvas.
in scheme: Tesauro SIPA
preferred label: Hanged vineyard @en
alternative label: Uveira
broader: Processos e técnicas de condução da vinha

Processos e técnicas de plantação
type: Concept
in scheme: Tesauro SIPA
preferred label: Processes and techniques for planting @en
preferred label: Procédés et techniques de plantation @fr
preferred label: Processi e tecniche di impianto @it
broader: Processos e técnicas agrícolas
narrower: Processos e técnicas agrícolas de plantação segundo o produto

Processos e técnicas agrícolas de plantação segundo o produto
type: Concept
in scheme: Tesauro SIPA
preferred label: Agricultural processes and techniques for planting according to product @en
preferred label: Procédés et techniques agricoles de plantation en fonction du produit @fr
preferred label: Processi e tecniche di impianto agricolo in base al prodotto @it
broader: Processos e técnicas de plantação
narrower: Processos e técnicas agrícolas de plantação da vinha

Processos e técnicas agrícolas de plantação da vinha
type: Concept
in scheme: Tesauro SIPA
preferred label: Vine planting processes and farming techniques @en
preferred label: Procédés et techniques agricoles de plantation de la vigne @fr
preferred label: Processi e tecniche di impianto agricolo per la vite @it
broader: Processos e técnicas agrícolas de plantação segundo o produto
narrower: Vinha em terreno modelado
narrower: Vinha em terreno sem modelação

Vinha em terreno modelado
type: Concept
in scheme: Tesauro SIPA
preferred label: Vineyard on shaped ground @en
preferred label: Vignoble sur sol modelé @fr
preferred label: Vigneto su terreno sagomato @it
broader: Processos e técnicas agrícolas de plantação da vinha
narrower: Pilheiro
narrower: Vinha ao alto

Pilheiro
type: Concept
scope note: Técnica tradicional de plantação de vinha utilizada na Região Demarcada do Douro, durante os séculos XVIII e XIX, até à época em que a praga de filoxera destruiu os vinhedos da zona, em que as videiras eram colocadas em cavidades abertas a certa altura nos próprios muros de suporte dos socalcos, deixando os geios livres para outras culturas, nomeadamente arvenses ou cereais.
in scheme: Tesauro SIPA
preferred label: Ledge hole @en
alternative label: Boeiro
broader: Vinha em terreno modelado

Vinha ao alto
type: Concept
in scheme: Tesauro SIPA
preferred label: Vertical planting vineyard @en
preferred label: Vigne en hauteur @fr
preferred label: Vigneto su terreno alto @it
broader: Vinha em terreno modelado

Vinha em terreno sem modelação
type: Concept
scope note: Técnica de plantação da vinha ao longo de encostas suaves ou terrenos pouco declivosos sem modelação prévia do terreno. Dentro da Região Demarcada do Douro, esta técnica é quase inexistente na zona do Baixo Corgo, existente no Cima Corgo, que funciona como zona de transição, e predominante no Douro Superior.
in scheme: Tesauro SIPA
preferred label: Unmoulded vineyard @en
preferred label: Vigne en terrain non modelé @fr
preferred label: Vigneto su terreno non sagomato @it
broader: Processos e técnicas agrícolas de plantação da vinha

Processos e técnicas de poda
type: Concept
in scheme: Tesauro SIPA
preferred label: Pruning processes and techniques @en
preferred label: Procédés et techniques de taille @fr
preferred label: Processi e tecniche di potatura @it
broader: Processos e técnicas agrícolas
narrower: Topiária

Topiária
type: Concept
in scheme: Tesauro SIPA
preferred label: Topiaire @fr
preferred label: Topiaria @it
broader: Processos e técnicas de poda

Processos e técnicas de preparação do solo
type: Concept
in scheme: Tesauro SIPA
preferred label: Soil preparation processes and techniques @en
preferred label: Procédés et techniques de préparation du sol @fr
preferred label: Processi e tecniche di preparazione del terreno @it
broader: Processos e técnicas agrícolas
narrower: Arrotear
narrower: Surribar

Arrotear
type: Concept
scope note: Técnica de desbravar ou desmoitar o terreno inculto para posterior plantação. Na Região Demarcada do Douro esta técnica exigia tradicionalmente grande quantidade de mão-de-obra, proveniente de outras zonas do país e da Galiza, e era feita com dinamite ou à força de braços e de ferro. Posteriormente procedia-se ao delineamento de caminhos e conduções de água, e, por fim, ao terraceamento das encostas íngremes. Atualmente, esse processo é mecanizado.
in scheme: Tesauro SIPA
preferred label: Défricher @fr
preferred label: Dissodare @it
preferred label: Rotrwoing; Grub @en
broader: Processos e técnicas de preparação do solo

Surribar
type: Concept
scope note: Técnica de revolvimento do solo em regiões íngremes e pedregosas, como a Região Demarcada do Douro, em que se procedia à separação das pedras que seriam empregues na construção dos socalcos e se tornava o solo mais fértil. Na Região Demarcada do Douro, a surriba tradicionalmente era feita com instrumentos manuais, como o martelo de bico, o ponteiro, picareta e outros, e atualmente é mecanizada.
in scheme: Tesauro SIPA
preferred label: Défoncer @fr
preferred label: Zappare @it
preferred label: Surface working; Scarify @en
broader: Processos e técnicas de preparação do solo

Processos e técnicas de acabamento, isolamento e revestimento
type: Concept
in scheme: Tesauro SIPA
preferred label: Processes and techniques for finishing, insulation and coating @en
preferred label: Procédés et techniques de finition, d'isolation et de revêtement @fr
preferred label: Processi e tecniche di finitura, isolamento e rivestimento @it
broader: Processos e técnicas
narrower: Processos e técnicas de acabamento, isolamento e revestimento genéricos
narrower: Processos e técnicas de acabamento, isolamento e revestimento segundo o material

Processos e técnicas de acabamento, isolamento e revestimento genéricos
type: Concept
in scheme: Tesauro SIPA
preferred label: Generic finishing, insulation and coating processes and techniques @en
preferred label: Procédés et techniques génériques de finition, d'isolation et de revêtement @fr
preferred label: Processi e tecniche generiche di finitura, isolamento e rivestimento @it
broader: Processos e técnicas de acabamento, isolamento e revestimento
narrower: Acabamento
narrower: Boiserie
narrower: Brunido
narrower: Caiação
narrower: Capeado
narrower: Escaiola
narrower: Estucagem
narrower: Isolamento
narrower: Polimento
narrower: Pintura (Processos e técnicas genéricos de acabamento, isolamento e revestimento)
narrower: Reboco (Processos e técnicas genéricos de acabamento, isolamento e revestimento)

Acabamento
type: Concept
in scheme: Tesauro SIPA
preferred label: Finition @fr
preferred label: Finitura @it
preferred label: Finishing; Trimming @en
broader: Processos e técnicas de acabamento, isolamento e revestimento genéricos
narrower: Acabamento rugoso

Acabamento rugoso
type: Concept
in scheme: Tesauro SIPA
preferred label: Rough; Rugged finishing @en
preferred label: Finition rugueuse @fr
preferred label: Finitura ruvida @it
broader: Acabamento

Boiserie
type: Concept
in scheme: Tesauro SIPA
broader: Processos e técnicas de acabamento, isolamento e revestimento genéricos

Brunido
type: Concept
scope note: Técnica de acabamento de uma superfície, muito polida, luzidia e brilhante.
in scheme: Tesauro SIPA
preferred label: Bruni @fr
preferred label: Brunito @it
preferred label: Burnished; Brushed @en
broader: Processos e técnicas de acabamento, isolamento e revestimento genéricos

Caiação
type: Concept
scope note: Pintura de uma superfície com cal.
in scheme: Tesauro SIPA
preferred label: Blanchiment @fr
preferred label: Imbiancatura @it
preferred label: Facing; Whitewash @en
broader: Processos e técnicas de acabamento, isolamento e revestimento genéricos

Capeado
type: Concept
in scheme: Tesauro SIPA
preferred label: Enveloppé @fr
preferred label: Ammantato @it
preferred label: Covered; Cloak @en
broader: Processos e técnicas de acabamento, isolamento e revestimento genéricos

Escaiola
type: Concept
in scheme: Tesauro SIPA
preferred label: Plâtrage @fr
preferred label: Scagliola @en
broader: Processos e técnicas de acabamento, isolamento e revestimento genéricos

Estucagem
type: Concept
in scheme: Tesauro SIPA
preferred label: Plastering @en
preferred label: Stucattura @it
preferred label: Stucage @fr
broader: Processos e técnicas de acabamento, isolamento e revestimento genéricos
narrower: Estucagem decorativa

Estucagem decorativa
type: Concept
in scheme: Tesauro SIPA
preferred label: Decorative plastering @en
preferred label: Stucattura decorativa @it
preferred label: Stucage décoratif @fr
broader: Estucagem

Isolamento
type: Concept
in scheme: Tesauro SIPA
preferred label: Insulation @en
preferred label: Isolation @fr
broader: Processos e técnicas de acabamento, isolamento e revestimento genéricos
narrower: Isolamento térmico pelo exterior
related: Materiais e produtos
modified: 2025-09-23T13:13:25

Isolamento térmico pelo exterior
type: Concept
scope note: Sistema de isolamento térmico dos edifícios pelo exterior em que são fixadas placas de isolante à parede e sobre estas assenta um reboco modificado que vai assegurar a impermeabilidade, a integridade do isolamento contra choques e a decoração do paramento. Este sistema minimiza as transferências de calor para um exterior frio mas também evita as transferências de calor a partir de um exterior demasiado quente. O reboco acaba por desempenhar também um papel resistente pois, ao invés da aplicação tradicional, assenta sobre uma superfície com baixa compacidade e elástica. Daí que tenha de ter a tenacidade suficiente para proteger o isolamento contra choques do exterior, assegurando a impermeabilidade do paramento. Para assumir este papel, o reboco tem de ter boa aderência ao isolamento, tem de ser hidrófugo (repelir a água) e tem de estar armado, pois é a armadura que lhe vai conferir a resistência a choques e assegurar a integridade do sistema. A espessura normal deste reboco encontra-se entre os 5 e 7 mm. O sistema ETICS está muito sujeito à colonização biológica. O seu acabamento rugoso propicia a fixação dos micro-organismos; a concentração de calor e de humidade à superfície, devido ao isolamento que contém, cria boas condições para o seu desenvolvimento e o revestimento sintético de acabamento fornece os nutrientes necessários. Será necessário que na argamassa sejam incluídos aditivos fungicidas para fazer face ao problema e, nesse caso, o ETICS funciona como um bom revestimento para aplicação na faixa costeira.
in scheme: Tesauro SIPA
preferred label: External thermal insulation @en
preferred label: Isolation thermique extérieure @fr
preferred label: Isolamento termico esterno @it
alternative label: ETICS
alternative label: Dryvit
broader: Isolamento

Polimento
type: Concept
in scheme: Tesauro SIPA
preferred label: Polishing @en
preferred label: Polissage @fr
preferred label: Lucidatura @it
broader: Processos e técnicas de acabamento, isolamento e revestimento genéricos

Pintura (Processos e técnicas genéricos de acabamento, isolamento e revestimento)
type: Concept
scope note: Acabamento final de uma superfície ou elemento arquitetónico constituído por um conjunto de camadas de produtos que, aplicados uns sobre os outros pela ordem conveniente, constituem um revestimento decorativo e de proteção contra os agentes climáticos. Os esquemas tradicionais de pintura com tinta em multicamada são constituídos, por ordem de aplicação, por primário, subcapa e acabamento. O principal objetivo do primário é impregnar a camada superficial da madeira para garantir uma perfeita ligação entre o substrato a as seguintes camadas do revestimento. Também evita a absorção excessiva de humidade pela madeira. Antes da sua aplicação, deve-se preparar e limpar cuidadosamente a superfície.
in scheme: Tesauro SIPA
preferred label: Painting (Generic processes and techniques for finishing, insulation and coating) @en
preferred label: Peinture (Procédés et techniques génériques pour la finition, l'isolation et le revêtement) @fr
preferred label: Verniciatura (Processi e tecniche generici per finitura, isolamento e rivestimento) @it
broader: Processos e técnicas de acabamento, isolamento e revestimento genéricos
narrower: Demão

Demão
type: Concept
scope note: Cada uma das camadas de pintura de uma superfície.
in scheme: Tesauro SIPA
preferred label: Paint coat @en
preferred label: Couche de peinture @fr
preferred label: Strato di vernice @it
broader: Pintura (Processos e técnicas genéricos de acabamento, isolamento e revestimento)
narrower: Primária
narrower: Subcapa
narrower: Acabamento

Primária
type: Concept
in scheme: Tesauro SIPA
preferred label: Primer @en
preferred label: Primaire @fr
preferred label: Primario @it
broader: Demão

Subcapa
type: Concept
in scheme: Tesauro SIPA
preferred label: Undercoating @en
preferred label: Sous-couche @fr
preferred label: Sottofondo @it
broader: Demão

Acabamento
type: Concept
in scheme: Tesauro SIPA
preferred label: Finishing @en
preferred label: Finition @fr
preferred label: Finitura @it
broader: Demão

Reboco (Processos e técnicas genéricos de acabamento, isolamento e revestimento)
type: Concept
scope note: Revestimento de espessura significativa, de modo a poder cobrir as irregularidades existentes nos paramentos em tosco, executado com argamassas constituídas por um ou mais ligantes minerais, nomeadamente cimento ou cal hidráulica, areia, água e, por vezes, adições e adjuvantes. As argamassas para reboco são doseadas e preparadas em obra, utilizando-se geralmente areia da região em que decorre a obra. É muito importante que tanto a areia como a água utilizada estejam livres de sais. Na aplicação de reboco em paramentos exteriores, são executadas normalmente três camadas: o crespido ou salpisco, a camada base (constituída por uma ou duas camadas) e a camada de acabamento.
in scheme: Tesauro SIPA
preferred label: Enduit (Procédés et techniques génériques de finition, d'isolation et de revêtement) @fr
preferred label: Rivestimento (Processi e tecniche generiche di finitura, isolamento e rivestimento) @it
preferred label: Plaster; Parget (Generic finishing, insulation and covering processes and techniques) @en
broader: Processos e técnicas de acabamento, isolamento e revestimento genéricos
narrower: Reboco de argamassa bastarda
narrower: Reboco de argamassa de cal e areia
narrower: Reboco de argamassa de cimento
narrower: Reboco monocamada

Reboco de argamassa bastarda
type: Concept
in scheme: Tesauro SIPA
preferred label: Bastard mortar plaster @en
preferred label: Enduit au mortier de chaux @fr
preferred label: Intonaco con malta di calce @it
broader: Reboco (Processos e técnicas genéricos de acabamento, isolamento e revestimento)

Reboco de argamassa de cal e areia
type: Concept
in scheme: Tesauro SIPA
preferred label: Lime mortar and sand plaster @en
preferred label: Enduit de mortier silico-calcaire @fr
preferred label: Intonaco di malta silico-calcarea @it
alternative label: Reboco de argamassa tradicional
broader: Reboco (Processos e técnicas genéricos de acabamento, isolamento e revestimento)

Reboco de argamassa de cimento
type: Concept
in scheme: Tesauro SIPA
preferred label: Cement mortar plaster @en
preferred label: Enduit au mortier de ciment @fr
preferred label: Intonaco di malta cementizia @it
broader: Reboco (Processos e técnicas genéricos de acabamento, isolamento e revestimento)

Reboco monocamada
type: Concept
scope note: Revestimentos espessos, com uma só camada, constituídos por uma argamassa pré-doseada, composta por cimento, agregados e areia de qualidade e granulometria criteriosamente selecionada, hidrófugos, vários adjuvantes e aditivos orgânicos e pigmentos minerais que lhe conferem uma melhoria das suas propriedades, permitindo obter um acabamento de parede impermeável. Este tipo de reboco em camada única pode ser aplicado em uma ou duas demãos, atingindo geralmente uma espessura final de 20 mm. Se for aplicado em duas demãos, com intervalo de secagem entre ambas, os eventuais problemas de fissuração poderão não ser tão graves, atingindo apenas a camada externa. É geralmente fornecido em pó pré-doseado em fábrica.
in scheme: Tesauro SIPA
preferred label: Single layer plaster @en
preferred label: Enduit monocouche @fr
preferred label: Rivestimento monostrato @it
broader: Reboco (Processos e técnicas genéricos de acabamento, isolamento e revestimento)

Processos e técnicas de acabamento, isolamento e revestimento segundo o material
type: Concept
in scheme: Tesauro SIPA
preferred label: Processes and techniques for finishing, insulation and coating according to material @en
preferred label: Procédés et techniques de finition, d'isolation et de revêtement selon les matériaux @fr
preferred label: Processi e tecniche di finitura, isolamento e rivestimento secondo i materiali @it
broader: Processos e técnicas de acabamento, isolamento e revestimento
narrower: Processos e técnicas de acabamento, isolamento e revestimento de madeira
narrower: Processos e técnicas de acabamento, isolamento e revestimento de metal
narrower: Processos e técnicas de acabamento, isolamento e revestimento de pedra

Processos e técnicas de acabamento, isolamento e revestimento de madeira
type: Concept
in scheme: Tesauro SIPA
preferred label: Processes and techniques for wood finishing, insulation and cladding @en
preferred label: Procédés et techniques de finition, d'isolation et de revêtement du bois @fr
preferred label: Processi e tecniche di finitura, isolamento e rivestimento del legno @it
broader: Processos e técnicas de acabamento, isolamento e revestimento segundo o material
narrower: Acepilhar
narrower: Almagrar
narrower: Atochar
narrower: Falquejar
narrower: Gastar
narrower: Grolar
narrower: Lacar
narrower: Entalhar

Acepilhar
type: Concept
in scheme: Tesauro SIPA
preferred label: Raboter @fr
preferred label: Piallare @it
preferred label: Polishing; Burnishing @en
broader: Processos e técnicas de acabamento, isolamento e revestimento de madeira

Almagrar
type: Concept
in scheme: Tesauro SIPA
preferred label: Ruddling @en
preferred label: Amalgamer @fr
preferred label: Amalgamare @it
broader: Processos e técnicas de acabamento, isolamento e revestimento de madeira

Atochar
type: Concept
in scheme: Tesauro SIPA
preferred label: Stringere @it
preferred label: Wedging; Stuffing @en
preferred label: Presser; Bourrer @fr
broader: Processos e técnicas de acabamento, isolamento e revestimento de madeira

Falquejar
type: Concept
in scheme: Tesauro SIPA
preferred label: Rough-hew @en
preferred label: Équarrir; Dégrossir @fr
preferred label: Squadrare; Rifinitura; Irruvidimento @it
broader: Processos e técnicas de acabamento, isolamento e revestimento de madeira

Gastar
type: Concept
in scheme: Tesauro SIPA
preferred label: Overwear @en
preferred label: Rosicchiamento @it
preferred label: Ronger @fr
broader: Processos e técnicas de acabamento, isolamento e revestimento de madeira

Grolar
type: Concept
in scheme: Tesauro SIPA
preferred label: Roughgrinding @en
preferred label: Broyage (Meulage) @fr
preferred label: Smerigliatura (Rettifica) @it
broader: Processos e técnicas de acabamento, isolamento e revestimento de madeira

Lacar
type: Concept
in scheme: Tesauro SIPA
preferred label: Enamelling @en
preferred label: Laquer @fr
preferred label: Laccatura @it
alternative label: Acharoar
broader: Processos e técnicas de acabamento, isolamento e revestimento de madeira

Entalhar
type: Concept
scope note: Técnica de desbaste executada sobre um suporte sólido, através do corte, cinzelagem ou abrasão de modo a criar uma forma determinada.
in scheme: Tesauro SIPA
preferred label: Carving @en
preferred label: Entailler @fr
preferred label: Intagliare (Scolpire) @it
broader: Processos e técnicas de acabamento, isolamento e revestimento de madeira
narrower: Talha dourada
narrower: Talha prateada

Talha dourada
type: Concept
in scheme: Tesauro SIPA
preferred label: Gilded carving @en
preferred label: Boiserie doré @fr
preferred label: Taglio dorato @it
broader: Entalhar

Talha prateada
type: Concept
in scheme: Tesauro SIPA
preferred label: Silver carving @en
preferred label: Boiserie argenté @fr
preferred label: Taglio argentato @it
broader: Entalhar

Processos e técnicas de acabamento, isolamento e revestimento de metal
type: Concept
in scheme: Tesauro SIPA
preferred label: Metal finishing, insulation and coating techniques and processes @en
preferred label: Procédés et techniques de finition, d’isolation et de revêtement des métaux @fr
preferred label: Processi e tecniche di finitura, isolamento e rivestimento dei metalli @it
broader: Processos e técnicas de acabamento, isolamento e revestimento segundo o material
narrower: Anodização
narrower: Termolacagem

Anodização
type: Concept
scope note: Consiste na formação induzida de uma camada protetora de óxidos de alumínio na superfície de um metal. O alumínio e as ligas de alumínio são resistentes à corrosão devido à formação de uma película protetora de óxido de alumínio (alumina) na sua superfície. Devido ao facto de essa película ser muito fina, habitualmente produz-se uma película artificial através de anodização (chama-se anodização porque o metal é ligado como ânodo num banho eletrolítico) combinada com um processo de selagem. É um tratamento adequado a todos os tipos de ambientes, mas que é particularmente eficaz na proteção do alumínio em ambiente marítimo. O bom comportamento à corrosão do alumínio anodizado depende da qualidade da camada de anodização, ou seja, da sua colmatagem e classe de espessura, que deve ser adequada à agressividade do ambiente de exposição. Para aplicações no exterior, o revestimento anódico deverá ter uma classe de espessura mínima de 15m e, em ambientes agressivos (industriais, marítimos e mistos), deverá ser especificada uma classe de espessura mínima de 20m ou 25m. Como o revestimento obtido é poroso, a coloração (pode efetuar-se por mecanismos de interferência ótica ou por utilização de pigmentos, durante ou depois da anodização) do alumínio pode ter uma dupla função: aspeto estético do perfil e atenuação dos poros. Entre os processos de anodização existentes, recomendam-se os não poluentes para ligas de alumínio através de um banho sulfúrico/bórico.
in scheme: Tesauro SIPA
preferred label: Anodising @en
preferred label: Anodisation @fr
preferred label: Anodizzazione @it
alternative label: Revestimento de óxidos
broader: Processos e técnicas de acabamento, isolamento e revestimento de metal

Termolacagem
type: Concept
scope note: A termolacagem, ou lacagem a quente, é um tipo de pintura que funciona como acabamento da superfície do alumínio, mas também como tratamento. É um processo electroestático com pós termo-endurecíveis (resinas epoxi-poliéster ou poliéster) aplicados numa camada uniforme. As peças são recozidas em estufa ou forno, a temperaturas determinadas, obtendo-se um acabamento liso e brilhante. A termolacagem permite obter uma vasta gama de cores, um revestimento muito resistente aos choques e à corrosão e com uma boa solidez à luz solar e ao calor. Este método é adequado a uma grande variedade de produtos como peças, perfis e tubos. O alumínio lacado deverá receber previamente uma pré-anodização, de cerca de 4 a 5 m, de modo a que a sua proteção seja bem conseguida.
in scheme: Tesauro SIPA
preferred label: Thermolacquering @en
preferred label: Thermolaquage @fr
preferred label: Termolaccatura @it
broader: Processos e técnicas de acabamento, isolamento e revestimento de metal

Processos e técnicas de acabamento, isolamento e revestimento de pedra
type: Concept
in scheme: Tesauro SIPA
preferred label: Processes and techniques for finishing, insulating and coating stone @en
preferred label: Procédés et techniques de finition, d'isolation et de revêtement de la pierre @fr
preferred label: Processi e tecniche di finitura, isolamento e rivestimento della pietra @it
broader: Processos e técnicas de acabamento, isolamento e revestimento segundo o material
narrower: Processos e técnicas de acabamento, isolamento e revestimento da pedra segundo o tipo de superfície

Processos e técnicas de acabamento, isolamento e revestimento da pedra segundo o tipo de superfície
type: Concept
in scheme: Tesauro SIPA
preferred label: Processes and techniques for finishing, insulating and coating stone according to surface type @en
preferred label: Procédés et techniques de finition, d'isolation et de revêtement de la pierre par type de surface @fr
preferred label: Processi e tecniche di finitura, isolamento e rivestimento della pietra in base al tipo di superficie @it
broader: Processos e técnicas de acabamento, isolamento e revestimento de pedra
narrower: Processos e técnicas de acabamento, isolamento e revestimento de superfícies lisas
narrower: Processos e técnicas de acabamento, isolamento e revestimento de superfícies rugosas

Processos e técnicas de acabamento, isolamento e revestimento de superfícies lisas
type: Concept
in scheme: Tesauro SIPA
preferred label: Processes and techniques for finishing, insulating and coating smooth surfaces @en
preferred label: Procédés et techniques de finition, d'isolation et de revêtement des surfaces lisses @fr
preferred label: Processi e tecniche di finitura, isolamento e rivestimento di superfici lisce @it
broader: Processos e técnicas de acabamento, isolamento e revestimento da pedra segundo o tipo de superfície
narrower: Amaciado
narrower: Cafelar
narrower: Eirar
narrower: Jato de areia

Amaciado
type: Concept
scope note: Acabamento que origina uma superfície suave, totalmente lisa, sem brilho, que permite visualizar a coloração da pedra. Origina uma superfície acolhedora e confortável. É indicado para revestimentos e pavimentos.
in scheme: Tesauro SIPA
preferred label: Adouci @fr
preferred label: Levigato @it
preferred label: Softning; Smoothing @en
broader: Processos e técnicas de acabamento, isolamento e revestimento de superfícies lisas

Cafelar
type: Concept
in scheme: Tesauro SIPA
preferred label: Plaster applying @en
broader: Processos e técnicas de acabamento, isolamento e revestimento de superfícies lisas

Eirar
type: Concept
in scheme: Tesauro SIPA
preferred label: Sanding @en
preferred label: Dessécher @fr
preferred label: Polvere @it
broader: Processos e técnicas de acabamento, isolamento e revestimento de superfícies lisas

Jato de areia
type: Concept
in scheme: Tesauro SIPA
preferred label: Sandblasting @en
preferred label: Sablage (Jet de sable) @fr
preferred label: Sabbiatura (Getto di sabbia) @it
hidden label: Jacto de areia
broader: Processos e técnicas de acabamento, isolamento e revestimento de superfícies lisas

Processos e técnicas de acabamento, isolamento e revestimento de superfícies rugosas
type: Concept
in scheme: Tesauro SIPA
preferred label: Processes and techniques for finishing, insulating and coating rough surfaces @en
preferred label: Procédés et techniques de finition, d'isolation et de revêtement des surfaces rugueuses @fr
preferred label: Processi e tecniche di finitura, isolamento e rivestimento di superfici ruvide @it
broader: Processos e técnicas de acabamento, isolamento e revestimento da pedra segundo o tipo de superfície
narrower: Ancestral
narrower: Bujardado
narrower: Escacilhado
narrower: Escodado
narrower: Esponteirado
narrower: Flamejado
narrower: Gastejado
narrower: Riscado
narrower: Serrado

Ancestral
type: Concept
in scheme: Tesauro SIPA
preferred label: Ancestrale @fr
alternative label: Escovado
broader: Processos e técnicas de acabamento, isolamento e revestimento de superfícies rugosas

Bujardado
type: Concept
scope note: Acabamento dado à superfície duma pedra, utilizando as bujardas, manuais ou em máquina. Consiste em saliências e depressões obtidas por intermédio de um punção de 4 (pico grosso) a 25 dentes (pico fino) em formas cónicas ou piramidais.
in scheme: Tesauro SIPA
preferred label: Bouchardé @fr
preferred label: Bocciardato @it
preferred label: Bush-hammered; Textured @en
broader: Processos e técnicas de acabamento, isolamento e revestimento de superfícies rugosas
narrower: Pico grosso
narrower: Pico médio
narrower: Pico fino

Pico grosso
type: Concept
in scheme: Tesauro SIPA
preferred label: Thick spike @en
preferred label: Pic grossier @fr
preferred label: Punta grossa @it
broader: Bujardado

Pico médio
type: Concept
in scheme: Tesauro SIPA
preferred label: Medium spike @en
preferred label: Pic moyen @fr
preferred label: Punta media @it
broader: Bujardado

Pico fino
type: Concept
in scheme: Tesauro SIPA
preferred label: Thin spike @en
preferred label: Pointe fine @fr
preferred label: Punta fine @it
broader: Bujardado

Escacilhado
type: Concept
scope note: Acabamento dado à superfície duma pedra utilizando um martelo de ponta de percussão ou um escopro de ponta em gume, aplicado em plano tangencial à superfície da pedra. Este tipo de acabamento não é adequado a pavimentos sendo geralmente aplicado em paramentos.
in scheme: Tesauro SIPA
preferred label: Sandblasted @en
preferred label: Sablé @fr
preferred label: Sabbiato @it
broader: Processos e técnicas de acabamento, isolamento e revestimento de superfícies rugosas

Escodado
type: Concept
in scheme: Tesauro SIPA
preferred label: Bush-hammered @en
preferred label: Ciselé @fr
preferred label: Scalpellato @it
broader: Processos e técnicas de acabamento, isolamento e revestimento de superfícies rugosas

Esponteirado
type: Concept
in scheme: Tesauro SIPA
preferred label: Rough-hew @en
preferred label: Taillé @fr
preferred label: Sbozzato @it
broader: Processos e técnicas de acabamento, isolamento e revestimento de superfícies rugosas

Flamejado
type: Concept
scope note: Acabamento produzido através da exposição da pedra a altas temperaturas, quer através de um maçarico ou através de chapas metálicas quentes. A pedra é queimada de acordo com os seus componentes minerais originando um relevo irregular. Pode ser utilizado para pavimentos.
in scheme: Tesauro SIPA
preferred label: Enflammé @fr
preferred label: Fiammeggiato @it
preferred label: Flamed; Blazed @en
broader: Processos e técnicas de acabamento, isolamento e revestimento de superfícies rugosas

Gastejado
type: Concept
in scheme: Tesauro SIPA
preferred label: Fluted; Corrugated @en
broader: Processos e técnicas de acabamento, isolamento e revestimento de superfícies rugosas

Riscado
type: Concept
scope note: Acabamento realizado com uma fresa específica dando um aspeto único à pedra. É dos acabamentos mais dispendiosos e demora algum tempo a ser executado.
in scheme: Tesauro SIPA
preferred label: Crossed-out @en
preferred label: Rayé @fr
preferred label: Rigato @it
broader: Processos e técnicas de acabamento, isolamento e revestimento de superfícies rugosas

Serrado
type: Concept
scope note: Após a extração dos blocos de pedra das pedreiras estes são serrados para a obtenção de chapas ficando com um aspeto rugoso, com algum atrito o que o faz um acabamento útil para pavimentação. É o acabamento mais económico pois todos os outros são realizados sobre o material serrado. É particularmente utilizado em espaços exteriores com grande utilização, onde um acabamento polido rapidamente perderia o brilho característico, um acabamento amaciado não seria suficientemente antiderrapante e um acabamento antiderrapante seria mais dispendioso.
in scheme: Tesauro SIPA
preferred label: Sawdusted @en
preferred label: Scié @fr
preferred label: Seghettato @it
broader: Processos e técnicas de acabamento, isolamento e revestimento de superfícies rugosas

Processos e técnicas de aplicação de materiais
type: Concept
in scheme: Tesauro SIPA
preferred label: Material application processes and techniques @en
preferred label: Procédés et techniques d'application des matériaux @fr
preferred label: Processi e tecniche di applicazione dei materiali @it
broader: Processos e técnicas
narrower: Processos e técnicas específicos de aplicação de materiais
narrower: Processos e técnicas genéricos de aplicação de materiais

Processos e técnicas específicos de aplicação de materiais
type: Concept
in scheme: Tesauro SIPA
preferred label: Material-specific application processes and techniques @en
preferred label: Procédés et techniques d'application spécifiques aux matériaux @fr
preferred label: Processi e tecniche di applicazione specifici per i materiali @it
broader: Processos e técnicas de aplicação de materiais
narrower: Processos e técnicas específicos de aplicação de materiais cerâmicos

Processos e técnicas específicos de aplicação de materiais cerâmicos
type: Concept
in scheme: Tesauro SIPA
preferred label: Specific application processes and techniques for ceramic materials @en
preferred label: Procédés et techniques d'application spécifiques aux matériaux céramiques @fr
preferred label: Processi e tecniche di applicazione specifici per i materiali ceramici @it
broader: Processos e técnicas específicos de aplicação de materiais
narrower: Alicatado

Alicatado
type: Concept
scope note: Técnica de revestimento cerâmico formado por fragmentos de azulejo monocromo, combinados em variadas cores e formas geométricas constituindo esquemas decorativos que vão do mais simples ao mais complexo. Pode ser utilizado em revestimentos parietais ou em revestimentos de pavimentos, predominantemente nos séculos XVI e XVII.
in scheme: Tesauro SIPA
preferred label: Tiled @en
preferred label: Carrelé @fr
preferred label: Piastrellato @it
broader: Processos e técnicas específicos de aplicação de materiais cerâmicos

Processos e técnicas genéricos de aplicação de materiais
type: Concept
in scheme: Tesauro SIPA
preferred label: Generic material application processes and techniques @en
preferred label: Procédés et techniques d'application générique des matériaux @fr
preferred label: Processi e tecniche di applicazione di materiali generici @it
broader: Processos e técnicas de aplicação de materiais
narrower: Aparelho
narrower: Embrechado
narrower: Embutido
narrower: Enxaquetado
narrower: Mosaico
narrower: Padronagem

Aparelho
type: Concept
scope note: Modo de construção em que os silhares que constituem um elemento arquitetónico são de regulares, permitindo a sua disposição em diferentes formas.
in scheme: Tesauro SIPA
preferred label: Brickwork @en
preferred label: Appareil @fr
preferred label: Apparecchiatura muraria @it
broader: Processos e técnicas genéricos de aplicação de materiais
narrower: Aparelho almofadado
narrower: Aparelho ciclópico
narrower: Aparelho em espinha de peixe
narrower: Aparelho em silharia fendida
narrower: Aparelho enxaquetado
narrower: Aparelho incerto
narrower: Aparelho isódomo
narrower: Aparelho oblíquo
narrower: Aparelho plágico
narrower: Aparelho quadrado
narrower: Aparelho reticulado
narrower: Aparelho rusticado
narrower: Aparelho vermiculado

Aparelho almofadado
type: Concept
scope note: Técnica construtiva em que os silhares são colocados com a face exterior plana, com arestas oblíquas, criando uma almofada.
in scheme: Tesauro SIPA
preferred label: Padded brickwork @en
preferred label: Maçonnerie de briques rembourrées @fr
preferred label: Apparecchiatura muraria imbottita @it
broader: Aparelho
narrower: Aparelho em ponta de diamante

Aparelho em ponta de diamante
type: Concept
scope note: Técnica construtiva em que os silhares estão talhados em quatro faces, formando uma pirâmide.
in scheme: Tesauro SIPA
preferred label: Diamond tipped brickwork @en
preferred label: Appareil à pointe diamantée @fr
preferred label: Apparecchiatura muraria a punta diamantata @it
broader: Aparelho almofadado

Aparelho ciclópico
type: Concept
scope note: Técnica construtiva das civilizações micénica e etrusca, formando um falso aparelho de grandes blocos irregulares, com as juntas preenchidas com pequenas pedras.
in scheme: Tesauro SIPA
preferred label: Cyclopean brickwork @en
preferred label: Appareil cyclopéen @fr
preferred label: Apparecchiatura muraria ciclopica @it
broader: Aparelho

Aparelho em espinha de peixe
type: Concept
scope note: Elemento arquitetónico em que os silhares são dispostos diagonalmente, a partir de um eixo, inclinando-se as juntas para a esquerda e direita, de forma alternada. Bastante utilizado a partir da arte romana.
in scheme: Tesauro SIPA
preferred label: Herringbone brickwork @en
preferred label: Appareil à chevrons @fr
preferred label: Apparecchiatura muraria a spina di pesce @it
broader: Aparelho

Aparelho em silharia fendida
type: Concept
in scheme: Tesauro SIPA
preferred label: Split ashlar brickwork @en
preferred label: Appareil en pierre de taille fendue @fr
preferred label: Apparecchiatura muraria in pietra spaccata @it
broader: Aparelho

Aparelho enxaquetado
type: Concept
scope note: Técnica construtiva em que os silhares são quadrados, da mesma dimensão, um deles colocado de forma saliente, criando um padrão que se repete.
in scheme: Tesauro SIPA
preferred label: Checked brickwork @en
preferred label: Appareil échiqueté @fr
preferred label: Apparecchiatura muraria a scacchiera @it
broader: Aparelho

Aparelho incerto
type: Concept
scope note: Elemento arquitetónico composto por silhares de tamanhos e formatos diferentes
in scheme: Tesauro SIPA
preferred label: Opus incertum @en
broader: Aparelho

Aparelho isódomo
type: Concept
scope note: Técnica construtiva em que os silhares são colocados em fiadas de igual altura.
in scheme: Tesauro SIPA
preferred label: Isodome brickwork (Opus isodomum) @en
preferred label: Appareil isodome (Opus isodomum) @fr
preferred label: Apparecchiatura muraria isodome (Opus isodomum) @it
broader: Aparelho
narrower: Aparelho em lamela
narrower: Aparelho pseudo-isódomo

Aparelho em lamela
type: Concept
scope note: Elemento arquitetónico construído por silhares numa alternância de fiadas salientes e reentrantes.
in scheme: Tesauro SIPA
preferred label: Lamellar brickwork @en
preferred label: Appareil lamellaire @fr
preferred label: Apparecchiatura muraria lamellare @it
broader: Aparelho isódomo

Aparelho pseudo-isódomo
type: Concept
scope note: Técnica construtiva em que os silhares são colocados em duas fiadas de diferentes alturas, dispostas de forma alternada.
in scheme: Tesauro SIPA
preferred label: Pseudo-isodome brickwork @en
preferred label: Appareil pseudo-isodomique @fr
preferred label: Apparecchiatura muraria pseudo-isodome @it
broader: Aparelho isódomo

Aparelho oblíquo
type: Concept
scope note: Técnica construtiva em que as juntas laterais dos silhares nunca ficam em posição vertical.
in scheme: Tesauro SIPA
preferred label: Slanted brickwork @en
preferred label: Appareil oblique @fr
preferred label: Apparecchiatura muraria obliqua @it
broader: Aparelho

Aparelho plágico
type: Concept
in scheme: Tesauro SIPA
preferred label: Polygonal masonry @en
preferred label: Appareil polygonal @fr
preferred label: Apparecchio poligonale @it
broader: Aparelho

Aparelho quadrado
type: Concept
scope note: Elemento arquitetónico constituído por silhares quadrangulares, regulares, lembrando um tabuleiro de xadrez.
in scheme: Tesauro SIPA
preferred label: Opus quadratum @en
broader: Aparelho

Aparelho reticulado
type: Concept
scope note: Técnica construtiva em que as juntas se colocam como um tabuleiro de xadrez.
in scheme: Tesauro SIPA
preferred label: Opus reticulatum @fr
preferred label: Reticulated brickwork; Opus reticulatum @en
broader: Aparelho

Aparelho rusticado
type: Concept
scope note: Elemento arquitetónico constituído por silhares cuja face visível não é afeiçoada ou possui talhe grosseiro.
in scheme: Tesauro SIPA
preferred label: Rusticated brickwork @en
preferred label: Appareil de bossage rustique @fr
preferred label: Apparecchiatura muraria bugnata @it
broader: Aparelho

Aparelho vermiculado
type: Concept
scope note: Técnica construtiva em que os elementos constituintes são colocados formando curvaturas, semelhantes à disposição de um verme quando se desloca.
in scheme: Tesauro SIPA
preferred label: Vermiculated brickwork @en
preferred label: Appareil vermiculé @fr
preferred label: Apparecchiatura muraria vermicolata @it
broader: Aparelho

Embrechado
type: Concept
scope note: Revestimentos decorativos, formados por conchas, pedras miúdas, fragmentos cerâmicos e vidro, recorrentemente utilizado nos séculos XVII e XVIII, influenciados pelas decorações do mesmo tipo, utilizadas nos jardins italianos do século XVI.
in scheme: Tesauro SIPA
preferred label: Embedded @en
preferred label: Rocaille @fr
broader: Processos e técnicas genéricos de aplicação de materiais

Embutido
type: Concept
scope note: Técnica de revestimento de um elemento arquitetónico ou objeto, composto por várias pedras embutidas, constituindo elementos geométricos, vegetalistas ou figurativos. As pedras, calcários de várias tonalidades, são afeiçoadas e extremamente polidas, dando um efeito marmóreo.
in scheme: Tesauro SIPA
preferred label: Inlaid @en
preferred label: Encastré @fr
preferred label: Intarsiato @it
broader: Processos e técnicas genéricos de aplicação de materiais

Enxaquetado
type: Concept
scope note: Técnica decorativa de revestimento, em que os elementos são colocados de forma alternada (cor, saliência ou forma), criando semelhanças com um tabuleiro de xadrez.
in scheme: Tesauro SIPA
preferred label: Enwrapped @en
preferred label: Échiqueté @fr
preferred label: Scaccato @it
broader: Processos e técnicas genéricos de aplicação de materiais

Mosaico
type: Concept
scope note: Técnica de revestimento de paredes, pavimentos e coberturas, que consiste na colocação de pequenas peças, as tesselas, de pedra, pedra semipreciosa, vidro, cerâmica e ouro sobre uma superfície, permitindo a criação de grandes áreas com decoração figurativa, muitas vezes narrativa, geométrica ou fitomórfica. Foi uma técnica largamente difundida no mundo romano e no período bizantino.
in scheme: Tesauro SIPA
preferred label: Mosaic @en
preferred label: Mosaique @fr
broader: Processos e técnicas genéricos de aplicação de materiais

Padronagem
type: Concept
scope note: Técnica de colocação de elementos decorativos numa superfície, seguindo ou formando um padrão.
in scheme: Tesauro SIPA
preferred label: Patterning @en
preferred label: Patterning; Modélisation @fr
broader: Processos e técnicas genéricos de aplicação de materiais

Processos e técnicas de construção e conservação
type: Concept
in scheme: Tesauro SIPA
preferred label: Building and conservation processes and techniques @en
preferred label: Procédés et techniques de construction et d’entretien @fr
preferred label: Processi e tecniche di costruzione e manutenzione @it
broader: Processos e técnicas
narrower: Processos e técnicas específicas de construção e conservação
narrower: Processos e técnicas genéricos de construção e conservação

Processos e técnicas específicas de construção e conservação
type: Concept
in scheme: Tesauro SIPA
preferred label: Construction and conservation specific processes and techniques @en
preferred label: Procédés et techniques spécifiques de construction et de conservation @fr
preferred label: Procedure e tecniche specifiche di costruzione e conservazione @it
broader: Processos e técnicas de construção e conservação
narrower: Processos e técnicas específicas de construção e conservação de pintura mural

Processos e técnicas específicas de construção e conservação de pintura mural
type: Concept
in scheme: Tesauro SIPA
preferred label: Specific construction and conservation processes and techniques for wall paintings @en
preferred label: Procédés et techniques de construction et de conservation spécifiques à la peinture murale @fr
preferred label: Procedure e tecniche costruttive e conservative specifiche per i dipinti murali @it
broader: Processos e técnicas específicas de construção e conservação
narrower: Destacamento de pinturas murais
narrower: Processos e técnicas de reintegração cromática

Destacamento de pinturas murais
type: Concept
in scheme: Tesauro SIPA
preferred label: Detachement of mural paintings @en
preferred label: Détachement des peintures murales @fr
preferred label: Rimozione di dipinti murali @it
broader: Processos e técnicas específicas de construção e conservação de pintura mural
narrower: Stacco
narrower: Strappo

Stacco
type: Concept
in scheme: Tesauro SIPA
broader: Destacamento de pinturas murais

Strappo
type: Concept
in scheme: Tesauro SIPA
broader: Destacamento de pinturas murais

Processos e técnicas de reintegração cromática
type: Concept
in scheme: Tesauro SIPA
preferred label: Color reintegration techniques and processes @en
preferred label: Techniques et procédés de réintégration des couleurs @fr
preferred label: Tecniche e processi di reintegrazione del colore @it
broader: Processos e técnicas específicas de construção e conservação de pintura mural
narrower: Rigattino
narrower: Tratteggio

Rigattino
type: Concept
in scheme: Tesauro SIPA
broader: Processos e técnicas de reintegração cromática

Tratteggio
type: Concept
in scheme: Tesauro SIPA
preferred label: Trattegio @fr
broader: Processos e técnicas de reintegração cromática

Processos e técnicas genéricos de construção e conservação
type: Concept
in scheme: Tesauro SIPA
preferred label: Generic construction and conservation processes and techniques @en
preferred label: Procédés et techniques génériques de construction et de conservation @fr
preferred label: Processi e tecniche generici di costruzione e conservazione @it
broader: Processos e técnicas de construção e conservação
narrower: Adobe de cal
narrower: Alvenaria
narrower: Cantaria
narrower: Silharia
narrower: Tabique
narrower: Taipal (Processos e técnicas genéricos de construção e conservação)

Adobe de cal
type: Concept
scope note: Técnica construtiva que utiliza pequenos tijolos feitos de argila, cal, água e areia, sendo particularmente resistentes. É muito utilizada na zona da Beira Litoral.
in scheme: Tesauro SIPA
preferred label: Lime adobe @en
preferred label: Adobe à la chaux @fr
preferred label: Adobe alla calce @it
broader: Processos e técnicas genéricos de construção e conservação

Alvenaria
type: Concept
scope note: Processo de construção de vários elementos arquitetónicos (paredes, muros, alicerces, pilares, cunhais…) com pedras ou outros materiais (tijolo, taipa ou fasquia), de formas e dimensões regulares ou irregulares, ligados, ou não, entre si com argamassa.
in scheme: Tesauro SIPA
preferred label: Masonry @en
preferred label: Maçonnerie @fr
preferred label: Muratura @it
broader: Processos e técnicas genéricos de construção e conservação
narrower: Alvenaria segundo a forma
narrower: Alvenaria segundo o tipo
related: Silhar (Pedra segundo a forma)
modified: 2025-09-23T13:14:41

Alvenaria segundo a forma
type: Concept
in scheme: Tesauro SIPA
preferred label: Masonry according to shape @en
preferred label: Maçonnerie selon la forme @fr
preferred label: Muratura secondo la forma @it
broader: Alvenaria
narrower: Alvenaria à holandês
narrower: Alvenaria a sega
narrower: Alvenaria a tição
narrower: Alvenaria alemã
narrower: Alvenaria belga
narrower: Alvenaria careada
narrower: Alvenaria aparelhada
narrower: Alvenaria argamassada
narrower: Alvenaria armada
narrower: Alvenaria de enchimento

Alvenaria à holandês
type: Concept
in scheme: Tesauro SIPA
preferred label: Dutch masonry @en
preferred label: Maçonnerie à la hollandaise @fr
preferred label: Muratura in stile olandese @it
broader: Alvenaria segundo a forma

Alvenaria a sega
type: Concept
scope note: Processo de construção de um muro ou parede, em que os silhares são colocados em fiadas regulares, sendo visível a face de maiores dimensões (silhar ao comprido).
in scheme: Tesauro SIPA
preferred label: Dry stone masonry @en
preferred label: Maçonnerie à sec @fr
preferred label: Muratura a secco @it
broader: Alvenaria segundo a forma

Alvenaria a tição
type: Concept
in scheme: Tesauro SIPA
preferred label: Heading bond @en
broader: Alvenaria segundo a forma

Alvenaria alemã
type: Concept
in scheme: Tesauro SIPA
preferred label: German masonry @en
preferred label: Maçonnerie allemande @fr
preferred label: Muratura tedesca @it
broader: Alvenaria segundo a forma

Alvenaria belga
type: Concept
in scheme: Tesauro SIPA
preferred label: Belgian masonry @en
preferred label: Maçonnerie belge @fr
preferred label: Muratura belga @it
broader: Alvenaria segundo a forma

Alvenaria careada
type: Concept
in scheme: Tesauro SIPA
preferred label: Rubble masonry @en
preferred label: Maçonnerie de moellons @fr
preferred label: Muratura di macerie @it
broader: Alvenaria segundo a forma

Alvenaria aparelhada
type: Concept
in scheme: Tesauro SIPA
preferred label: Prepared stone masonry @en
preferred label: Maçonnerie de pierre préparée @fr
preferred label: Muratura di pietra preparata @it
broader: Alvenaria segundo a forma

Alvenaria argamassada
type: Concept
in scheme: Tesauro SIPA
preferred label: Mortared masonry @en
preferred label: Maçonnerie de ciment @fr
preferred label: Muratura di cemento @it
broader: Alvenaria segundo a forma

Alvenaria armada
type: Concept
scope note: Processo de construção de paredes de pedra ou tijolo reforçadas com pilaretes espaçados de betão e armadura de ferro, onde assentam as lajes de pavimento em madeira ou com vigotas pré-esforçadas. A alvenaria armada surge a partir da evolução do sistema de gaiola. Tal evolução permitiu uma melhoria no comportamento estrutural das construções. Entre 1930 e 1940 surgem estruturas mistas de alvenaria de pedra com armadura, de 1940 a 1960 surge a alvenaria de tijolo com armadura e nas décadas seguintes aplica-se alvenaria de blocos de cimento ou de tijolo com armadura, em edifícios de pequeno ou médio porte.
in scheme: Tesauro SIPA
preferred label: Reinforced masonry @en
preferred label: Maçonnerie armée/ renforcée @fr
preferred label: Muratura armata/ rinforzata @it
broader: Alvenaria segundo a forma

Alvenaria de enchimento
type: Concept
in scheme: Tesauro SIPA
preferred label: Filling masonry @en
preferred label: Maçonnerie de remplissage @fr
preferred label: Muratura di riempimento @it
alternative label: Encasque
broader: Alvenaria segundo a forma

Alvenaria segundo o tipo
type: Concept
in scheme: Tesauro SIPA
preferred label: Masonry by type @en
preferred label: Maçonnerie selon le type @fr
preferred label: Muratura secondo il tipo @it
broader: Alvenaria
narrower: Alvenaria de silhares
narrower: Alvenaria de terra
narrower: Alvenaria mista
narrower: Alvenaria seca

Alvenaria de silhares
type: Concept
in scheme: Tesauro SIPA
preferred label: Ashlar masonry @en
preferred label: Maçonnerie de pierre de taille @fr
preferred label: Muratura della pietra di taglio @it
broader: Alvenaria segundo o tipo
narrower: Silharia de tufo

Silharia de tufo
type: Concept
in scheme: Tesauro SIPA
preferred label: Tuff masonry @en
broader: Alvenaria de silhares

Alvenaria de terra
type: Concept
in scheme: Tesauro SIPA
preferred label: Earth masonry @en
preferred label: Maçonnerie de terre @fr
preferred label: Muratura di terra @it
broader: Alvenaria segundo o tipo
narrower: Alvenaria de adobe
narrower: Alvenaria de taipa

Alvenaria de adobe
type: Concept
scope note: As paredes de adobe são construídas segundo as mesmas regras da alvenaria de tijolo e a sua espessura ronda os 35 cm. A alvenaria de adobe tem como inconvenientes a vulnerabilidade a ataques de roedores e a sua fraca estabilidade face a sismos e a esforços laterais provocados pela fluência das cargas da cobertura. Para contrariar estas fraquezas, as paredes eram em muitos casos reforçadas com a introdução de testemunhos ou gigantes, não sendo viável a construção de grandes edifícios. 0 adobe deverá ser rebocado e tratado com rebocos à base de cal apagada, ou por intermédio de uma caiação direta sobre ele com a intenção de o proteger das ações atmosféricas, principalmente da água. Por ser facilmente degradada pela água, deverá ser aplicada sobre fundações de alvenaria de pedra ordinária, geralmente em xisto, com cerca de 0,60 m acima do solo, evitando assim as humidades ascendentes.
in scheme: Tesauro SIPA
preferred label: Adobe masonry @en
preferred label: Maçonnerie d'adobe @fr
preferred label: Muratura di adobe @it
alternative label: Alvenaria de adobo
broader: Alvenaria de terra

Alvenaria de taipa
type: Concept
scope note: Técnica de construção executada com barro, misturado com grãos de areia e brita, e água, que é prensado entre enxaiméis, desmontáveis, mantidos a prumo por meio de cavilhas e tirantes, formando uma superfície resistente e duradoura, depois de seca. Trata-se dum sistema de construção muito antigo, existente até meados do séc. XX no Alentejo e Algarve, formado por paredes de custo muito baixo e de material incombustível e isotérmico.
in scheme: Tesauro SIPA
preferred label: Maçonnerie de boue sèche @fr
preferred label: Muratura di fango secco @it
preferred label: Tabiyya (Dry mud masonry) @en
broader: Alvenaria de terra
narrower: Enxaimel
narrower: Taipa de pau a pique

Enxaimel
type: Concept
scope note: Cada uma das tábuas que constitui a armação de uma taipa.
in scheme: Tesauro SIPA
preferred label: Plank @en
preferred label: Charpente @fr
preferred label: Assito @it
broader: Alvenaria de taipa

Taipa de pau a pique
type: Concept
scope note: Técnica de construção de paredes ou muros, executada com uma estrutura de varas revestidas com barro mole.
in scheme: Tesauro SIPA
preferred label: Wattle and daub @en
broader: Alvenaria de taipa

Alvenaria mista
type: Concept
scope note: Técnica de construção de paredes ou muros, executada com silhares de cantaria e tijolo, unidos por pedra miúda.
in scheme: Tesauro SIPA
preferred label: Mixed masonry @en
preferred label: Maçonnerie mixte @fr
preferred label: Muratura mista @it
broader: Alvenaria segundo o tipo

Alvenaria seca
type: Concept
scope note: Técnica de construção de paredes ou muros, executada com pedras ou outros materiais, de formas e dimensões irregulares, colocados sem qualquer ligante, sendo os espaços entre os silhares preenchidos com pedra miúda.
in scheme: Tesauro SIPA
preferred label: Dry stone masonry @en
preferred label: Maçonnerie de pierres sèches @fr
preferred label: Muratura di pietre a secco @it
broader: Alvenaria segundo o tipo

Cantaria
type: Concept
scope note: Processo de construção de vários elementos arquitetónicos (paredes, muros, alicerces, pilares, cunhais…) com pedras, em que cada um dos silhares são colocados à esquadria ou se apresentam lavrados.
in scheme: Tesauro SIPA
preferred label: Maçonnerie de pierres de taille @fr
preferred label: Muratura di pietre da taglio @it
preferred label: Stonework; Ashlar; Square stone block @en
broader: Processos e técnicas genéricos de construção e conservação

Silharia
type: Concept
scope note: Modo de construção em que os silhares que constituem um elemento arquitetónico são regulares, permitindo a sua disposição em diferentes formas.
in scheme: Tesauro SIPA
preferred label: Ashlar masonry @en
preferred label: Maçonnerie de pierre de taille @fr
preferred label: Muratura della pietra di taglio @it
broader: Processos e técnicas genéricos de construção e conservação
narrower: Perpianho
narrower: Silhar ao atravessado
narrower: Silhar ao comprido

Perpianho
type: Concept
scope note: Forma de construção, colocando pedras aparelhadas, regulares, dispostas em camadas e ligadas entre si por argamassas, ou simplesmente depositadas umas sobre as outras. Cantaria que tem toda a largura da parede, aparelhada nas quatro faces e à vista. Este tipo de cantaria encontra-se normalmente na zona Norte do País.
in scheme: Tesauro SIPA
preferred label: Parpaing @fr
preferred label: Blocchetto di calcestruzzo @it
preferred label: Perpent stone; Bondstone @en
broader: Silharia

Silhar ao atravessado
type: Concept
in scheme: Tesauro SIPA
preferred label: Crossbred ashlar @en
preferred label: Pierre de taille croisée @fr
preferred label: Pietra di taglio incrociato @it
alternative label: Ajuntoira
alternative label: Ajuntoura
alternative label: Juntoura
alternative label: Silhar travado
broader: Silharia

Silhar ao comprido
type: Concept
in scheme: Tesauro SIPA
preferred label: Laid ashlar @en
preferred label: Pierre de taille assise @fr
preferred label: Pietra da taglio seduta @it
broader: Silharia

Tabique
type: Concept
scope note: Técnica de construção de uma parede exterior ou interior com um esqueleto em madeira fasquiada e estucada. Distinguem-se das frontais, pela ausência de alvenaria pois levam apenas argamassa e a sua espessura regular deve ser de 10 cm.
in scheme: Tesauro SIPA
preferred label: Cloison @fr
preferred label: Tramezzo @it
preferred label: Bulkhead; Partition @en
broader: Processos e técnicas genéricos de construção e conservação
narrower: Capuchinha
narrower: Tabique aliviado
narrower: Tabique inglês

Capuchinha
type: Concept
in scheme: Tesauro SIPA
preferred label: Capuchin @en
preferred label: Capucine @fr
preferred label: Cappuccina @it
broader: Tabique

Tabique aliviado
type: Concept
scope note: Técnica de construção de uma parede interior que não pode suportar cargas, empurrando as mesmas para a parede exterior através de vigas.
in scheme: Tesauro SIPA
preferred label: Lightened bulkhead @en
preferred label: Cloison allegée @fr
preferred label: Tramezzo alleggerito @it
broader: Tabique

Tabique inglês
type: Concept
scope note: Técnica de construção de uma parede de madeira e barro ou de cal e areia.
in scheme: Tesauro SIPA
preferred label: English bulkhead @en
preferred label: Cloison anglaise @fr
preferred label: Tramezzo inglese @it
broader: Tabique

Taipal (Processos e técnicas genéricos de construção e conservação)
type: Concept
scope note: Técnica de construção que utiliza terra compactada dentro de moldes de madeira para formar paredes. É um termo frequentemente associado à técnica de construção conhecida como taipa de pilão, onde a terra é compactada com um pilão dentro de um molde.
in scheme: Tesauro SIPA
preferred label: Lath wall (Generic construction and conservation processes and techniques) @en
preferred label: Palançon (Procédés et techniques génériques de construction et de conservation) @fr
preferred label: Muro di pali (Processi e tecniche generici di costruzione e conservazione) @it
broader: Processos e técnicas genéricos de construção e conservação
narrower: Taipal à galega

Taipal à galega
type: Concept
in scheme: Tesauro SIPA
preferred label: Galician lath wall @en
preferred label: Palançon galicien @fr
preferred label: Muro di pali galiziano @it
broader: Taipal (Processos e técnicas genéricos de construção e conservação)

Processos e técnicas de ensamblagem
type: Concept
in scheme: Tesauro SIPA
preferred label: Assembly processes and techniques @en
preferred label: Procédés et techniques d'assemblage @fr
preferred label: Processi e tecniche di assemblaggio @it
broader: Processos e técnicas
narrower: Processos e técnicas de ensamblagem específicos

Processos e técnicas de ensamblagem específicos
type: Concept
in scheme: Tesauro SIPA
preferred label: Specific assembly processes and techniques @en
preferred label: Procédés et techniques d'assemblage spécifiques @fr
preferred label: Processi e tecniche di assemblaggio specifici @it
broader: Processos e técnicas de ensamblagem
narrower: Processos e técnicas de ensamblagem de pavimentos

Processos e técnicas de ensamblagem de pavimentos
type: Concept
in scheme: Tesauro SIPA
preferred label: Assembly processes and techniques (Pavements) @en
preferred label: Procédés et techniques d'assemblage (Revêtements de sol) @fr
preferred label: Processi e tecniche di assemblaggio (Pavimentazioni) @it
broader: Processos e técnicas de ensamblagem específicos
narrower: Soalho à inglesa
narrower: Soalho de chanfro
narrower: Soalho de junta
narrower: Soalho de meio-fio
narrower: Soalho de topo
narrower: Soalho encabeirado
narrower: Soalho espinhado

Soalho à inglesa
type: Concept
scope note: Tipo de pavimento, em que as tábuas são dispostas em fiadas contínuas, tendo, numa das arestas de topo, uma reentrância, surgindo, na oposta, uma saliência, permitindo o encaixe das várias tábuas.
in scheme: Tesauro SIPA
preferred label: English style flooring @en
preferred label: Parquet à l'anglaise @fr
preferred label: Pavimento all'inglese @it
alternative label: Soalho de macho e fêmea
broader: Processos e técnicas de ensamblagem de pavimentos

Soalho de chanfro
type: Concept
scope note: Tipo de pavimento, em que as tábuas são dispostas em fiadas contínuas, unidas pelas arestas de topo, com corte oblíquo.
in scheme: Tesauro SIPA
preferred label: Chamfer flooring (Parquet) @en
broader: Processos e técnicas de ensamblagem de pavimentos

Soalho de junta
type: Concept
scope note: Tipo de pavimento, em que as tábuas são dispostas em fiadas contínuas, unidas de forma simples.
in scheme: Tesauro SIPA
preferred label: Joint flooring (Parquet) @en
broader: Processos e técnicas de ensamblagem de pavimentos

Soalho de meio-fio
type: Concept
scope note: Tipo de pavimento, em que as tábuas são dispostas em fiadas contínuas, tendo uma das arestas laterais chanfradas em ângulo reto em ambos os topos, colocadas de forma alternada.
in scheme: Tesauro SIPA
preferred label: Curb flooring (Portuguese style parquet) @en
alternative label: Soalho à portuguesa
broader: Processos e técnicas de ensamblagem de pavimentos
narrower: Soalho de meio-fio recontrado

Soalho de meio-fio recontrado
type: Concept
scope note: Tipo de pavimento, em que as tábuas são dispostas em fiadas contínuas, tendo as arestas de topo chanfradas em ângulo reto, num dos lados, dispostas alternadamente.
in scheme: Tesauro SIPA
preferred label: Curb flooring @en
broader: Soalho de meio-fio

Soalho de topo
type: Concept
scope note: Tipo de pavimento em que as tábuas são dispostas em fiadas contínuas paralelas, a central de menores dimensões, a partir da qual se escalonam as exteriores, permitindo a colocação de várias tábuas horizontais em cunha.
in scheme: Tesauro SIPA
preferred label: Harwood flooring (Parquet) @en
broader: Processos e técnicas de ensamblagem de pavimentos

Soalho encabeirado
type: Concept
scope note: Tipo de pavimento em que as tábuas são dispostas em fiadas contínuas paralelas, sendo as dos extremos de maiores dimensões, permitindo a colocação de duas tábuas horizontais, em cunha.
in scheme: Tesauro SIPA
preferred label: Header flooring @en
broader: Processos e técnicas de ensamblagem de pavimentos

Soalho espinhado
type: Concept
scope note: Tipo de pavimento em que as tábuas são dispostas em meia esquadria, a partir de um eixo central.
in scheme: Tesauro SIPA
preferred label: Chevron wooden floor @en
broader: Processos e técnicas de ensamblagem de pavimentos

Processos e técnicas de fabricação
type: Concept
in scheme: Tesauro SIPA
preferred label: Manufacturing processes and techniques @en
preferred label: Procédés et techniques spécifiques à la fabrication de matériaux céramiques @fr
preferred label: Processi e tecniche specifici per la produzione di materiali ceramici @it
broader: Processos e técnicas
narrower: Processos e técnicas específicos de fabricação de cerâmica
narrower: Processos e técnicas específicos de fabricação de ourivesaria
narrower: Processos e técnicas específicos de fabricação têxtil

Processos e técnicas específicos de fabricação de cerâmica
type: Concept
in scheme: Tesauro SIPA
preferred label: Specific ceramic manufacturing processes and techniques @en
preferred label: Procédés et techniques spécifiques de fabrication de la céramique @fr
preferred label: Processi e tecniche specifiche di fabbricazione della ceramica @it
broader: Processos e técnicas de fabricação
narrower: Aresta
narrower: Cerâmica de paredes finas
narrower: Corda seca
narrower: Faiança
narrower: Porcelana
narrower: Terra sigillata
related: Azulejo

Aresta
type: Concept
scope note: Técnica de decoração hispano-mourisca que consistia na aplicação de um molde (de madeira ou de metal) no barro cru, formando pequenas barreiras em relevo (arestas) que impediam a mistura das cores durante a cozedura. Desenvolvida sobretudo em Sevilha e Toledo cerca de 1500, foi também aplicada na fabricação portuguesa. É aplicada à cerâmica utilitária e no azulejo.
in scheme: Tesauro SIPA
preferred label: Arête @fr
preferred label: Resta @it
preferred label: Edge; Groin @en
broader: Processos e técnicas específicos de fabricação de cerâmica

Cerâmica de paredes finas
type: Concept
in scheme: Tesauro SIPA
preferred label: Thin-walled ceramics @en
broader: Processos e técnicas específicos de fabricação de cerâmica

Corda seca
type: Concept
scope note: Técnica de decoração hispano-mourisca que consiste na separação dos motivos decorativos através de uma ranhura preenchida com um filete de matéria gorda, óleo de linhaça e manganês, impedindo que as cores se misturem durante a cozedura. É aplicado na cerâmica utilitária e no azulejo.
in scheme: Tesauro SIPA
preferred label: Corde séchée @fr
preferred label: Corda essiccata @it
preferred label: Cuerda seca; Dry cord @en
broader: Processos e técnicas específicos de fabricação de cerâmica

Faiança
type: Concept
scope note: Designação que abrange a cerâmica de pasta mais ou menos porosa que, depois de uma primeira cozedura, é coberta por uma substância à base de esmalte estanífero, sendo a pintura realizada com óxidos metálicos. Durante uma segunda cozedura, o esmalte estanífero, com ou sem policromia, fica vitrificado tornando a peça cerâmica brilhante e impermeável. A designação de faiança teria origem na cidade italiana de Faenza. Esta técnica também foi aplicada no azulejo.
in scheme: Tesauro SIPA
preferred label: Faience @en
preferred label: Faïence @fr
preferred label: Maiolica @it
broader: Processos e técnicas específicos de fabricação de cerâmica

Porcelana
type: Concept
in scheme: Tesauro SIPA
preferred label: Porcelain @en
preferred label: Porcelaine @fr
preferred label: Porcellana @it
broader: Processos e técnicas específicos de fabricação de cerâmica
narrower: Biscuit
narrower: Casquinha de ovo
narrower: Porcelana de osso
narrower: Porcelana de pasta dura
narrower: Porcelana de pasta tenra

Biscuit
type: Concept
scope note: Cerâmica de tonalidade branca sem vidrado ou pintura, cozida duas vezes.
in scheme: Tesauro SIPA
alternative label: Biscoito
broader: Porcelana

Casquinha de ovo
type: Concept
in scheme: Tesauro SIPA
preferred label: Thin rind @en
preferred label: Coquille d'œuf @fr
preferred label: Guscio d'uovo @it
broader: Porcelana

Porcelana de osso
type: Concept
scope note: Técnica de produção de porcelana, utilizando material cerâmico de pasta branca e translúcida resultante da combinação de fosfato de cálcio (cinzas de ossos de gado bovino), caulino e Cornwall Stone
in scheme: Tesauro SIPA
preferred label: Bone porcelain @en
preferred label: Porcelaine d'os @fr
preferred label: Porcellana d'osso @it
alternative label: Bone China
broader: Porcelana

Porcelana de pasta dura
type: Concept
in scheme: Tesauro SIPA
preferred label: Hard-paste porcelain @en
preferred label: Porcelaine à pâte dure @fr
preferred label: Porcellana a pasta dura @it
broader: Porcelana

Porcelana de pasta tenra
type: Concept
in scheme: Tesauro SIPA
preferred label: Tender -paste porcelain @en
preferred label: Porcelaine à pâte tendre @fr
preferred label: Porcellana per pasta tenera @it
broader: Porcelana

Terra sigillata
type: Concept
in scheme: Tesauro SIPA
broader: Processos e técnicas específicos de fabricação de cerâmica

Processos e técnicas específicos de fabricação de ourivesaria
type: Concept
in scheme: Tesauro SIPA
preferred label: Specific goldsmithing processes and techniques @en
preferred label: Procédés et techniques spécifiques de fabrication d’orfèvrerie @fr
preferred label: Processi e tecniche specifiche di fabbricazione dell’oreficeria @it
broader: Processos e técnicas de fabricação
narrower: Filigrana

Filigrana
type: Concept
scope note: Técnica de ourivesaria que utiliza fios muito finos de metal, de ouro ou prata, e pequenas esferas de metal, soldadas para formar desenhos complexos.
in scheme: Tesauro SIPA
preferred label: Filigree @en
preferred label: Filigrane @fr
broader: Processos e técnicas específicos de fabricação de ourivesaria

Processos e técnicas específicos de fabricação têxtil
type: Concept
in scheme: Tesauro SIPA
preferred label: Specific textile manufacturing processes and techniques @en
preferred label: Procédés et techniques spécifiques de fabrication textile @fr
preferred label: Processi e tecniche specifiche di fabbricazione tessile @it
broader: Processos e técnicas de fabricação
narrower: Batik
narrower: Processos e técnicas específicos do bordado

Batik
type: Concept
scope note: Processo de estampagem de tecidos, pela técnica de cobrir com cera fundida a área a não pintar. Este processo, originário da China, é repetido para cada uma das cores a estampar.
in scheme: Tesauro SIPA
broader: Processos e técnicas específicos de fabricação têxtil

Processos e técnicas específicos do bordado
type: Concept
in scheme: Tesauro SIPA
preferred label: Specific embroidery processes and techniques @en
preferred label: Procédés et techniques spécifiques de la broderie @fr
preferred label: Processi e tecniche specifiche del ricamo @it
broader: Processos e técnicas específicos de fabricação têxtil
narrower: Bordado a fio metálico
narrower: Bordado a seda

Bordado a fio metálico
type: Concept
scope note: Lavor em relevo executado com fio de ouro ou prata, feito com uma agulha numa superfície têxtil.
in scheme: Tesauro SIPA
preferred label: Mettalic thread embrodery @en
preferred label: Broderie au fil métallique @fr
preferred label: Ricamo con filo metallico @it
broader: Processos e técnicas específicos do bordado

Bordado a seda
type: Concept
scope note: Lavor em relevo executado com fio de seda, feito com uma agulha numa superfície têxtil.
in scheme: Tesauro SIPA
preferred label: Silk embrodery @en
preferred label: Broderie de soie @fr
preferred label: Ricamo in seta @it
broader: Processos e técnicas específicos do bordado

Processos e técnicas de modelação do terreno
type: Concept
in scheme: Tesauro SIPA
preferred label: Processes and techniques for terrain modelling @en
preferred label: Procédés et techniques de modélisation du terrain @fr
preferred label: Processi e tecniche di modellazione del terreno @it
broader: Processos e técnicas
narrower: Patamar
narrower: Socalco

Patamar
type: Concept
in scheme: Tesauro SIPA
preferred label: Pianerottolo @it
preferred label: Landing; Terrace (Plateau) @en
preferred label: Palier (Plateau) @fr
broader: Processos e técnicas de modelação do terreno

Socalco
type: Concept
scope note: Técnica de modelação do terreno nas zonas de encostas íngremes, de solos pobres e pedregosos, consistindo em patamares de geometria variável, consoante a inclinação da encosta e a técnica e época de terraceamento, mais ou menos horizontais, suportados por muros de pedra, na Região Demarcada do Douro essencialmente de xisto, que impedem a erosão do terreno e possibilitam o cultivo de várias espécies agrícolas. A interligação entre os vários socalcos era feita por vários tipos de escadas ou, mais raramente, por rampas, calcetadas por grandes lajes de xisto.
in scheme: Tesauro SIPA
preferred label: Ledge @en
preferred label: Terrasse @fr
preferred label: Terrazzo @it
broader: Processos e técnicas de modelação do terreno
narrower: Socalco segundo o âmbito cronológico

Socalco segundo o âmbito cronológico
type: Concept
in scheme: Tesauro SIPA
preferred label: Ledge according to chronological scope @en
preferred label: Terrasse selon l'échelle chronologique @fr
preferred label: Terrazzo per scala cronologica @it
broader: Socalco
narrower: Socalco pós-filoxérico
narrower: Socalco pré-filoxéricos

Socalco pós-filoxérico
type: Concept
scope note: Técnica de terraceamento das zonas de encostas íngremes na Região Demarcada do Douro para a plantação da vinha, utilizada entre finais do séc. XIX, depois da crise provocada pela praga de filoxera, e a década de 30 do séc. XX, correspondendo a um período de reconstrução do vinhedo regional. Caracterizam-se por socalcos contínuos, de traçado regular, sustentados por muros sólidos, altos, levemente inclinados, segundo as curvas de nível, suportando geios largos, onde se podiam plantar 4, 5 ou mais fiadas de vinha, e num compasso mais largo, favorecendo a utilização de meios técnicos, como a tração animal para revolver os solos, e a exposição da vinha ao sol. Esta técnica, impedia a erosão dos solos durante o Inverno, permitia o escoamento das águas em excesso por meio de canais de drenagem e reservava a água necessária para os períodos mais secos.
in scheme: Tesauro SIPA
preferred label: Post-phylloxeric ledge @en
preferred label: Terrasse postphylloxérique @fr
preferred label: Terrazzo post-fillossera @it
broader: Socalco segundo o âmbito cronológico

Socalco pré-filoxéricos
type: Concept
scope note: Técnica de modelação do terreno nas zonas de encostas íngremes da Região Demarcada do Douro, para plantação de vinha, utilizada até ao último terço do séc. XIX, época em que a praga de filoxera atacou os vinhedos e levou ao seu abandono. São socalcos estreitos e irregulares, suportados por muros de xisto, baixos e tortuosos, acompanhando as curvas de nível e os afloramentos rochosos, criando geios horizontais onde se podiam plantar uma ou duas linhas de bardos.
in scheme: Tesauro SIPA
preferred label: Pre-phylloxeric ledge @en
preferred label: Terrasse pré-phylloxérique @fr
preferred label: Terrazzo pre-fillosserico @it
broader: Socalco segundo o âmbito cronológico
narrower: Mortório

Mortório
type: Concept
scope note: Socalcos estreitos e irregulares na Região Demarcada do Douro, abandonados no último terço do séc. XIX, devido à praga de filoxera ter morto os vinhedos, e posteriormente recolonizados com olival ou reocupados com vegetação espontânea, conservando total ou parcialmente os antigos muros de suporte, em xisto. A vegetação espontânea da região que ocupou estes socalcos é muito rica em espécies aromáticas, melíferas, medicinais e bravias comestíveis, como estevas, giestas, urzes, rosmaninho, cornanheira, trovisco, espargo bravo e outros. Raramente os mortórios foram reocupados com vinha, ocorrendo essencialmente na região do Baixo Corgo, devido ao declive mais suave do terreno e à maior densidade populacional.
in scheme: Tesauro SIPA
preferred label: Terrace @en
broader: Socalco pré-filoxéricos

Processos e técnicas de preparação de suporte
type: Concept
in scheme: Tesauro SIPA
preferred label: Support preparation processes and techniques @en
preferred label: Procédés et techniques de préparation du support @fr
preferred label: Processi e tecniche di preparazione del supporto @it
broader: Processos e técnicas
narrower: Processos e técnicas específicos de preparação de suporte

Processos e técnicas específicos de preparação de suporte
type: Concept
in scheme: Tesauro SIPA
preferred label: Specific support preparation processes and techniques @en
preferred label: Procédés et techniques spécifiques de préparation du support @fr
preferred label: Processi e tecniche specifici di preparazione del supporto @it
broader: Processos e técnicas de preparação de suporte
narrower: Processos e técnicas de preparação de suporte para pintura

Processos e técnicas de preparação de suporte para pintura
type: Concept
in scheme: Tesauro SIPA
preferred label: Support preparation processes and techniques for painting @en
preferred label: Procédés et techniques de préparation du support pour la peinture @fr
preferred label: Processi e tecniche di preparazione del supporto per la verniciatura @it
broader: Processos e técnicas específicos de preparação de suporte
narrower: Arriccio
narrower: Intonaco

Arriccio
type: Concept
in scheme: Tesauro SIPA
broader: Processos e técnicas de preparação de suporte para pintura
narrower: Arriccio pepperino

Arriccio pepperino
type: Concept
in scheme: Tesauro SIPA
broader: Arriccio

Intonaco
type: Concept
in scheme: Tesauro SIPA
alternative label: Intonachino
broader: Processos e técnicas de preparação de suporte para pintura
narrower: Intonaco marmorina
narrower: Intonaco pozzolana
narrower: Intonaco pastellone
narrower: Intonaco peperino
narrower: Intonaco de água e sabão

Intonaco marmorina
type: Concept
in scheme: Tesauro SIPA
broader: Intonaco
related: Mármore (Pedra)
modified: 2025-09-23T13:16:38

Intonaco pozzolana
type: Concept
in scheme: Tesauro SIPA
broader: Intonaco

Intonaco pastellone
type: Concept
in scheme: Tesauro SIPA
broader: Intonaco
related: Tijolo (Produtos derivados do barro)
modified: 2025-09-23T13:17:24

Intonaco peperino
type: Concept
in scheme: Tesauro SIPA
preferred label: Intonaco Peperino @it
broader: Intonaco
related: c 0736a7e2
modified: 2025-09-23T13:17:51

Intonaco de água e sabão
type: Concept
in scheme: Tesauro SIPA
preferred label: Soap and water intonaco @en
preferred label: Intonaco di acqua e sapone @it
preferred label: Crépi à l'eau et au savon (Intonaco) @fr
broader: Intonaco

Processos e técnicas de registo e decoração
type: Concept
in scheme: Tesauro SIPA
preferred label: Recording and decoration processes and techniques @en
preferred label: Procédés et techniques d'enregistrement et de décoration @fr
preferred label: Processi e tecniche di registrazione e decorazione @it
broader: Processos e técnicas
narrower: Processos e técnicas genéricos de registo e decoração
narrower: Processos e técnicas de registo e decoração segundo o material

Processos e técnicas genéricos de registo e decoração
type: Concept
in scheme: Tesauro SIPA
preferred label: Generic registration and decoration processes and techniques @en
preferred label: Procédés et techniques génériques d'enregistrement et de décoration @fr
preferred label: Processi e tecniche generiche di registrazione e decorazione @it
broader: Processos e técnicas de registo e decoração
narrower: Aerografia
narrower: Brunidura
narrower: Cromolitografia
narrower: Decalcomania
narrower: Desenho (Processos e técnicas genéricos de registo e decoração)
narrower: Douragem
narrower: Escrita (Processos e técnicas genéricos de registo e decoração)
narrower: Esgrafitagem
narrower: Esmaltagem
narrower: Esponjado
narrower: Estampagem
narrower: Estampilhagem
narrower: Excisão
narrower: Gravura
narrower: Incisão
narrower: Incrustação
narrower: Marmoreado
narrower: Pintura (Processos e técnicas de registo e decoração genéricos)
narrower: Prateado
narrower: Relevado
narrower: Repuxado
narrower: Serigrafado

Aerografia
type: Concept
scope note: Técnica de pintura por aplicação da policromia através de um aerógrafo (pistola de jato pulverizado). O desenho é realizado diretamente na superfície da chacota através de estampilhas de zinco que delimitam a zona de aplicação do aerógrafo. Esta técnica foi bastante utilizada no período Art Déco pela fábrica de Sacavém.
in scheme: Tesauro SIPA
preferred label: Aerography @en
preferred label: Aérographie @fr
broader: Processos e técnicas genéricos de registo e decoração

Brunidura
type: Concept
in scheme: Tesauro SIPA
preferred label: Burnishing @en
preferred label: Brunissage @fr
preferred label: Brunitura @it
broader: Processos e técnicas genéricos de registo e decoração

Cromolitografia
type: Concept
scope note: Método de impressão que permite a reprodução de imagens em cores, onde cada cor é impressa de forma separada.
in scheme: Tesauro SIPA
preferred label: Cromolithography @en
preferred label: Chromolithographie @fr
broader: Processos e técnicas genéricos de registo e decoração

Decalcomania
type: Concept
scope note: Técnica de transferência de imagens ou desenhos para outra superfície, segundo vários métodos, normalmente copiando-o, em superfície transparente (acetato, papel vegetal, etc.) disposta sobre o original.
in scheme: Tesauro SIPA
preferred label: Décalcomanie @fr
preferred label: Decals; Transfer print @en
broader: Processos e técnicas genéricos de registo e decoração

Desenho (Processos e técnicas genéricos de registo e decoração)
type: Concept
in scheme: Tesauro SIPA
preferred label: Drawing @en
preferred label: Dessin @fr
preferred label: Disegno @it
broader: Processos e técnicas genéricos de registo e decoração
narrower: Processos e técnicas de transposição

Processos e técnicas de transposição
type: Concept
in scheme: Tesauro SIPA
preferred label: Transposition processes and techniques @en
preferred label: Procédés et techniques de transposition @fr
preferred label: Processi e tecniche di trasposizione @it
broader: Desenho (Processos e técnicas genéricos de registo e decoração)
narrower: Cartão
narrower: Estersido
narrower: Quadratura (Processos e técnicas de transposição)
narrower: Sinopia

Cartão
type: Concept
in scheme: Tesauro SIPA
preferred label: Carboard @en
preferred label: Carton @fr
preferred label: Cartone @it
broader: Processos e técnicas de transposição
narrower: Cartão auxiliário
narrower: Cartão calcado
narrower: Cartão inciso

Cartão auxiliário
type: Concept
in scheme: Tesauro SIPA
preferred label: Auxiliary cardboard @en
broader: Cartão

Cartão calcado
type: Concept
in scheme: Tesauro SIPA
preferred label: Stamped cardboard @en
broader: Cartão

Cartão inciso
type: Concept
in scheme: Tesauro SIPA
preferred label: Incised cardboard @en
broader: Cartão

Estersido
type: Concept
scope note: Técnica de passagem de um desenho para outra superfície, picotando os traços e passando-lhe pó de lápis ou carvão, com uma boneca, ou calcando-os com um ponteiro, tendo coberto o reverso com pó de carvão. Técnica muito utilizada na pintura de cavalete, na pintura mural e na pintura de azulejo.
in scheme: Tesauro SIPA
preferred label: Pounced drawing @en
preferred label: Dessin poncé @fr
preferred label: Spolvero
alternative label: Boneca
broader: Processos e técnicas de transposição

Quadratura (Processos e técnicas de transposição)
type: Concept
in scheme: Tesauro SIPA
preferred label: Quadrature (Transposition processes and techniques) @en
preferred label: Quadrature (Procédés et techniques de transposition) @fr
preferred label: Quadratura (Processi e tecniche di trasposizione) @it
broader: Processos e técnicas de transposição

Sinopia
type: Concept
in scheme: Tesauro SIPA
preferred label: Synopia @fr
broader: Processos e técnicas de transposição

Douragem
type: Concept
scope note: Técnica de acabamento que consiste em revestir uma obra com uma fina camada de ouro, aplicada por processos variados, como o dourado com folha de ouro, que se pratica a quente, sobre superfícies metálicas previamente preparadas, ou a frio, sobre a madeira, o estuque ou a pedra, previamente preparados com a aplicação de uma base de preparação. Na escultura portuguesa, utilizam-se as técnicas de dourado a água ou dourado a mordente.
in scheme: Tesauro SIPA
preferred label: Gilding @en
preferred label: Dorure @fr
preferred label: Doratura @it
alternative label: Douradora
broader: Processos e técnicas genéricos de registo e decoração

Escrita (Processos e técnicas genéricos de registo e decoração)
type: Concept
in scheme: Tesauro SIPA
preferred label: Writing (Generic processes and techniques for recording and decorating) @en
preferred label: Écriture (Processus et techniques génériques d’enregistrement et de décoration) @fr
preferred label: Scrittura (processi e tecniche generiche di registrazione e decorazione) @it
broader: Processos e técnicas genéricos de registo e decoração
narrower: Escrita grafada
narrower: Escrita gravada
narrower: Escrita incisa

Escrita grafada
type: Concept
in scheme: Tesauro SIPA
preferred label: Graphic handwriting @en
preferred label: Écriture manuscrite @fr
preferred label: Scrittura manuale @it
broader: Escrita (Processos e técnicas genéricos de registo e decoração)

Escrita gravada
type: Concept
in scheme: Tesauro SIPA
preferred label: Carved handwriting @en
preferred label: Écriture gravée @fr
preferred label: Scrittura registrata/incisa @it
broader: Escrita (Processos e técnicas genéricos de registo e decoração)

Escrita incisa
type: Concept
in scheme: Tesauro SIPA
preferred label: Incised handwriting @en
preferred label: Écriture incisée @fr
preferred label: Scrittura incisa @it
broader: Escrita (Processos e técnicas genéricos de registo e decoração)

Esgrafitagem
type: Concept
in scheme: Tesauro SIPA
preferred label: Grafitti @en
preferred label: Graphitage @fr
preferred label: Grafitizzazione @it
broader: Processos e técnicas genéricos de registo e decoração

Esmaltagem
type: Concept
scope note: Cobertura da peça cerâmica com esmalte. A esmaltagem pode ser colorida, transparente ou opaca.
in scheme: Tesauro SIPA
preferred label: Enamelling @en
preferred label: Émaillage @fr
preferred label: Smaltatura @it
broader: Processos e técnicas genéricos de registo e decoração

Esponjado
type: Concept
scope note: Técnica de pintura que consiste na aplicação da cor com uma esponja, obtendo uma decoração que aparenta uma textura rugosa, semelhante à cantaria. Foi utilizada a partir do século XVIII, em retábulos e painéis decorativos.
in scheme: Tesauro SIPA
preferred label: Sponged @en
preferred label: Éponge @fr
preferred label: Spugnato @it
broader: Processos e técnicas genéricos de registo e decoração

Estampagem
type: Concept
scope note: Aplicação no azulejo (já vidrado) dos motivos decorativos por meio de uma estampa ou decalcomania, numa ou várias cores.
in scheme: Tesauro SIPA
preferred label: Estampage @fr
preferred label: Stampaggio @it
preferred label: Embossing (Stamping) @en
broader: Processos e técnicas genéricos de registo e decoração

Estampilhagem
type: Concept
scope note: Aplicação dos motivos decorativos através de estampilhas – em metal, papel encerado – nas quais está aberto o desenho que se quer reproduzir. Realizada manualmente à trincha, pode implicar várias estampilhas consoante o número de cores que se deseja.
in scheme: Tesauro SIPA
preferred label: Stamping @en
preferred label: Estampillage (Timbrage) @fr
broader: Processos e técnicas genéricos de registo e decoração

Excisão
type: Concept
in scheme: Tesauro SIPA
preferred label: Excision @en
preferred label: Escissione @it
broader: Processos e técnicas genéricos de registo e decoração

Gravura
type: Concept
in scheme: Tesauro SIPA
preferred label: Incisione @it
preferred label: Engraving; Printmaking @en
preferred label: Gravure @fr
broader: Processos e técnicas genéricos de registo e decoração
narrower: Calcografia
narrower: Litografia
narrower: Serigrafia
narrower: Xilogravura

Calcografia
type: Concept
scope note: Técnica de gravura, que utiliza uma matriz metálica, normalmente ferro, zinco, cobre, alumínio ou latão.
in scheme: Tesauro SIPA
preferred label: Chalcography @en
preferred label: Calcographie @fr
broader: Gravura

Litografia
type: Concept
scope note: Técnica de gravura, que utiliza uma matriz de pedra calcária, inventada no século XVIII por Alois Senefelder.
in scheme: Tesauro SIPA
preferred label: Lithography @en
preferred label: Lithographie @fr
broader: Gravura

Serigrafia
type: Concept
scope note: Técnica de gravura que usa uma tela de seda para transferir a tinta.
in scheme: Tesauro SIPA
preferred label: Sérigraphie @fr
preferred label: Silk-screen @en
broader: Gravura

Xilogravura
type: Concept
scope note: Técnica de gravura, que utiliza uma matriz de madeira, sendo a mais antiga a ser utilizada.
in scheme: Tesauro SIPA
preferred label: Woodcut @en
preferred label: Gravure sur bois @fr
preferred label: Xilografia @it
broader: Gravura

Incisão
type: Concept
in scheme: Tesauro SIPA
preferred label: Incision @en
preferred label: Incisione @it
broader: Processos e técnicas genéricos de registo e decoração

Incrustação
type: Concept
in scheme: Tesauro SIPA
preferred label: Incrustation @en
preferred label: Incrostazione @it
broader: Processos e técnicas genéricos de registo e decoração

Marmoreado
type: Concept
scope note: Técnica pictórica de imitação e fingimento da aparência do mármore executada sobre a madeira ou outros suportes.
in scheme: Tesauro SIPA
preferred label: Marbling @en
preferred label: Marbré @fr
preferred label: Marmorizzato @it
broader: Processos e técnicas genéricos de registo e decoração

Pintura (Processos e técnicas de registo e decoração genéricos)
type: Concept
in scheme: Tesauro SIPA
preferred label: Painting (Processes and techniques of registration and generic decoration) @en
preferred label: Peinture (Procédés et techniques d'enregistrement et de décoration générique) @fr
preferred label: Pittura (Processi e tecniche generiche di registrazione e decorazione) @it
broader: Processos e técnicas genéricos de registo e decoração
narrower: Aguarela
narrower: Pintura de azulejo
narrower: Pintura mural
narrower: Pintura segundo a técnica de aplicação da película cromática
narrower: Pintura a óleo
narrower: Pontata
narrower: Seco
narrower: Técnica mista
narrower: Têmpera

Aguarela
type: Concept
scope note: Técnica de pintura, em que os pigmentos são ligados com goma e diluídos em água, criando uma tinta translúcida.
in scheme: Tesauro SIPA
preferred label: Watercolour @en
preferred label: Aquarelle @fr
preferred label: Acquerello @it
broader: Pintura (Processos e técnicas de registo e decoração genéricos)

Pintura de azulejo
type: Concept
in scheme: Tesauro SIPA
preferred label: Tile painting @en
preferred label: Peinture des carrelages @fr
preferred label: Pittura di piastrelle @it
broader: Pintura (Processos e técnicas de registo e decoração genéricos)

Pintura mural
type: Concept
in scheme: Tesauro SIPA
preferred label: Mural painting @en
preferred label: Peinture murale @fr
preferred label: Pittura murale @it
broader: Pintura (Processos e técnicas de registo e decoração genéricos)

Pintura segundo a técnica de aplicação da película cromática
type: Concept
in scheme: Tesauro SIPA
preferred label: Painting by technique of application of chromatic film @en
preferred label: Peinture par technique d'application de film chromatique @fr
preferred label: Pittura secondo la tecnica di applicazione della pellicola cromatica @it
broader: Pintura (Processos e técnicas de registo e decoração genéricos)
narrower: Afresco
narrower: Campitura
narrower: Giornata
narrower: Pastilha

Afresco
type: Concept
in scheme: Tesauro SIPA
preferred label: Fresco
preferred label: Affresco @it
alternative label: A fresco
broader: Pintura segundo a técnica de aplicação da película cromática

Campitura
type: Concept
in scheme: Tesauro SIPA
broader: Pintura segundo a técnica de aplicação da película cromática

Giornata
type: Concept
in scheme: Tesauro SIPA
alternative label: Jornada
broader: Pintura segundo a técnica de aplicação da película cromática
narrower: Giornata “a scarpara”

Giornata “a scarpara”
type: Concept
in scheme: Tesauro SIPA
preferred label: Giornata "a scarpara" @fr
broader: Giornata

Pastilha
type: Concept
in scheme: Tesauro SIPA
preferred label: Tesselation; Pastilla @en
preferred label: Pastille @fr
preferred label: Pastilla @it
broader: Pintura segundo a técnica de aplicação da película cromática

Pintura a óleo
type: Concept
in scheme: Tesauro SIPA
preferred label: Oil painting @en
preferred label: Peinture à l'huile @fr
preferred label: Pittura ad olio @it
broader: Pintura (Processos e técnicas de registo e decoração genéricos)
narrower: Velatura

Velatura
type: Concept
in scheme: Tesauro SIPA
preferred label: Vélin @fr
preferred label: Glaze @en
broader: Pintura a óleo

Pontata
type: Concept
in scheme: Tesauro SIPA
broader: Pintura (Processos e técnicas de registo e decoração genéricos)

Seco
type: Concept
in scheme: Tesauro SIPA
preferred label: Secco @en
alternative label: A seco
alternative label: Asecco
broader: Pintura (Processos e técnicas de registo e decoração genéricos)

Técnica mista
type: Concept
in scheme: Tesauro SIPA
preferred label: Mixed technique @en
preferred label: Téchnique mixte @fr
preferred label: Tecnica mista @it
alternative label: Mezzo fresco
broader: Pintura (Processos e técnicas de registo e decoração genéricos)

Têmpera
type: Concept
in scheme: Tesauro SIPA
preferred label: Tempera @en
preferred label: Détempre @fr
preferred label: Tempra @it
broader: Pintura (Processos e técnicas de registo e decoração genéricos)

Prateado
type: Concept
in scheme: Tesauro SIPA
preferred label: Argenté @fr
preferred label: Argento @it
preferred label: Silver-plated; Silvery @en
broader: Processos e técnicas genéricos de registo e decoração

Relevado
type: Concept
scope note: Decoração formada pela marcação de formas em volume no barro ainda cru. No caso do azulejo é feito em moldes.
in scheme: Tesauro SIPA
preferred label: Relief @en
preferred label: Rilievo @it
broader: Processos e técnicas genéricos de registo e decoração

Repuxado
type: Concept
in scheme: Tesauro SIPA
preferred label: Repoussé; Embossing @en
preferred label: Repoussé @fr
preferred label: Sbuzzo; Rilevatura a sbalzo @it
broader: Processos e técnicas genéricos de registo e decoração

Serigrafado
type: Concept
in scheme: Tesauro SIPA
preferred label: Serigaphy @en
preferred label: Sérigraphie @fr
preferred label: Serigrafia @it
broader: Processos e técnicas genéricos de registo e decoração

Processos e técnicas de registo e decoração segundo o material
type: Concept
in scheme: Tesauro SIPA
preferred label: Procédés et techniques d'enregistrement et de décoration selon le matériau @fr
preferred label: Tecniche e processi di registrazione e decorazione in base al materiale @it
preferred label: Processes and techniques of registration and decoration according to material @en
broader: Processos e técnicas de registo e decoração
narrower: Processos e técnicas de registo e decoração de materiais cerâmicos
narrower: Processos e técnicas de registo e decoração de materiais vítreos

Processos e técnicas de registo e decoração de materiais cerâmicos
type: Concept
in scheme: Tesauro SIPA
preferred label: Processes and techniques for registration and decoration of ceramic materials @en
preferred label: Procédés et techniques d'enregistrement et de décoration des matériaux céramiques @fr
preferred label: Processi e tecniche di registrazione e decorazione di materiali ceramici @it
broader: Processos e técnicas de registo e decoração segundo o material
narrower: Bago de arroz
narrower: Fotocerâmica
narrower: Lustre
narrower: Majólica
narrower: Pedra torta
narrower: Tubagem

Bago de arroz
type: Concept
in scheme: Tesauro SIPA
preferred label: Grain of rice pottery @en
broader: Processos e técnicas de registo e decoração de materiais cerâmicos

Fotocerâmica
type: Concept
scope note: Técnica de decoração de azulejo imprimindo-se na superfície já vidrada uma imagem fotográfica.
in scheme: Tesauro SIPA
preferred label: Photoceramics @en
preferred label: Photocéramique @fr
preferred label: Fotoceramica @it
broader: Processos e técnicas de registo e decoração de materiais cerâmicos

Lustre
type: Concept
scope note: Decoração à base de nitratos de prata e cobre aplicados na faiança e que, posteriormente, através da cozedura em atmosfera redutora, dão à superfície do azulejo um brilho metálico.
in scheme: Tesauro SIPA
preferred label: Lucentezza @it
broader: Processos e técnicas de registo e decoração de materiais cerâmicos

Majólica
type: Concept
scope note: Técnica em que a peça cerâmica é coberta por uma substância vítrea, à base de esmalte estanífero, que serve de base à pintura realizada com óxidos metálicos. Durante a cozedura, o esmalte estanífero e os óxidos metálicos vitrificam.
in scheme: Tesauro SIPA
preferred label: Maiolica @it
preferred label: Majolica @en
preferred label: Majolique @fr
broader: Processos e técnicas de registo e decoração de materiais cerâmicos

Pedra torta
type: Concept
scope note: Técnica de pintura que consiste na aplicação da cor com uma esponja, obtendo uma decoração que aparenta uma textura rugosa, semelhante à cantaria. Na azulejaria, surge frequentemente em exemplares de revestimento de rodapés e lanços de escada, sendo denominada de pedra torta.
in scheme: Tesauro SIPA
preferred label: Tart stone @en
broader: Processos e técnicas de registo e decoração de materiais cerâmicos

Tubagem
type: Concept
in scheme: Tesauro SIPA
preferred label: Tubing @en
preferred label: Tuyauterie @fr
preferred label: Tubatura @it
broader: Processos e técnicas de registo e decoração de materiais cerâmicos

Processos e técnicas de registo e decoração de materiais vítreos
type: Concept
in scheme: Tesauro SIPA
preferred label: Processes and techniques for recording and decorating glass materials @en
preferred label: Procédés et techniques d'enregistrement et de décoration des matériaux en verre @fr
preferred label: Procedimenti e tecniche di registrazione e di decorazione dei materiali di vetro @it
broader: Processos e técnicas de registo e decoração segundo o material
narrower: Vitral

Vitral
type: Concept
in scheme: Tesauro SIPA
preferred label: Stained glass @en
preferred label: Vitrail @fr
preferred label: Vetrata @it
broader: Processos e técnicas de registo e decoração de materiais vítreos

Processos e técnicas piscatórias
type: Concept
in scheme: Tesauro SIPA
preferred label: Fishing processes and techniques @en
preferred label: Procédés et techniques de pêche @fr
preferred label: Processi e tecniche di pesca @it
broader: Processos e técnicas
narrower: Xávega

Xávega
type: Concept
in scheme: Tesauro SIPA
preferred label: Beach seining; Xávega fishing @en
preferred label: Pêche à la xávega; Senne de plage @fr
preferred label: Pesca con sciabica @it
broader: Processos e técnicas piscatórias

Processos destrutivos
type: Concept
in scheme: Tesauro SIPA
preferred label: Destructive processes @en
preferred label: Processus destructeurs @fr
preferred label: Processi distruttivi @it
broader: Processos e técnicas
narrower: Adulteração
narrower: Demolição
narrower: Fragmentação
narrower: Implosão
narrower: Destruição

Adulteração
type: Concept
scope note: Alteração substancial introduzida na morfologia do objeto arquitetónico e que resulta na descaracterização do mesmo: quer no que concerne ao seu perfil primitivo; quer no que respeita ao sentido arquitetónico, histórico ou cultural nos quais se enquadrou originalmente. As alterações introduzidas no âmbito de um processo de reestruturação funcional não implicam necessariamente o desenvolvimento de um fenómeno de adulteração
in scheme: Tesauro SIPA
preferred label: Adulteration; Tampering @en
preferred label: Adultération @fr
preferred label: Adulterazione @it
broader: Processos destrutivos

Demolição
type: Concept
in scheme: Tesauro SIPA
preferred label: Demolition @en
preferred label: Démolition @fr
preferred label: Demolizione @it
broader: Processos destrutivos

Fragmentação
type: Concept
in scheme: Tesauro SIPA
preferred label: Fragmentation @en
preferred label: Frammentazione @it
broader: Processos destrutivos

Implosão
type: Concept
in scheme: Tesauro SIPA
preferred label: Implosion @en
preferred label: Implosione @it
broader: Processos destrutivos

Destruição
type: Concept
in scheme: Tesauro SIPA
preferred label: Destruction @en
preferred label: Distruzione @it
broader: Processos destrutivos

Processos patológicos
type: Concept
in scheme: Tesauro SIPA
preferred label: Pathological processes @en
preferred label: Processus pathologiques @fr
preferred label: Processi patologici @it
alternative label: Patologia
broader: Processos e técnicas
narrower: Alterabilidade das rochas
narrower: Alteração cromática
narrower: Biodegradação
narrower: Pontes térmicas
narrower: Processos patológicos biológicos
narrower: Processos patológicos físico-químicos
narrower: Processos patológicos mecânicos
narrower: Processos patológicos naturais

Alterabilidade das rochas
type: Concept
in scheme: Tesauro SIPA
preferred label: Deformation of rocks @en
preferred label: Altération des roches @fr
preferred label: Alterabilità delle rocce @it
broader: Processos patológicos

Alteração cromática
type: Concept
scope note: Alteração que se manifesta através da variação de um ou mais parâmetros que definem a cor. A descoloração pode resultar da ação dos agentes atmosféricos (caso da tinta), raios ultravioleta ou migração de sais (caso da alvenaria aparelhada).
in scheme: Tesauro SIPA
preferred label: Chromatic change @en
preferred label: Altération de la couleur @fr
preferred label: Alterazione cromatica @it
broader: Processos patológicos

Biodegradação
type: Concept
scope note: Resultado da decomposição por micro-organismos de qualquer substância. Nota-se especialmente no enfraquecimento de estruturas de madeira devido ao ataque de fungos ou insetos xilófagos, em elementos de madeira como portas e janelas, em estátuas de pedra devido aos dejetos de animais, etc.
in scheme: Tesauro SIPA
preferred label: Biodegradation @en
preferred label: Biodégradation @fr
preferred label: Biodegradazione @it
broader: Processos patológicos

Pontes térmicas
type: Concept
scope note: Consiste na alteração significativa da resistência térmica de um edifício e da sua envolvente. As pontes térmicas podem ser causadas pela existência localizada de materiais de diferentes condutibilidades térmicas e/ou por uma modificação na geometria envolvente, como é o caso das ligações entre diferentes elementos construtivos. A resolução não passa apenas por homogeneizar a resistência térmica ao longo da superfície dos elementos construtivos da envolvente, sendo necessário atender também a outros fatores, tais como a ventilação e aquecimento dos espaços. Algumas das soluções realizadas para correção das pontes térmicas, apesar de constituírem uma melhoria do ponto de vista estritamente térmico, introduzem problemas de outra natureza, nomeadamente de instabilidade mecânica, sendo necessário conceber soluções que garantam um adequado comportamento global.
in scheme: Tesauro SIPA
preferred label: Thermal bridges @en
preferred label: Ponts thermiques @fr
preferred label: Ponti termici @it
broader: Processos patológicos

Processos patológicos biológicos
type: Concept
in scheme: Tesauro SIPA
preferred label: Biological pathological processes @en
preferred label: Processus biologiques pathologiques @fr
preferred label: Processi biologici patologici @it
broader: Processos patológicos
narrower: Processos patológicos biológicos genéricos
narrower: Processos patológicos biológicos segundo o material

Processos patológicos biológicos genéricos
type: Concept
in scheme: Tesauro SIPA
preferred label: Generic biological pathological processes @en
preferred label: Processus biologiques pathologiques génériques @fr
preferred label: Processi biologici patologici generici @it
broader: Processos patológicos biológicos
narrower: Infestação de algas
narrower: Infestação de bolores
narrower: Infestação de fungos
narrower: Liquenização

Infestação de algas
type: Concept
in scheme: Tesauro SIPA
preferred label: Algae infestation @en
preferred label: Infestation d'algues @fr
preferred label: Infestazione di alghe @it
broader: Processos patológicos biológicos genéricos

Infestação de bolores
type: Concept
in scheme: Tesauro SIPA
preferred label: Mould infestation @en
preferred label: Infestation de moisissures @fr
preferred label: Infestazione di muffe @it
broader: Processos patológicos biológicos genéricos

Infestação de fungos
type: Concept
in scheme: Tesauro SIPA
preferred label: Fungae infestation @en
preferred label: Infestation fongique @fr
preferred label: Infestazione fungina @it
broader: Processos patológicos biológicos genéricos

Liquenização
type: Concept
in scheme: Tesauro SIPA
preferred label: Liqchenization @en
broader: Processos patológicos biológicos genéricos

Processos patológicos biológicos segundo o material
type: Concept
in scheme: Tesauro SIPA
preferred label: Biological pathological processes according to the material @en
preferred label: Procédés biologiques pathologiques en fonction du matériau @fr
preferred label: Processi biologici patologici a seconda del materiale @it
broader: Processos patológicos biológicos
narrower: Processos patológicos biológicos aplicados à madeira

Processos patológicos biológicos aplicados à madeira
type: Concept
in scheme: Tesauro SIPA
preferred label: Processus biologiques pathologiques appliqués au bois @fr
preferred label: Processi biologici patologici applicati al legno @it
preferred label: Biological Pathological processes applied to wood @en
broader: Processos patológicos biológicos segundo o material
narrower: Infestação de xilófagos

Infestação de xilófagos
type: Concept
in scheme: Tesauro SIPA
preferred label: Xylophage infestation @en
preferred label: Infestation de xylophages @fr
preferred label: Infestazione da xilofagi @it
broader: Processos patológicos biológicos aplicados à madeira
related: c 4ab63295
modified: 2025-09-23T13:19:32

Processos patológicos físico-químicos
type: Concept
in scheme: Tesauro SIPA
preferred label: Physico-chemical pathological processes @en
preferred label: Processus pathologiques physico-chimiques @fr
preferred label: Processi patologici fisico-chimici @it
broader: Processos patológicos
narrower: Calcinação
narrower: Carbonatação
narrower: Criptoflorescência
narrower: Corrosão
narrower: Decomposição
narrower: Eflorescência salina
narrower: Enegrecimento
narrower: Oxidação
narrower: Pulverulência

Calcinação
type: Concept
in scheme: Tesauro SIPA
preferred label: Calcination @en
preferred label: Calcinazione @it
broader: Processos patológicos físico-químicos

Carbonatação
type: Concept
scope note: Processo pelo qual o dióxido de carbono existente na atmosfera migra para o betão e neutraliza a alcalinidade da água capilar, reduzindo o seu pH (de valor normal 12 a 13). No caso do betão armado, se o pH das zonas em contacto com os varões for inferior a 11,5 pode dar-se a oxidação natural da fração ferrosa do aço.
in scheme: Tesauro SIPA
preferred label: Carbonation @en
preferred label: Carbonatation @fr
preferred label: Carbonatazione @it
broader: Processos patológicos físico-químicos

Criptoflorescência
type: Concept
scope note: Cristalização de sais sob a superfície exterior do revestimento. Quando a água abandona a argamassa ou se verifica uma diminuição da humidade relativa, os sais nela dissolvidos recristalizam no interior da estrutura porosa da argamassa, aumentando de volume, originando a destruição da matriz e a degradação da superfície do reboco (que estala ou se desfaz, adquirindo uma consistência pulverulenta). Uma vez no interior da argamassa, os sais podem ser transportados pela água e depositar-se na superfície dos rebocos quando esta se evapora. Este tipo de anomalia carateriza-se pela formação de uma substância de aparência cristalina ou filamentosa, geralmente de cor esbranquiçada, que aflora à superfície alterando o aspeto visual do revestimento (vulgarmente conhecido por salitre). As cripto florescências são menos percetíveis do que as eflorescências e por vezes só se detetam após a queda dos rebocos por destaque.
in scheme: Tesauro SIPA
preferred label: Cryptoflowering; Crypto efflorescence @en
preferred label: Cryptoflorescense; Cryptofloraison @fr
preferred label: Cryptoflorescenza; Cryptofioritura @it
broader: Processos patológicos físico-químicos

Corrosão
type: Concept
scope note: Erosão química ou eletroquímica que pode ocorrer em vários materiais ao interagirem com o meio ambiente. No caso da pedra e em especial nos calcários devido à presença do anidrido carbónico, é provocada pela água ou por substâncias por ela transportadas em suspensão ou diluídas, originando superfícies rugosas e não polidas. No caso dos metais trata-se ou de oxidação, processo químico em que a humidade e o oxigénio provocam o aparecimento de ferrugem e que se deve à falta de proteção superficial do material (caso de portas metálicas, grades de ferro forjado, etc.) ou de corrosão propriamente dita, processo predominantemente eletroquímico que se dá em meio aquoso, com a formação duma película de eletrólito sobre a superfície do aço (caso dos elementos de betão armado). O ácido tânico da madeira ou da tinta pode também atacar o ferro forjado de dobradiças e fechos. Os dejetos de aves também podem corroer os metais. No caso do betão, trata-se dum processo químico em que se dá a redução do pH da água capilar através da migração para o betão do dióxido de carbono da atmosfera (carbonização) ou através da penetração do betão pelos iões cloro, dissolvidos a partir de sais existentes na superfície do mesmo (sais descongelantes ou água salgada). No caso dos rebocos e placagem calcária, a presença de água pode provocar a dissolução de partículas.
in scheme: Tesauro SIPA
preferred label: Corrosion @en
preferred label: Corrosione @it
broader: Processos patológicos físico-químicos

Decomposição
type: Concept
in scheme: Tesauro SIPA
preferred label: Decomposition @en
preferred label: Décomposition @fr
preferred label: Decomposizione @it
broader: Processos patológicos físico-químicos

Eflorescência salina
type: Concept
scope note: Cristalização de sais na superfície exterior de um revestimento. As eflorescências, por aflorarem à superfície, têm um aspeto visual mais agressivo do que as cripto florescências. Causam o destaque das tintas, podendo eventualmente originar a desagregação do reboco à superfície. Quando a água abandona a argamassa ou se verifica uma diminuição da humidade relativa, os sais nela dissolvidos recristalizam no interior da estrutura porosa da argamassa, aumentando de volume, originando a destruição da matriz e a degradação da superfície do reboco (que estala ou se desfaz, adquirindo uma consistência pulverulenta). Uma vez no interior da argamassa, os sais podem ser transportados pela água e depositar-se na superfície dos rebocos quando esta se evapora. Este tipo de anomalia caracteriza-se pela formação de uma substância de aparência cristalina ou filamentosa, geralmente de cor esbranquiçada, que aflora à superfície alterando o aspeto visual do revestimento (vulgarmente conhecido por salitre).
in scheme: Tesauro SIPA
preferred label: Saline efflorescence @en
preferred label: Efflorescence saline @fr
preferred label: Efflorescenza salina @it
alternative label: Salitre
broader: Processos patológicos físico-químicos

Enegrecimento
type: Concept
in scheme: Tesauro SIPA
preferred label: Blackening @en
preferred label: Noircissement @fr
preferred label: Annerimento @it
broader: Processos patológicos físico-químicos

Oxidação
type: Concept
scope note: Transformação do ferro ou aço em ferrugem por ação da humidade e dos gases da atmosfera (em especial do oxigénio), formando-se uma película de óxido de ferro. Este tipo de corrosão é muito lento à temperatura ambiente e não provoca grande deterioração nas superfícies metálicas, a não ser que existam gases muito agressivos na atmosfera.
in scheme: Tesauro SIPA
preferred label: Oxidation @en
preferred label: Oxydation @fr
preferred label: Ossidazione @it
broader: Processos patológicos físico-químicos

Pulverulência
type: Concept
in scheme: Tesauro SIPA
preferred label: Pulverulence @en
preferred label: Pulvérulence @fr
preferred label: Polverosità @it
broader: Processos patológicos físico-químicos

Processos patológicos mecânicos
type: Concept
in scheme: Tesauro SIPA
preferred label: Mechanical pathological processes @en
preferred label: Processus pathologiques mécaniques @fr
preferred label: Processi patologici meccanici @it
broader: Processos patológicos
narrower: Processos patológicos mecânicos genéricos

Processos patológicos mecânicos genéricos
type: Concept
in scheme: Tesauro SIPA
preferred label: Generic mechanical pathological processes @en
preferred label: Processus mécaniques pathologiques génériques @fr
preferred label: Processi meccanici patologici generici @it
broader: Processos patológicos mecânicos
narrower: Assentamento
narrower: Esbeiçadela
narrower: Desagregação
narrower: Destacamento
narrower: Empolamento
narrower: Fendilhação
narrower: Fissuração
narrower: Fratura
narrower: Lacuna
narrower: Processos patológicos mecânicos segundo o material

Assentamento
type: Concept
in scheme: Tesauro SIPA
preferred label: Settlement (Consolidation) @en
preferred label: Tassement @fr
preferred label: Assestamento; Cedimento @it
broader: Processos patológicos mecânicos genéricos
narrower: Assentamento diferencial

Assentamento diferencial
type: Concept
scope note: Movimento desigual do solo sob um edifício ou uma estrutura, afetando as fundações, que assentam em cotas diferentes do terreno. Esta diferença de comportamento pode ser causada por variações na composição e resistência do solo, diferentes cargas aplicadas em diferentes áreas da estrutura, ou mesmo por fatores ambientais, como a variação da humidade ou a presença de árvores. Está na origem de fissuras nas paredes e pavimentos, desalinhamento de portas e janelas, e pode comprometer a estabilidade da construção.
in scheme: Tesauro SIPA
preferred label: Differential settlement @en
preferred label: Tassement différentiel @fr
preferred label: Cedimento differenziale @it
broader: Assentamento

Esbeiçadela
type: Concept
in scheme: Tesauro SIPA
preferred label: Chip @en
broader: Processos patológicos mecânicos genéricos

Desagregação
type: Concept
scope note: Perda de coesão caracterizada pelo destacamento de grânulos ou cristais à mínima solicitação mecânica, no caso da pedra, resultado da sua incorreta colocação em pilares e colunas ficando os níveis de sedimentação natural paralelos ao esforço de compressão, ou devido a stress físico do material ou a ação de chuvas ácidas. Pode também ocorrer desagregação completa das argamassas de revestimento das alvenarias da parede em resultado da presença de torrões argilosos, com excesso de finos na areia ou com a presença de mica em quantidade apreciável (a qual pode reduzir a aderência do revestimento à base ou de duas camadas entre si), com o traço das argamassas de cal que sendo magras, da ordem de 1:16 de cal e areia, revelam pouca aderência, com a falta de proteção à ação da água da chuva ou a ataque de cloretos, devido a cripto eflorescências, presença orgânica, erosão mecânica ou natural, má qualidade ou má execução do revestimento (uso de argamassas com saibro, aplicação sem prévio chapisco ou sobre betão impregnado de desmoldante, usando chapisco com produto hidrofugante, aplicando sobre camada de base sem a rugosidade suficiente, usando espessuras exageradas superiores a 2cm para o emboço e 2mm para o reboco, etc.), falta de proteção por tinta ou fim de vida útil do material. Pode, ainda ocorrer a desagregação do enchimento interior das paredes devido a impermeabilidade do revestimento exterior que provoca a dissolução das argamassas interiores e a fragilização das paredes.
in scheme: Tesauro SIPA
preferred label: Disaggregation @en
preferred label: Désagrégation @fr
preferred label: Disgregazione @it
broader: Processos patológicos mecânicos genéricos

Destacamento
type: Concept
scope note: Desprendimento de elementos do seu suporte devido a várias causas como sejam as infiltrações de água, falta de aderência, cripto eflorescências, movimentos diferenciais ou incompatibilidade entre o suporte e o revestimento, defeitos de execução (caso de aplicação de argamassas demasiado ricas ou aplicadas em camadas muito espessas, superfícies de base muito lisas ou impregnadas de substância hidrófuga, ou ausência de chapisco que originam o destacamento de placas endurecidas que não se partem facilmente, o caso de aplicação de argamassas magras e ausência da camada de chapisco que originam o destacamento de placas endurecidas mas quebradiças, desagregando-se facilmente, ou o caso de excesso de finos no agregado, traço pobre nos aglomerantes e muito rico em cal, ausência da carbonatação da cal ou reboco aplicado em camada muito espessa, que originam a descolagem da película de tinta arrastando por vezes o reboco que se desagrega facilmente), insuficiente permeabilidade ao vapor de água (caso de rebocos, placagem, azulejos, pinturas), rotura do material ou do suporte, falta de qualidade do material, ação mecânica (choques), vandalismo, envelhecimento, etc. Resulta em geral da fixação incorreta do revestimento (caso de placas de xisto ou granito das fachadas), de conceção e/ou aplicação deficiente do capeamento (caso do capeamento metálico de platibandas) ou de processos químicos atuantes sobre materiais (caso do destacamento do betão devido a corrosão de armaduras em fachadas de betão).
in scheme: Tesauro SIPA
preferred label: Separation @en
preferred label: Séparation @fr
preferred label: Separazione @it
broader: Processos patológicos mecânicos genéricos

Empolamento
type: Concept
scope note: Degradação que aparece sob a forma de bolhas e de ampolas à superfície do material. Precede a escamação (nas rochas) ou o destacamento (no reboco ou nas membranas elásticas) que são estádios mais avançados de alteração. Pode ocorrer, por exemplo, em pavimentos devido a instabilidade e expansão higrotérmica, condensações interiores ou a degradação do suporte (caso de tela em terraços e fachadas), a má aplicação e feitura dos revestimentos (em paredes em que o reboco endurecido devido a carbonatação da cal empola progressivamente, descolando o emboço por hidratação do óxido de magnésio presente nas argamassas com cal, a qual se verifica juntamente com a carbonatação), a presença de humidade ascendente ou infiltrações de água pluvial nas paredes, a insuficiente permeabilidade ao vapor de água proveniente das paredes (caso das tintas impermeáveis como as de óleo, em que a percolação da água através da alvenaria se acumula entre o revestimento e a tinta formando bolhas), etc.
in scheme: Tesauro SIPA
preferred label: Blistering; Swelling @en
preferred label: Cloquage; Gonflement @fr
preferred label: Rigonfiamento; Vescicatura @it
broader: Processos patológicos mecânicos genéricos

Fendilhação
type: Concept
scope note: Abertura de fendas ou rachas na superfície dos materiais, causadas por fatores como tensões, vibrações ou a ação do tempo.
in scheme: Tesauro SIPA
preferred label: Cracking @en
preferred label: Fendillement @fr
preferred label: Incrinatura @it
broader: Processos patológicos mecânicos genéricos

Fissuração
type: Concept
scope note: Degradação que se manifesta pela formação de soluções de descontinuidade nas rochas ou outros materiais, curtas, finas, com desenvolvimento discreto, nunca abertas e nunca atingindo os limites dos corpos considerados.
in scheme: Tesauro SIPA
preferred label: Fissuring @en
preferred label: Fissuration @fr
preferred label: Screpolatura @it
broader: Processos patológicos mecânicos genéricos

Fratura
type: Concept
in scheme: Tesauro SIPA
preferred label: Fracture @en
preferred label: Frattura @it
broader: Processos patológicos mecânicos genéricos

Lacuna
type: Concept
scope note: Degradação que se manifesta pela queda e perda de partes da pedra da edificação ou de elementos de revestimento como azulejos e placas cerâmicas, devido a colagem deficiente ou falta de aderência (caso do estuque), deformação do suporte, remoção para restauro, roubo, envelhecimento ou intervenção incorreta (caso de frescos). No caso dos azulejos pode haver perda do vidrado por erosão (vento, poeiras, areia) ou variações de temperatura.
in scheme: Tesauro SIPA
preferred label: Gap @en
preferred label: Lacune @fr
broader: Processos patológicos mecânicos genéricos

Processos patológicos mecânicos segundo o material
type: Concept
in scheme: Tesauro SIPA
preferred label: Mechanical pathological processes according to the material @en
preferred label: Procédés mécaniques pathologiques selon le matériau @fr
preferred label: Processi meccanici patologici secondo il materiale @it
broader: Processos patológicos mecânicos genéricos
narrower: Processos patológicos mecânicos aplicados à cerâmica

Processos patológicos mecânicos aplicados à cerâmica
type: Concept
in scheme: Tesauro SIPA
preferred label: Mechanical pathological processes applied to ceramics @en
preferred label: Procédés mécaniques pathologiques appliqués à la céramique @fr
preferred label: Procedimenti meccanici patologici applicati alla ceramica @it
broader: Processos patológicos mecânicos segundo o material
narrower: Descolamento do ladrilho
narrower: Desgaste do vidrado
narrower: Destacamento do vidrado
narrower: Empolamento do vidrado
narrower: Enodoamento
narrower: Esmagamento dos bordos do ladrilho
narrower: Falha do vidrado
narrower: Fissuração do ladrilho
narrower: Fissuração do vidrado

Descolamento do ladrilho
type: Concept
scope note: O descolamento de ladrilhos consiste na perda de aderência, relativamente ao suporte, com ou sem empolamento. O descolamento é um dos defeitos mais habituais dos sistemas de revestimento cerâmico colados ao suporte, em paredes ou pavimentos. Esta anomalia ocorre com maior intensidade e com maiores consequências funcionais no exterior dos edifícios. O descolamento pode ser pontual ou localizado, geralmente associado a deficiências de aplicação ou do tipo de suporte (deficiências de limpeza, planeza, porosidade). Os descolamentos generalizados, com ou sem empolamento prévio do revestimento poderão ocorrer devido à elevada expansão dos ladrilhos conjugada com a ausência de juntas elásticas no contorno do revestimento e a inadequabilidade do ladrilho à orientação solar pretendida, devido a movimentos diferenciais suporte-sistema de revestimento, à falta de qualidade do material de colagem, a deficiências na metodologia de aplicação ou à aderência insuficiente ou incompatibilidade entre as várias camadas do sistema de revestimento.
in scheme: Tesauro SIPA
preferred label: Tile cracking @en
preferred label: Fissuration des carreaux @fr
preferred label: Fessurazione delle piastrelle @it
broader: Processos patológicos mecânicos aplicados à cerâmica

Desgaste do vidrado
type: Concept
scope note: Desprendimento de grandes zonas do vidrado da chacota deixando entre estes um espaço oco.
in scheme: Tesauro SIPA
preferred label: Glaze wearing @en
preferred label: Usure de l'émail @fr
preferred label: Usura dello smalto @it
broader: Processos patológicos mecânicos aplicados à cerâmica

Destacamento do vidrado
type: Concept
scope note: Desprendimento em lascas de zonas do vidrado.
in scheme: Tesauro SIPA
preferred label: Glaze separation @en
preferred label: Détachement de l'émail @fr
preferred label: Distacco dello smalto @it
broader: Processos patológicos mecânicos aplicados à cerâmica

Empolamento do vidrado
type: Concept
scope note: É uma anomalia estética caracterizada por manchas na superfície do revestimento. As causas mais prováveis de manchas de produtos enodoantes na face útil dos ladrilhos são a seleção inadequada dos ladrilhos para a aplicação em causa, não tendo sido tomadas em conta as características do uso inerente ao espaço revestido; a insuficiente classificação funcional dos ladrilhos para o espaço revestido, a abertura de poros na superfície dos ladrilhos em consequência do desgaste ou de ataque químico, retendo a sujidade.
in scheme: Tesauro SIPA
preferred label: Glaze blistering @en
preferred label: Cloquage de l'émail @fr
preferred label: Formazione di vesciche di smalto @it
broader: Processos patológicos mecânicos aplicados à cerâmica

Enodoamento
type: Concept
in scheme: Tesauro SIPA
preferred label: Frotting @en
preferred label: Souillure @fr
preferred label: Macchiare @it
broader: Processos patológicos mecânicos aplicados à cerâmica

Esmagamento dos bordos do ladrilho
type: Concept
in scheme: Tesauro SIPA
preferred label: Tile edges crushing @en
preferred label: Écrasement du bord des carreaux @fr
preferred label: Schiacciamento del bordo delle piastrelle @it
broader: Processos patológicos mecânicos aplicados à cerâmica

Falha do vidrado
type: Concept
scope note: Falta de vidrado numa determinada zona de uma peça e que pode estar associado a diversos fatores de degradação como sais, defeito de fabrico, processos de restauro inadequados, entre outros.
in scheme: Tesauro SIPA
preferred label: Glaze gap @en
preferred label: Faille de l'émail @fr
preferred label: Fessura dello smalto @it
broader: Processos patológicos mecânicos aplicados à cerâmica

Fissuração do ladrilho
type: Concept
scope note: A fissuração ou fendilhação de ladrilhos consiste na ocorrência de fendas de pequena dimensão que atravessam toda a espessura do ladrilho atingindo a chacota e o vidrado. A fissuração é um dos defeitos mais habituais dos sistemas de revestimento cerâmico colados ao suporte, em paredes ou pavimentos. Esta anomalia ocorre com maior intensidade e com maiores consequências funcionais no exterior dos edifícios. A fissuração dos revestimentos cerâmicos de paredes está associada, em geral, a movimentos do suporte, acompanhados ou não da fissuração do próprio suporte, incompatíveis com a elasticidade do produto de colagem, com a contração ou expansão do produto de assentamento dos ladrilhos, com a resistência à tração dos ladrilhos, com a dimensão das juntas e sua colmatação, com impactos físicos e com rotura por flexão em ladrilhos mal assentes.
in scheme: Tesauro SIPA
preferred label: Fissuration des carreaux @fr
preferred label: Fessurazione delle piastrelle @it
preferred label: Tile cracing @en
broader: Processos patológicos mecânicos aplicados à cerâmica

Fissuração do vidrado
type: Concept
in scheme: Tesauro SIPA
preferred label: Glaze cracking @en
preferred label: Fissuration de la glaçure @fr
preferred label: Fessurazione dello smalto @it
alternative label: Cabelo
broader: Processos patológicos mecânicos aplicados à cerâmica

Processos patológicos naturais
type: Concept
in scheme: Tesauro SIPA
preferred label: Natural pathological processes @en
preferred label: Processus pathologiques naturels @fr
preferred label: Processi patologici naturali @it
broader: Processos patológicos
narrower: Assoreamento

Assoreamento
type: Concept
scope note: Depósito de sedimentos (transportados a curtas ou a longas distâncias) resultantes de processos erosivos nos solos e rochas, por acção das águas, ventos, processos químicos, antropogénicos e físicos.
in scheme: Tesauro SIPA
preferred label: Siltation @en
preferred label: Envasement @fr
preferred label: Sedimentazione @it
broader: Processos patológicos naturais

ATIVIDADES, EVENTOS, FENÓMENOS, PROCESSOS E TÉCNICAS
type: Collection
type: ConceptGroup
preferred label: ACTIVITIES, EVENTS, PHENOMENA, PROCESSES AND TECHNIQUES @en
preferred label: ACTIVITÉS, ÉVÉNEMENTS, PHÉNOMÈNES, PROCESSUS ET TECHNIQUES @fr
preferred label: ATTIVITÀ, EVENTI, FENOMENI, PROCESSI E TECNICHE @it
member: Atividades, eventos, fenómenos, processos e técnicas
member: Atividades
member: Atividades genéricas
member: Associativismo
member: Avaliação
member: Avaliação ambiental
member: Avaliação de desempenho
member: Avaliação de riscos
member: Avaliação estrutural
member: Atividades segundo a função
member: Atividades agrícolas
member: Atividades agrícolas segundo o tipo
member: Agricultura biológica
member: Agricultura de subsistência
member: Agricultura familiar
member: Agricultura medicinal
member: Agricultura sustentável
member: Ceifar
member: Atividades agroindustriais
member: Atividades agropecuárias
member: Atividades artesanais
member: Alfaiataria
member: Alta-costura
member: Carpintaria
member: Cerâmica
member: Cerâmica segundo o tipo
member: Cerâmica campaniense
member: Cerâmica campaniforme
member: Marcenaria
member: Olaria
member: Têxtil
member: Bordado
member: Paramentaria
member: Tapeçaria
member: Tecidos
member: Atividades assistenciais
member: Atividades científicas e tecnológicas
member: Analisar
member: Análise antropológica
member: Análise arqueológica
member: Análise arquitetónica
member: Análise comparativa
member: Análise de conteúdo
member: Análise de custos
member: Análise de dados
member: Análise de estruturas
member: Análise do comportamento estrutural
member: Análise de projetos
member: Análise de risco
member: Análise de sistemas
member: Análise demográfica
member: Análise documental
member: Análise dos materiais
member: Análise ecológica
member: Análise económica
member: Análise espacial
member: Análise estatística
member: Análise geológica
member: Análise histórica
member: Análise laboratorial
member: Análise química
member: Exame radiológico
member: Análise literária
member: Análise métrica
member: Análise paisagística
member: Análise patogénica
member: Análise política
member: Análise populacional
member: Análise regional
member: Análise sensorial
member: Análise social
member: Análise socioeconómica
member: Análise sociológica
member: Análise térmica

AGLOMERADOS URBANOS
type: Collection
type: ConceptGroup
preferred label: URBAN AGGLOMERATIONS @en
preferred label: AGGLOMÉRATIONS URBAINES @fr
preferred label: AGGLOMERATI URBANI @it
member: Aglomerados Urbanos
member: Aglomerado urbano segundo a escala
member: Aldeia
member: Área metropolitana
member: Cidade (Aglomerados urbanos)
member: Cidade média
member: Conurbação
member: Lugar
member: Lugarejo
member: Megalopolis
member: Metrópole
member: Povoado
member: Vila
member: Aglomerado urbano segundo a forma
member: Aglomerado urbano de formação dispersa
member: Aglomerado urbano de formação espontânea
member: Aglomerado urbano de traçado linear
member: Aglomerado urbano de traçado orgânico
member: Aglomerado urbano de traçado regular
member: Aglomerado urbano de traçado ortogonal
member: Aglomerado urbano de traçado radioconcêntrico
member: Aglomerado urbano segundo a função
member: Aglomerado urbano administrativo
member: Capital (Aglomerado urbano administrativo)
member: Cidade colonial
member: Civitas
member: Polis
member: Aglomerado urbano militar
member: Castro
member: Citânia
member: Hisn
member: Oppidum
member: Praça de guerra
member: Aglomerado urbano segundo a base económica
member: Arraial
member: Cidade industrial
member: Cidade mineira
member: Feitoria
member: Vila franca
member: Vila piscatória
member: Aglomerado urbano segundo a condição
member: Cidade em ruínas
member: Cidade perdida
member: Aglomerado urbano segundo a localização
member: Cidade satélite
member: Aglomerado urbano segundo o conceito de ordenamento territorial
member: Bastide
member: Cidade nova
member: Vila nova
member: Aglomerado urbano segundo o conceito de planeamento
member: Cidade ideal
member: Cidade jardim
member: Componentes de aglomerados urbanos
member: Espaço urbano
member: Espaço urbano edificado
member: Edifício
member: Equipamento urbano
member: Estruturas construídas
member: Lote
member: Lote estreito
member: Lote largo
member: Lote quadrangular
member: Quarteirão
member: Quarteirão irregular
member: Quarteirão regular
member: Espaço urbano edificado segundo a importância
member: Espaço urbano edificado de referência
member: Espaço urbano edificado de acompanhamento
member: Espaço urbano edificado segundo a localização
member: Gaveto (Espaço urbano edificado segundo a localização)
member: Espaço urbano edificado segundo a relação com o contexto
member: Espaço urbano edificado adulterado
member: Espaço urbano edificado qualificador
member: Espaço urbano não edificado

Aglomerados Urbanos
type: Concept
in scheme: Tesauro SIPA
top concept of: Tesauro SIPA
preferred label: Urban agglomerations @en
preferred label: Agglomérations urbaines @fr
preferred label: Agglomerati urbani @it
narrower: Aglomerado urbano segundo a escala
narrower: Aglomerado urbano segundo a forma
narrower: Aglomerado urbano segundo a função
narrower: Aglomerado urbano segundo a base económica
narrower: Aglomerado urbano segundo a condição
narrower: Aglomerado urbano segundo a localização
narrower: Aglomerado urbano segundo o conceito de ordenamento territorial
narrower: Aglomerado urbano segundo o conceito de planeamento
narrower: Componentes de aglomerados urbanos
related: c 7e244aff
related: c 5a5bb2d6
modified: 2025-09-23T10:38:59

Aglomerado urbano segundo a escala
type: Concept
in scheme: Tesauro SIPA
preferred label: Urban agglomeration according to scale @en
preferred label: Agglomération urbaine selon l'échelle @fr
preferred label: Agglomerazione urbana secondo la scala @it
broader: Aglomerados Urbanos
narrower: Aldeia
narrower: Área metropolitana
narrower: Cidade (Aglomerados urbanos)
narrower: Conurbação
narrower: Lugar
narrower: Megalopolis
narrower: Metrópole
narrower: Povoado
narrower: Vila
narrower: Aglomerado urbano militar
narrower: Setor urbano
narrower: Sistema urbano

Aldeia
type: Concept
scope note: Pequeno aglomerado urbano, com uma densidade populacional inferior à de uma vila.
in scheme: Tesauro SIPA
preferred label: Village @en
preferred label: Villagio @it
broader: Aglomerado urbano segundo a escala

Área metropolitana
type: Concept
scope note: Grande centro populacional. Consiste num conjunto de várias cidades com estatuto de região metrópole ligadas entre si por um nexo de continuidade territorial. Termo utilizado na prática urbanística norte-americana na qual uma área metropolitana designa e delimita uma região urbana constituída por várias cidades. Não tendo que ser obrigatoriamente formada por áreas contínuas urbanizadas, é necessário que os municípios que a constituem possuam um alto grau de interação entre si, o que torna o conceito de área metropolitana diferente do de conurbação. No caso português e de acordo com o âmbito territorial e demográfico, as áreas metropolitanas podem ser de dois tipos: grandes áreas metropolitanas (GAM) e comunidades urbanas (ComUrb). As primeiras compreendem obrigatoriamente um mínimo de nove municípios com pelo menos 350000 habitantes, as comunidades urbanas um mínimo de três municípios com pelo menos 150000 habitantes. No caso da Grande Área Metropolitana de Lisboa são dezoito os municípios que a compõem: Alcochete, Almada, Amadora, Barreiro, Cascais, Lisboa, Loures, Mafra, Moita, Montijo, Odivelas, Oeiras, Palmela, Sesimbra, Setúbal, Seixal, Sintra e Vila Franca de Xira.
in scheme: Tesauro SIPA
preferred label: Metropolitan área @en
broader: Aglomerado urbano segundo a escala

Cidade (Aglomerados urbanos)
type: Concept
scope note: Área urbana localizada em área geográfica circunscrita. Geralmente consiste num somatório de áreas – residenciais, industriais e de serviços – assim como de funções administrativas relacionadas com uma área geográfica mais abrangente. Existem (segundo Françoise Choay) três condições indispensáveis para que um dado território seja considerado uma cidade: aglomeração de construções, determinados padrões sociais de população e uma determinada dimensão. Uma grande parte da área da cidade é ocupada por habitação, sendo que essa é suportada por infraestruturas tais como estradas, ruas e rotas de transportes públicos como o metropolitano e o comboio. Lagos e rios serão as únicas áreas não construídas dentro da cidade. Segundo a legislação, tem que ter mais 8000 habitantes e possua instalações hospitalares, farmácia, bombeiros, casa de espetáculos, museu, biblioteca, instalações hoteleiras, estabelecimentos de ensino e transportes públicos urbanos e suburbanos.
in scheme: Tesauro SIPA
preferred label: City (Urban agglomerations) @en
preferred label: Ville (Agglomérations urbaines) @fr
preferred label: Città (Agglomerati urbani) @it
broader: Aglomerado urbano segundo a escala
narrower: Cidade média

Cidade média
type: Concept
scope note: Cidade cuja dimensão depende largamente da rede urbana em que se insere sendo por isso um conceito de natureza relativa. É no século XVII que Lubin e Sanson propõem a classificação dos aglomerados populacionais em seis grandezas: grandes cidades, cidades médias, pequenas cidades. Embora de natureza relativa, a noção de cidade média tem sempre como referência o conceito de dimensão ótima dentro do contexto urbano em que se insere; pode tratar-se de cidades com 20 a 50 mil habitantes, de 20 a 100 mil habitantes e, nomeadamente na realidade americana, de 200 a 500 mil habitantes. A cidade média seria assim o local onde a população encontraria o necessário ao seu desenvolvimento sem lidar com as questões prejudiciais da poluição e insegurança típicas das grandes cidades.
in scheme: Tesauro SIPA
preferred label: Medium-sized city (Moderate density cluster) @en
broader: Cidade (Aglomerados urbanos)

Conurbação
type: Concept
scope note: Território construído formado por um conjunto de aglomerados que, através do seu desenvolvimento e expansão, se fundiram num só criando um contínuo urbano. O termo começou por ser aplicado às regiões urbanizadas que a Revolução Industrial disseminou em Inglaterra e na Escócia durante o século XIX, tendo sido também aplicado a regiões do mesmo tipo existentes em países como a Bélgica e a Alemanha e a algumas do Nordeste dos Estados Unidos. Este fenómeno só irá ver o seu crescimento já no século XX; razões como a globalização, a relocalização de centros empresarias fora do limite das cidades, a migração da população para os subúrbios das cidades e a consequente perda da sua centralidade criaram as condições para o aumento de conurbações. O processo de formação de uma conurbação caracteriza-se por um crescimento da cidade, que se expande para fora do seu perímetro, indo ao encontro de outros aglomerados urbanos que, inicialmente autónomos política e administrativamente, passam a ser parte integrante e dependentes de uma metrópole. Com a expansão e integração de diferentes aglomerados urbanos, a tendência é para o desaparecimento das fronteiras físicas de cada um originando a continuidade urbana característica das conurbações.
in scheme: Tesauro SIPA
preferred label: Conurbation @en
preferred label: Conurbazione @it
broader: Aglomerado urbano segundo a escala

Lugar
type: Concept
in scheme: Tesauro SIPA
preferred label: Place @en
preferred label: Endroit (Lieu) @fr
preferred label: Posto @it
broader: Aglomerado urbano segundo a escala
narrower: Lugarejo

Lugarejo
type: Concept
scope note: Pequeno lugar.
in scheme: Tesauro SIPA
preferred label: Hamlet @en
broader: Lugar

Megalopolis
type: Concept
scope note: Região de intenso desenvolvimento urbano, formando uma extensa área construída onde as zonas rurais se encontram praticamente ausentes. Conceito que designa as maiores e mais importantes aglomerações urbanas da atualidade. Cidade muito grande ou zona geográfica que agrupa grandes aglomerados. As megalópolis do final do século XX são essencialmente devidas à hipertrofia dos aglomerados urbanos principais nos países em vias de desenvolvimento: Istambul, Cidade do México, São Paulo e Cairo. A megalópole caracteriza-se por uma extensa área metropolitana ou conjunto de áreas metropolitanas mais ou menos contínuas que totalizam no seu conjunto mais de 10 milhões de habitantes. O termo foi usado pela primeira vez por Jean Gottmann em 1957 para descrever a extensa área urbana da Costa Este dos Estados Unidos compreendida entre Boston (Massachusetts) e Washington (D.C.). O continente americano oferece múltiplos exemplos de megalópoles; na América do Norte, de Pittsburgh a Chicago a Sul da zona dos Grandes Lagos, de San Diego a San Francisco na Califórnia, de Windsor-Detroit ao Québec no Canadá. Na América Latina as megalópoles são frequentes em praticamente todos os países sendo no México que se localiza o exemplo mais paradigmático; a Cidade do México é atualmente a maior cidade do México totalizando cerca de 20 milhões de habitantes num país cuja população alcança os 50 milhões.
in scheme: Tesauro SIPA
preferred label: Mégalopolis @fr
preferred label: Megalopoli @it
broader: Aglomerado urbano segundo a escala

Metrópole
type: Concept
scope note: Centro urbano de grande dimensão e importância é frequentemente a capital política do país exercendo forte influência – económica, social e administrativa – sobre as cidades menores. Dependendo do volume das suas atividades financeiras e comerciais, as metrópoles podem adquirir importância mundial como é o caso de Londres e Tóquio. Fenómeno que conheceu o seu crescimento e expansão na década de 50 do século XX, antes desta data existiam apenas sete cidades com mais de 5 milhões de habitantes. O conceito de metrópole é aplicado quando uma cidade, numa dada região ou país, exerce domínio sobre todas as outras, tornando-se num centro económico, político e administrativo de grande importância. Este domínio pode ser devido a vários fatores, sendo o mais comum a evolução natural devida à centralização de funções, muito frequente nas economias subdesenvolvidas. Exemplos disso são os casos de Calcutá e Bombaim na Índia, Jacarta na Indonésia e Buenos Aires na Argentina; todas estas cidades juntam em si mais de 1/3 da população total do país e todos os elementos ligados ao poder político e económico. Este fenómeno não é exclusivo das economias subdesenvolvidas, tendo também representação nos países desenvolvidos, tal é o caso de Londres na Grã-Bretanha, de Paris em França e de Budapeste na Hungria. Neste último caso, a hierarquia estabelecida pela existência de uma metrópole que se sobrepõe a todas as outras cidades tem vindo a ser diluída pela existência de metrópoles secundárias ou mesmo rivais da capital.
in scheme: Tesauro SIPA
preferred label: Metropolis @en
preferred label: Métropole @fr
preferred label: Metropoli @it
broader: Aglomerado urbano segundo a escala

Povoado
type: Concept
in scheme: Tesauro SIPA
preferred label: Village @en
broader: Aglomerado urbano segundo a escala

Vila
type: Concept
scope note: Conjunto residencial compacto que varia no seu tamanho, sendo, usualmente menor e administrativamente menos importante do que a cidade. Caracteriza-se por um agrupamento de habitações, suficientemente importante para constituir um centro administrativo. Na maioria dos casos, dentro do continente europeu, era usual a vila agrupar-se em redor da igreja sede da paróquia e caracterizava-se pela presença de comerciantes e artesãos e de certos serviços públicos. Com a Revolução Industrial, muitas vilas conheceram grande desenvolvimento acabando por se tornar cidades. Esta tendência continuou para além do período da Revolução e, tendencialmente, as vilas foram sendo eliminadas como conjuntos residenciais. No caso português, a vila é frequentemente sede de uma autarquia. Segundo a legislação uma vila tem que ter mais de 3000 habitantes e possuir um posto médico, farmácia, casa assistencial (Casa do Povo, Centro Cultural...), transportes públicos, estação de correios, estabelecimentos comerciais e de hotelaria, escola e agência bancária.
in scheme: Tesauro SIPA
preferred label: Villagio @it
preferred label: Small town (Village) @en
preferred label: Petit ville @fr
broader: Aglomerado urbano segundo a escala

Aglomerado urbano segundo a forma
type: Concept
in scheme: Tesauro SIPA
preferred label: Urban agglomeration according to shape @en
preferred label: Agglomération urbaine selon la forme @fr
preferred label: Agglomerazione urbana secondo la forma @it
broader: Aglomerados Urbanos
narrower: Aglomerado urbano de formação dispersa
narrower: Aglomerado urbano de formação espontânea
narrower: Aglomerado urbano de traçado linear
narrower: Aglomerado urbano de traçado orgânico
narrower: Aglomerado urbano de traçado regular

Aglomerado urbano de formação dispersa
type: Concept
scope note: Aglomerado urbano cujo padrão de crescimento se caracteriza pela ocupação do território com baixa densidade populacional, onde as construções e atividades urbanas se espalham de forma descontínua e irregular.
in scheme: Tesauro SIPA
preferred label: Urban agglomeration with dispersed pattern @en
broader: Aglomerado urbano segundo a forma

Aglomerado urbano de formação espontânea
type: Concept
in scheme: Tesauro SIPA
preferred label: Urban agglomeration with spontaneous patternt @en
broader: Aglomerado urbano segundo a forma

Aglomerado urbano de traçado linear
type: Concept
in scheme: Tesauro SIPA
preferred label: Urban agglomeration with linear pattern @en
broader: Aglomerado urbano segundo a forma

Aglomerado urbano de traçado orgânico
type: Concept
scope note: Aglomerado urbano fundado sem um esquema de implantação prévio em que o traçado é definido pelas características físicas do terreno e os quarteirões apresentam formas irregulares de diversas dimensões.
in scheme: Tesauro SIPA
preferred label: Urban agglomeration with organic pattern @en
broader: Aglomerado urbano segundo a forma

Aglomerado urbano de traçado regular
type: Concept
scope note: Aglomerado urbano fundado segundo uma estrutura geométrica ortogonal, assente em dois eixos fundamentais, que atravessam a malha urbana e se cruzam ao centro, formando uma praça ou largo, onde se situa o centro político e administrativo ou religioso. A intenção de planear a cidade é reforçada na definição dos quarteirões regulares, concebidos segundo um padrão geométrico e compostos por um número idêntico de lotes geralmente com a mesma dimensão. O traçado urbano regular tem uma malha planeada de forma a reforçar o poder régio, dos senhores da nobreza ou das ordens religiosas. Nos reinados de D. Afonso III e D. Dinis foram fundadas várias cidades novas com características de traçado regular (Viana do Castelo, Valença, Caminha, Monsaraz, Alegrete, Vila Viçosa, etc.) no contexto de reorganização da estrutura político-administrativa e das necessidades militares
in scheme: Tesauro SIPA
preferred label: Urban agglomeration with regular pattern @en
broader: Aglomerado urbano segundo a forma
narrower: Aglomerado urbano de traçado ortogonal
narrower: Aglomerado urbano de traçado radioconcêntrico

Aglomerado urbano de traçado ortogonal
type: Concept
in scheme: Tesauro SIPA
preferred label: Urban agglomeration with orthogonal pattern @en
broader: Aglomerado urbano de traçado regular

Aglomerado urbano de traçado radioconcêntrico
type: Concept
in scheme: Tesauro SIPA
preferred label: Urban agglomeration with radio-centric pattern @en
broader: Aglomerado urbano de traçado regular

Aglomerado urbano segundo a função
type: Concept
in scheme: Tesauro SIPA
preferred label: Urban agglomeration according to function @en
preferred label: Agglomération urbaine selon les fonctions @fr
preferred label: Agglomerato urbano in base alla funzione @it
broader: Aglomerados Urbanos
narrower: Aglomerado urbano administrativo

Aglomerado urbano administrativo
type: Concept
in scheme: Tesauro SIPA
preferred label: Admnistrative urban agglomeration @en
preferred label: Agglomération urbaine administrative @fr
preferred label: Agglomerato urbano amministrativo @it
broader: Aglomerado urbano segundo a função
narrower: Capital (Aglomerado urbano administrativo)
narrower: Cidade colonial
narrower: Civitas
narrower: Polis

Capital (Aglomerado urbano administrativo)
type: Concept
scope note: Cidade que se torna o centro político e económico de um país, sendo, normalmente, a mais populosa. Nalguns casos, podem existir simultaneamente mais do que uma capital. Historicamente, o maior centro económico de um dado país ou estado torna-se frequentemente o ponto focal do poder político.
in scheme: Tesauro SIPA
preferred label: Capital city (Admnistrative urban agglomeration) @en
preferred label: Capitale (Agglomération urbaine administrative) @fr
preferred label: Capoluogo (Agglomerato urbano amministrativo) @it
broader: Aglomerado urbano administrativo

Cidade colonial
type: Concept
scope note: Cidade construída em território onde anteriormente não existia qualquer aglomerado urbano, é geralmente cidade concebida segundo um plano.
in scheme: Tesauro SIPA
preferred label: Colonial city @en
broader: Aglomerado urbano administrativo

Civitas
type: Concept
scope note: Principal povoação em qualquer área administrativa do império romano. Tinha uma unidade territorial política e administrativa que tomava o nome de um povo.
in scheme: Tesauro SIPA
broader: Aglomerado urbano administrativo

Polis
type: Concept
scope note: Modelo das antigas cidades gregas, possuía configuração espacial própria, encontrava-se justaposta ou circundava a acrópole e tinha um espaço central público – a ágora. Terá surgido no século VIII a.C. nas comunidades gregas da Ásia Menor e o primeiro fator para a sua criação foi a topografia. Esta determinou a organização territorial grega sobre a base de cidades-estado claramente definidas e separadas. A Grécia propriamente dita e a costa jónica da Ásia Menor são montanhosas, com limitadas regiões férteis em forma de vales. Tais condições favoreceram a existência de estados pequenos e independentes, cada um dos quais se compunha, regra geral, de um núcleo urbano rodeado por campos e aldeias habitadas por comunidades agrícolas a eles subordinadas.
in scheme: Tesauro SIPA
broader: Aglomerado urbano administrativo

Aglomerado urbano militar
type: Concept
scope note: Aglomerado urbano que se desenvolve a partir de um núcleo criado com fins de defesa de um território
in scheme: Tesauro SIPA
preferred label: Military urban agglomeration @en
broader: Aglomerado urbano segundo a escala
narrower: Castro
narrower: Citânia
narrower: Hisn
narrower: Oppidum
narrower: Praça de guerra

Castro
type: Concept
scope note: Povoação pré-romana, fortificada no cume de uma colina, sem vestígios de habitação permanente. É o mais antigo vestígio de organização de carácter urbano, característico desde o final da pré-história até à idade do ferro. Em Portugal, os castros surgem no neolítico a Norte do rio Vouga e em algumas regiões da Beira Baixa, esbatendo-se a sua existência a Sul. Os castros eram dispositivos de defesa construídos num cume artificialmente aplanado circundado por uma ou mais linhas de muralha de forma concêntrica. O castro distingue-se de citânia pela dimensão do aglomerado urbano e no carácter de habitação temporária, muitos evoluíram e deram origem ao castelo. Conforme a região onde estão inseridos os castros podem ser conhecidos por Crasto, Crastelo, Cristelo, Castelo, Castêlo, Crastim, Castelinho, Cidadela, Cerca, Coroa, Casarelho ou Muradel.
in scheme: Tesauro SIPA
preferred label: Castrum @fr
preferred label: Hillfort @en
broader: Aglomerado urbano militar

Citânia
type: Concept
scope note: Povoado fortificado pré-romano com habitações permanentes. Encontra-se com mais frequência nos cumes da Galiza e no Norte de Portugal. O termo, é usualmente associado à civilização celta europeia, é uma povoação com um aglomerado populacional considerável e habitações permanentes robustas. Geralmente as citânias têm uma ou mais linhas de muralhas e entre elas são colocadas inúmeras pedras afiadas para dificultar as investidas dos inimigos. Em algumas regiões citânia adquire o nome de cividade.
in scheme: Tesauro SIPA
preferred label: Citania @en
broader: Aglomerado urbano militar

Hisn
type: Concept
scope note: Aglomerado urbano islâmico, dotado de um castelo.
in scheme: Tesauro SIPA
broader: Aglomerado urbano militar

Oppidum
type: Concept
scope note: Aglomerado urbano fortificado do império romano, semelhante a uma Citânia.
in scheme: Tesauro SIPA
broader: Aglomerado urbano militar

Praça de guerra
type: Concept
in scheme: Tesauro SIPA
preferred label: War square (Place of war) @en
preferred label: Place de guerre @fr
preferred label: Piazza della guerra @it
broader: Aglomerado urbano militar

Aglomerado urbano segundo a base económica
type: Concept
in scheme: Tesauro SIPA
preferred label: Urban agglomeration by economic base @en
preferred label: Colonie urbaine en fonction de la base économique @fr
preferred label: Agglomerato urbano in base alla base economica @it
broader: Aglomerados Urbanos
narrower: Arraial
narrower: Cidade industrial
narrower: Cidade mineira
narrower: Feitoria
narrower: Vila franca
narrower: Vila piscatória

Arraial
type: Concept
scope note: Lugar pouco povoado, de ocupação sazonal, relacionado com atividades económicas como a mineração, a indústria ou a pesca. Podem também nascer a partir de uma capela em torno da qual as pessoas se reuniam para rezar e realizar festas em louvor aos santos e padroeiros.
in scheme: Tesauro SIPA
preferred label: Camp @en
broader: Aglomerado urbano segundo a base económica

Cidade industrial
type: Concept
scope note: Conceito que deriva das alterações introduzidas pela Revolução Industrial que veio a afetar todo o desenvolvimento urbano das cidades tradicionais. Cidades estabelecidas em locais próximos de fábricas ou zonas de extração de matérias-primas, minas etc. Existiram muitas cidades que, embora não tivessem sido originadas pela Revolução Industrial cresceram num sentido industrial. A Revolução Industrial veio a afetar o desenvolvimento urbano em larga escala. Terão sido poucas as cidades que, com mais de 100.000 habitantes, e nos países com desenvolvimento urbano em larga escala que não tenham sido atingidos por esse conjunto de circunstâncias. As fábricas tornaram-se donas e senhoras do solo urbano e suburbano, colocando-se no ponto mais conveniente e mais fácil de encontrar e construindo os chamados bairros operários virtude da necessidade de albergar a mão-de-obra.
in scheme: Tesauro SIPA
preferred label: Industrial city @en
preferred label: Ville industrielle @fr
preferred label: Città industriale @it
broader: Aglomerado urbano segundo a base económica

Cidade mineira
type: Concept
scope note: Aglomerado urbano que se desenvolveu a partir da atividade de mineração.
in scheme: Tesauro SIPA
preferred label: Mining city @en
preferred label: Ville minière @fr
preferred label: Città mineraria @it
broader: Aglomerado urbano segundo a base económica

Feitoria
type: Concept
scope note: Aglomerado urbano que se desenvolve a partir de um entreposto comercial, vulgarmente fortificado, usado para o comércio com povos estrangeiros, especialmente durante os Descobrimentos portugueses.
in scheme: Tesauro SIPA
preferred label: Fattoria @it
preferred label: Factory (Trading post) @en
preferred label: Factorerie @fr
broader: Aglomerado urbano segundo a base económica

Vila franca
type: Concept
scope note: Aglomerado urbano que possuía certas isenções fiscais ou privilégios concedidos através de um foral.
in scheme: Tesauro SIPA
preferred label: Vila franca (Trade tax free mediaeval village) @en
broader: Aglomerado urbano segundo a base económica

Vila piscatória
type: Concept
scope note: Aglomerado humano, geralmente pequeno, cuja economia e modo de vida são fortemente dependentes da pesca e atividades relacionadas com o mar.
in scheme: Tesauro SIPA
preferred label: Fishing village @en
preferred label: Village de pêche @fr
preferred label: Villaggio della pesca @it
broader: Aglomerado urbano segundo a base económica

Aglomerado urbano segundo a condição
type: Concept
in scheme: Tesauro SIPA
preferred label: Urban agglomeration according to condition @en
preferred label: Agglomération urbaine en fonction des conditions @fr
preferred label: Agglomerato urbano in base alla condizione @it
broader: Aglomerados Urbanos
narrower: Cidade em ruínas
narrower: Cidade perdida

Cidade em ruínas
type: Concept
in scheme: Tesauro SIPA
preferred label: City in ruins @en
preferred label: Ville en ruine @fr
preferred label: Città in rovina @it
broader: Aglomerado urbano segundo a condição

Cidade perdida
type: Concept
scope note: Aglomerado urbano que entrou em declínio e se tornou desabitado.
in scheme: Tesauro SIPA
preferred label: Lost city @en
preferred label: Cité perdue @fr
preferred label: Città perduta @it
broader: Aglomerado urbano segundo a condição

Aglomerado urbano segundo a localização
type: Concept
in scheme: Tesauro SIPA
preferred label: Urban agglomeration according to location @en
preferred label: Agglomération urbaine en fonction de la localisation @fr
preferred label: Agglomerazione urbana in base alla posizione @it
broader: Aglomerados Urbanos
narrower: Cidade satélite

Cidade satélite
type: Concept
scope note: Aglomerado urbano localizado próximo de uma metrópole, com a qual geralmente mantém fortes laços de dependência, seja em termos de serviços, emprego ou infraestrutura.
in scheme: Tesauro SIPA
preferred label: Satellite city @en
preferred label: Ville satellite @fr
preferred label: Città satellite @it
broader: Aglomerado urbano segundo a localização

Aglomerado urbano segundo o conceito de ordenamento territorial
type: Concept
in scheme: Tesauro SIPA
preferred label: Urban agglomeration according to the spatial planning concept @en
preferred label: Agglomération urbaine selon le concept d'aménagement du territoire @fr
preferred label: Agglomerato urbano secondo il concetto di pianificazione del territorio @it
broader: Aglomerados Urbanos
narrower: Bastide
narrower: Cidade nova
narrower: Vila nova

Bastide
type: Concept
scope note: Aglomerado urbano planeado como uma fortificação.
in scheme: Tesauro SIPA
preferred label: Bastide (Palisade) @en
broader: Aglomerado urbano segundo o conceito de ordenamento territorial

Cidade nova
type: Concept
scope note: Aglomerado urbano que se desenvolve a partir de um plano de expansão urbana.
in scheme: Tesauro SIPA
preferred label: New city @en
broader: Aglomerado urbano segundo o conceito de ordenamento territorial

Vila nova
type: Concept
in scheme: Tesauro SIPA
preferred label: New village @en
broader: Aglomerado urbano segundo o conceito de ordenamento territorial

Aglomerado urbano segundo o conceito de planeamento
type: Concept
in scheme: Tesauro SIPA
preferred label: Urban agglomeration according to the planning concept @en
preferred label: Agglomération urbaine selon le concept de la planification @fr
preferred label: Agglomerazione urbana secondo il concetto di pianificazione @it
broader: Aglomerados Urbanos
narrower: Cidade ideal
narrower: Cidade jardim

Cidade ideal
type: Concept
scope note: Cidade que tem como objetivo o Belo e a Perfeição. Movimenta-se mais no contexto da criação artística do que no urbanismo funcional. O modelo de cidade ideal surge no Renascimento e desde Scamozzi, Alberti, até Leonardo, todos os arquitetos do Renascimento foram seduzidos pela ideia.
in scheme: Tesauro SIPA
preferred label: Optimal city @en
preferred label: Ville idéale @fr
preferred label: Città ideale @it
broader: Aglomerado urbano segundo o conceito de planeamento

Cidade jardim
type: Concept
scope note: Conjunto ou sector urbano de dimensão limitada, delineado dentro de uma conceção culturalista (Choay) que assenta em pressupostos ruralizantes de relação com a paisagem e enquadramento físico, estabelecido em oposição, ou como contraproposta, aos novos dilemas civilizacionais abertos pelo processo de industrialização na cidade, ocorrido desde o final do século XVIII. O movimento da cidade-jardim teve origem em Inglaterra, no contexto do ideário do socialismo utópico, estando associado à obra Tomorrow. A peaceful path to real reform, de Ebenezer Howard, datada de 1898. Trata-se de um modelo espacial que se envolve estreitamente com um modelo sociopolítico. A célula idealizada por Howard consistia na criação de um núcleo urbano concêntrico, envolvido pelo caminho-de-ferro e por uma cintura verde que garantia a subsistência da cidade-jardim e evitava os fenómenos de "co-urbanização". Contemplava a coexistência de grupos social e economicamente diferenciados e de atividades de produção igualmente distintas, industrial e agrícola, de forma a criar condições para o estabelecimento de uma sociedade auto-suficiente e equilibrada. A evolução deste movimento deu-se a par e em articulação com o movimento arts and crafts, assentando em pressupostos sociopolíticos comuns e na consideração ideológica da relação com uma sociedade e conceção pré-industrial.
in scheme: Tesauro SIPA
preferred label: Garden city @en
preferred label: Ville jardin @fr
preferred label: Città giardino @it
broader: Aglomerado urbano segundo o conceito de planeamento

Componentes de aglomerados urbanos
type: Concept
scope note: Elementos ou conjunto de elementos que compõem os aglomerados urbanos.
in scheme: Tesauro SIPA
preferred label: Combinations of urban agglomerations @en
preferred label: Composantes des agglomérations urbaines @fr
preferred label: Componenti degli agglomerati urbani @it
broader: Aglomerados Urbanos
narrower: Espaço urbano

Espaço urbano
type: Concept
scope note: Área de um território, cidade ou vila formada por espaços públicos, semipúblicos e privados, categorias que o constitui e o organiza. A ocupação do espaço urbano está diretamente ligada às políticas de solos. A sua edificação deve obedecer às diferentes diretivas municipais e locais, que garantem o crescimento das vilas, cidades ou territórios de forma equilibrada e homogénea. O espaço urbano pode ser edificado ou não edificado determinando se este se encontra ocupado em parte ou na totalidade por construções. A qualificação do solo urbano define o perímetro do espaço urbano, que compreende: solos urbanizados, solos cuja urbanização seja possível programar e solos afetos à estrutura ecológica, necessários ao equilíbrio do sistema urbano.
in scheme: Tesauro SIPA
preferred label: Urban space; Urban land área @en
preferred label: Espace urbain @fr
preferred label: Spazio urbano @it
broader: Componentes de aglomerados urbanos
narrower: Espaço urbano edificado
narrower: Espaço urbano não edificado

Espaço urbano edificado
type: Concept
scope note: Conjunto de imóveis que constituem a área construída de um território, cidade, vila ou aldeia, cujas suas ocupações estão diretamente ligadas às principais funções da vida urbana. No contexto das cidades, os edifícios constituem, através das fachadas expostas, os limites definidores do espaço urbano. A organização e disposição do edificado no tecido urbano, articulado com a morfologia do local, conferem uma identidade própria a cada espaço. O edificado é parte indissociável do espaço urbano, este exerce função de ordenador da circulação e dos seus espaços públicos, que associado às funções económicas, políticas e culturais da cidade geram um espaço arquitetónico multidimensional.
in scheme: Tesauro SIPA
preferred label: Urban built-up space @en
preferred label: Espace urbain bâti @fr
preferred label: Spazio urbano edificato @it
broader: Espaço urbano
narrower: Edifício
narrower: Equipamento urbano
narrower: Estruturas construídas
narrower: Lote
narrower: Quarteirão
narrower: Espaço urbano edificado segundo a importância
narrower: Espaço urbano edificado segundo a localização
narrower: Espaço urbano edificado segundo a relação com o contexto

Edifício
type: Concept
scope note: Construção permanente, dotada de acesso independente, coberta, limitada por paredes exteriores ou paredes meeiras que vão das fundações à cobertura, destinada a utilização humana ou a outros fins.
in scheme: Tesauro SIPA
preferred label: Building @en
preferred label: Bâtiment (Édifice) @fr
preferred label: Edificio @it
broader: Espaço urbano edificado
related: c 65005b47
modified: 2025-09-23T13:06:29

Equipamento urbano
type: Concept
scope note: Conjunto de redes, estruturas e edificações colocadas à disposição da coletividade visando satisfazer suas necessidades de toda ordem. O equipamento urbano engloba infraestruturas de vias e estacionamentos, transportes e comunicações, água e canalizações, energia, bem como, os edifícios de uso coletivo, sendo estes, equipamentos administrativos, de educação, sanitários, comerciais, culturais, desportivos, turísticos. As necessidades de ordem coletiva (estradas, hospitais, escolas) são da responsabilidade das administrações públicas e dependem delas financeiramente, assim entende-se a associação entre equipamento urbano e bem coletivo ou bem público. A melhoria do nível de vida das populações está diretamente relacionada com o uso crescente dos serviços coletivos.
in scheme: Tesauro SIPA
preferred label: Urban equipment @en
preferred label: Équipements urbains @fr
preferred label: Servizi urbani @it
broader: Espaço urbano edificado

Estruturas construídas
type: Concept
in scheme: Tesauro SIPA
preferred label: Built structures @en
preferred label: Structures bâties @fr
preferred label: Strutture costruite @it
broader: Espaço urbano edificado
related: c 65005b47
modified: 2025-09-23T13:07:23

Lote
type: Concept
scope note: Parte de um terreno urbano que se divide e resulta numa pequena porção de terra destinada à construção. No domínio do urbanismo, a palavra lote tem um significado próximo de parcela, sendo o seu uso mais corrente na língua portuguesa do que esta, sobretudo em meio urbano. Esta conotação essencialmente urbana do termo reforça-se e esclarece-se através de um seu derivado, “loteamento”, que designa a operação pela qual um terreno rústico se torna urbano - é urbanizado – através da sua subdivisão em lotes para construção. O termo tem origem francesa, estando o seu uso documentado desde 1190 com o significado corrente de porção. No domínio da história e da morfologia urbanas, lote surge frequentemente associado a qualitativos como “gótico”, “esguio”, designando configurações específicas que as parcelas urbanas assumem em determinados contextos históricos. Na idade média era comum utilizar a palavra chãos para designar um lote retangular com uma medida de 60 palmos por 30 de largura, aproximadamente 13,5m por 6,75m.
in scheme: Tesauro SIPA
preferred label: Lot (Parcel) @en
preferred label: Lot @fr
preferred label: Lotto @it
alternative label: Parcela
broader: Espaço urbano edificado
narrower: Lote estreito
narrower: Lote largo
narrower: Lote quadrangular

Lote estreito
type: Concept
scope note: Parcela de quarteirão, de forma retangular, em que o lado do comprimento tem cerca de 4 vezes da largura, também designado por meio chão. O lote estreito surge nos séculos XVI e XVII em cidades fortemente povoadas e em zonas onde a população teria menos disponibilidade financeira. Os lotes estreitos que corresponderiam a mais ou menos de metade de um chão. O meio chão é um lote retangular com uma medida de 60 palmos de comprimento por 15 de largura, ou seja, aproximadamente 13,5m por 3,37m. No lote estreito é erguido um edifício de estrutura simplificada onde a fachada principal se situa num dos lados de menor dimensão que confina diretamente com a via pública.
in scheme: Tesauro SIPA
preferred label: Narrow lot @en
broader: Lote

Lote largo
type: Concept
scope note: Parcela de quarteirão, de forma retangular, onde um dos lados de maior dimensão confina com a via pública. Os lotes largos surgem com mais frequência em aglomerados urbanos menos povoados.
in scheme: Tesauro SIPA
preferred label: Wide lot @en
broader: Lote

Lote quadrangular
type: Concept
scope note: Parcela de quarteirão em que a medida do lado do comprimento se aproxima à medida da largura, numa relação de aproximadamente 1 para 1,5
in scheme: Tesauro SIPA
preferred label: Square lot @en
broader: Lote

Quarteirão
type: Concept
scope note: Designa o sector urbano composto pela justaposição de parcelas, construídas ou não, formando um conjunto delimitado de modo continuo, geralmente em quatro faces, por vias ou espaço público. Nos traçados urbanos resultantes de um desenho pré-definido, o quarteirão apresenta uma forma regular, retangular ou quadrada, assumindo-se claramente como uma unidade da composição urbana. Constituindo uma unidade da estrutura morfológica facilmente identificável, pode mostrar maior ou menor densidade do espaço construído, consoante os tipos edificados e a presença de logradouros. Frequentemente não apresenta características homogéneas, podendo até ser delimitado apenas por duas ou três vias.
in scheme: Tesauro SIPA
preferred label: Block @en
preferred label: Quartier @fr
preferred label: Quartiere @it
broader: Espaço urbano edificado
narrower: Quarteirão irregular
narrower: Quarteirão regular

Quarteirão irregular
type: Concept
scope note: Sector urbano composto pela justaposição de parcelas, construídas ou não, que forma um conjunto delimitado de modo contínuo, resultante de um traçado urbano orgânico sem desenho pré-definido. Os quarteirões irregulares com origem nos traçados orgânicos podem ser resultantes da adaptação da malha urbana à topografia do terreno ou ainda resultantes de eixos de antigos caminhos rurais.
in scheme: Tesauro SIPA
preferred label: Irregular block @en
broader: Quarteirão

Quarteirão regular
type: Concept
scope note: Sector urbano composto pela justaposição de parcelas, construídas ou não, que formam um conjunto delimitado de modo contínuo, resultante de um traçado ortogonal com desenho pré-definido. Os quarteirões regulares surgem na época clássica com os traçados urbanos regulares gregos e romanos. Destaca-se o arquiteto e urbanista Hipodamus de Mileto, considerado por muitos o “pai” do urbanismo, que utilizou a reticula no seu plano de reconstrução de Mileto, em 479 AC. Atribui-se a Hipodamus ainda a conceção de um plano urbano perfeitamente ortogonal, no qual as ruas se cruzam a ângulos retos e definem quarteirões regulares de tamanho igual, este plano é dito “hipodâmico”. No traçado ortogonal os quarteirões são a unidade base da malha urbana e surgem com formas retangulares ou quadrangulares
in scheme: Tesauro SIPA
preferred label: Regular block @en
broader: Quarteirão

Espaço urbano edificado segundo a importância
type: Concept
in scheme: Tesauro SIPA
preferred label: Urban built-up space according to importance @en
preferred label: Espace urbain bâti par importance @fr
preferred label: Spazio urbano edificato per importanza @it
broader: Espaço urbano edificado
narrower: Espaço urbano edificado de referência
narrower: Espaço urbano edificado de acompanhamento

Espaço urbano edificado de referência
type: Concept
scope note: Área que possui um conjunto de imóveis cuja identidade se destaca pela autenticidade das construções, no sentido arquitetónico, histórico e cultural do lugar, e que através da qual se exprime a continuidade entre o passado, o presente e o futuro de uma sociedade.
in scheme: Tesauro SIPA
preferred label: Reference built-up urban space @en
broader: Espaço urbano edificado segundo a importância

Espaço urbano edificado de acompanhamento
type: Concept
scope note: Conjunto de imóveis sem valor intrínseco específico que constituem a área envolvente de um monumento com valor patrimonial e que contribuem para a caracterização do ambiente envolvente. A reflexão sobre os imóveis de acompanhamento surge na primeira conferência internacional de conservação dos monumentos em Atenas, em 1931, em que é abordado o tema da envolvente aos monumentos e da sua proteção, bem como, a estética indissociável da sua integração no meio urbano. Este conceito é reforçado na década de 70, na Conferência Geral da UNESCO, com a Carta de Nairobi, que trouxe novas recomendações relativas à salvaguarda de conjuntos históricos onde os edifícios de acompanhamento são considerados muito importantes na preservação e salvaguarda dos centros urbanos na vida contemporânea
in scheme: Tesauro SIPA
preferred label: Monitoring built urban space @en
broader: Espaço urbano edificado segundo a importância

Espaço urbano edificado segundo a localização
type: Concept
in scheme: Tesauro SIPA
preferred label: Urban space built according to location @en
preferred label: L'espace urbain bâti en fonction de la localisation @fr
preferred label: Spazio edificato urbano in base alla posizione @it
broader: Espaço urbano edificado
narrower: Gaveto (Espaço urbano edificado segundo a localização)

Gaveto (Espaço urbano edificado segundo a localização)
type: Concept
scope note: É a esquina ou ângulo de uma construção. O termo é também utilizado para evocar a esquina de um quarteirão, bem como, o edifício situado no encontro de duas vias.
in scheme: Tesauro SIPA
preferred label: Corner (Urban space built according to location) @en
preferred label: Angle (Coin) (L'espace urbain bâti en fonction de la localisation) @fr
preferred label: Angolo (Spazio edificato urbano in base alla posizione) @it
alternative label: Esquina
broader: Espaço urbano edificado segundo a localização

Espaço urbano edificado segundo a relação com o contexto
type: Concept
in scheme: Tesauro SIPA
preferred label: Urban built space according to its relation to the contexto @en
broader: Espaço urbano edificado
narrower: Espaço urbano edificado adulterado
narrower: Espaço urbano edificado qualificador

Espaço urbano edificado adulterado
type: Concept
scope note: Conjunto de imóveis de valor patrimonial, que sofreram alterações morfológicas comprometendo o espaço urbano onde estão inseridos e que incorrem na transformação do sentido arquitetónico, histórico ou cultural do lugar. Os imóveis cujo valor arquitetónico foi alterado e que sofreram intervenções ao nível da sua estrutura são considerados como adulterações totais. Assim, prevê-se que todas as alterações volumétricas com adição ou supressão de corpos edificados; as alterações da forma e revestimento das coberturas; ou ainda em caso extremo, a remoção ou deslocação da estrutura do seu local primitivo, são adulterações totais. No caso dos imóveis alterados de forma menos gravosa, ou seja, aquele em que o retrocesso da sua intervenção está menos condicionado, são considerados adulterações parciais. Nesses casos estão incluídos a alteração das caixilharias; a alteração dos espaços exteriores privativos do fogo; a alteração dos revestimentos primitivos em paredes ou pavimentos; a aposição de elementos estranhos ao objeto; a alteração de uso ou ocupação imprópria e comprometedora da manutenção do objeto; bem como, as alterações significativas da compartimentação interior
in scheme: Tesauro SIPA
preferred label: Adulterated urban built space @en
alternative label: Espaço urbano edificado dissonante
broader: Espaço urbano edificado segundo a relação com o contexto

Espaço urbano edificado qualificador
type: Concept
scope note: Conjuntos de imóveis de valor patrimonial que sofreram intervenções, que não comprometem a morfologia do espaço urbano onde estão inseridos, continuando a respeitar o sentido arquitetónico, histórico ou cultural do lugar. Considera-se que as alterações introduzidas num edifício, no âmbito de um processo de reestruturação funcional, podem não implicar o desenvolvimento de um fenómeno de adulteração. Assim ao preservar a estrutura original e a morfologia do objeto este não perde a sua identidade
in scheme: Tesauro SIPA
preferred label: Qualifier urban built space @en
broader: Espaço urbano edificado segundo a relação com o contexto

Espaço urbano não edificado
type: Concept
scope note: Parte do território enquadrado num determinado aglomerado urbano e que não se encontra construído, mas para o qual lhe é conferido a possibilidade de urbanização e de edificação. O espaço urbano não edificado é um terreno ao qual é reconhecida vocação para o processo de urbanização e de edificação, a que se dá o nome de solo urbano
in scheme: Tesauro SIPA
preferred label: Urban unbuilt space @en
preferred label: Espace urbain non bâti @fr
preferred label: Spazio urbano non edificato @it
broader: Espaço urbano
narrower: Espaço urbano não edificado segundo a propriedade

Espaço urbano não edificado segundo a propriedade
type: Concept
in scheme: Tesauro SIPA
preferred label: Undeveloped urban space according to ownership @en
preferred label: Espace urbain non bâti selon la propriété @fr
preferred label: Spazio urbano non edificato secondo la proprietà @it
broader: Espaço urbano não edificado
narrower: Espaço privado não edificado
narrower: Espaço público não edificado
narrower: Espaço semipúblico não edificado

Espaço privado não edificado
type: Concept
in scheme: Tesauro SIPA
preferred label: Unbuilt private space @en
preferred label: Espace privé non bâti @fr
preferred label: Spazio privato non edificato @it
broader: Espaço urbano não edificado segundo a propriedade

Espaço público não edificado
type: Concept
scope note: Espaço não construído, de uso comunitário, que inclui áreas verdes, áreas de circulação, áreas de lazer e desporto. O espaço público surge desde a época clássica, não só como um lugar de troca comercial, mas como um espaço de socialização e de prática política. A partir da Idade Média o espaço público é o elo de ligação entre os bairros e zonas da cidade, diferenciadas por grupos étnicos ou religiosos. No século XIX o espaço público passa a ter uma nova função de lazer e é nesta época que surgem os parques urbanos em Paris, estes são espaços arborizados especialmente concebidos para o encontro das classes sociais. O sentido do espaço público tem vindo a ser modificado ao longo dos tempos, ganhando novas funções para além da função social e de convívio entre os diferentes grupos da população. A cidade contemporânea surge com uma nova tendência de introversão dos espaços do habitar e do trabalho gerando um padrão onde as ruas têm quase exclusivamente a função de circulação e onde a vida social se tende a circunscrever a espaços delimitados e muitas vezes de acesso restrito.
in scheme: Tesauro SIPA
preferred label: Unbuilt public space @en
preferred label: Espace public non bâti @fr
preferred label: Spazio pubblico non edificato @it
broader: Espaço urbano não edificado segundo a propriedade
narrower: Espaço público não edificado segundo a função
narrower: Espaço público não edificado segundo a importância

Espaço público não edificado segundo a função
type: Concept
in scheme: Tesauro SIPA
preferred label: Unbuilt public space according to function @en
preferred label: Espace public non bâti selon la fonction @fr
preferred label: Spazio pubblico non edificato secondo la funzione @it
broader: Espaço público não edificado
narrower: Espaço público não edificado de desporto
narrower: Espaço público não edificado de lazer
narrower: Espaço público não edificado de permanência e circulação
narrower: Terreno expectante

Espaço público não edificado de desporto
type: Concept
in scheme: Tesauro SIPA
preferred label: Unbuilt public space for sports @en
preferred label: Espace public non bâti pour le sport @fr
preferred label: Spazio pubblico non edificato per lo sport @it
broader: Espaço público não edificado segundo a função

Espaço público não edificado de lazer
type: Concept
in scheme: Tesauro SIPA
preferred label: Unbuilt public space for leisure @en
preferred label: Espace public de loisirs non construit @fr
preferred label: Spazio pubblico per il tempo libero non costruito @it
broader: Espaço público não edificado segundo a função
narrower: Zona verde

Zona verde
type: Concept
scope note: Espaço exterior com predomínio de vegetação, cuja função é a preservação da natureza e a aclimatação do ambiente urbano, contribuindo assim para o bem-estar da população local. No século XIX, as áreas verdes serviram como lugares públicos de encontro e de passeio da aristocracia. Projetadas com o objetivo de reproduzirem a presença da natureza no meio urbano, o conceito de espaço verde, tal como hoje se conhece, foi criado por J.C.N. Forestier, em 1925, um conservador de parques e jardins de Paris. Na era industrial, a ideia de “Pulmão verde” afirmou-se como um espaço verde com dimensão suficiente para produzir o oxigénio necessário à compensação das atmosferas poluídas. Em consequência da evolução das cidades, os espaços verdes urbanos, públicos ou privados, assumiram uma crescente importância nas políticas regionais e municipais. Com efeito, procurou-se uma lógica de tecido urbano contínuo com ligação ao espaço rural envolvente desenvolvendo áreas verdes que contribuam para a melhoria da qualidade do ambiente urbano. Aumentou-se as áreas verdes das cidades, como parques, jardins, praças, alamedas e alguns cemitérios, através da sua recuperação e ligação incrementando corredores verdes, com a integração vias e peões. A necessidade de mais espaços verdes, nas cidades desenvolvidas, está essencialmente ligada à absorção da água da chuva ao nível do solo, e à consequente redução do volume de água das cheias e dos danos causados pelas inundações. A presença de espaços verdes na cidade possibilita ainda, limitar a poluição das águas de superfície, as quais contêm chumbo e resíduos de várias origens, que escoam através dos espaços não pavimentados. A vegetação tem ainda uma importante função na proteção dos solos contra a erosão da água e do vento.
in scheme: Tesauro SIPA
preferred label: Green area @en
preferred label: Zone verte (Espace vert) @fr
preferred label: Area verde (Zona) @it
broader: Espaço público não edificado de lazer

Espaço público não edificado de permanência e circulação
type: Concept
scope note: Espaços exteriores lineares e não lineares de uso comunitário. Os espaços públicos não edificados de permanência são: os largos, as praças, parques, etc., estes são espaços não lineares, distinguem-se uns dos outros através da existência ou não de mobiliário urbano adequado e do tipo de pavimento, que marca as intenções de uso. Os espaços públicos lineares são espaços essencialmente de circulação onde as vias (ruas, becos, avenidas, etc.) são classificadas conforme seu perfil transversal a três dimensões, que indica qual o tipo de circulação que permite e define o seu espaço canal.
in scheme: Tesauro SIPA
preferred label: Unbuilt public space for permanence and circulation @en
preferred label: Espace public non bâti pour la permanence et la circulation @fr
preferred label: Spazio pubblico non edificato per la permanenza e la circolazione @it
broader: Espaço público não edificado segundo a função
narrower: Espaço público não edificado de permanência e circulação segundo a forma
narrower: Espaço público não edificado de permanência e circulação segundo a função

Espaço público não edificado de permanência e circulação segundo a forma
type: Concept
in scheme: Tesauro SIPA
preferred label: Unbuilt public space for permanence and circulation according to shape @en
preferred label: Espace public non bâti pour la permanence et la circulation selon la forme @fr
preferred label: Spazio pubblico non edificato per la permanenza e la circolazione secondo la forma @it
broader: Espaço público não edificado de permanência e circulação
narrower: Espaço canal (Espaço público não edificado de permanência e circulação)
narrower: Largo

Espaço canal (Espaço público não edificado de permanência e circulação)
type: Concept
in scheme: Tesauro SIPA
preferred label: Channel space (Unbuilt public space for permanence and circulation) @en
broader: Espaço público não edificado de permanência e circulação segundo a forma
narrower: Espaço canal segundo a escala
narrower: Espaço canal segundo a localização
narrower: Espaço canal segundo a morfologia
narrower: Espaço canal segundo a técnica construtiva
narrower: Espaço canal segundo o contexto histórico

Espaço canal segundo a escala
type: Concept
in scheme: Tesauro SIPA
preferred label: Channel space according to scale @en
broader: Espaço canal (Espaço público não edificado de permanência e circulação)
narrower: Alameda (Espaço canal segundo a escala)
narrower: Avenida
narrower: Beco
narrower: Rua
narrower: Ruela
narrower: Travessa (Espaço canal)
narrower: Viela

Alameda (Espaço canal segundo a escala)
type: Concept
scope note: Via ladeada por árvores e/ou arbustos em fila. No final do século XVII, o arquiteto paisagista do Rei Luís XIV de França, André Le Nôtre, foi o responsável pela construção do parque do Palácio de Versailles. Le Nôtre retoma o modelo de jardim à italiana, simetricamente composto em torno de um eixo central dominante. Este conceito que era aplicado a avenidas plantadas em parques e jardins paisagísticos, mais tarde passou a ser aplicado às avenidas das cidades, em França. A alameda ficou popularizada a partir do século XVII, por ser um elemento estruturante da perspetivação e profundidade do espaço.
in scheme: Tesauro SIPA
preferred label: Alley (Avenue) @en
broader: Espaço canal segundo a escala

Avenida
type: Concept
scope note: Espaço público urbano, de dimensões superiores à da rua, que confina numa praça.
in scheme: Tesauro SIPA
preferred label: Avenue @en
preferred label: Viale @it
broader: Espaço canal segundo a escala

Beco
type: Concept
scope note: Rua sem saída, de extensão muito reduzida e de serventia ainda mais localizada. No sul de Portugal também ganham o nome de ruas cegas resultado da apropriação do espaço público pelos interesses privados.
in scheme: Tesauro SIPA
preferred label: Alley @en
broader: Espaço canal segundo a escala

Rua
type: Concept
scope note: Elemento de acesso, fundamental na estruturação e formalização do tecido urbano, toponimicamente identificado e individualizado, cuja identidade formal está dependente da relação que estabelece com a arquitetura que o define. Comporta diversas funções na atividade da vida urbana, como de circulação, estadia, estacionamento, acesso a edifícios, continuidade da malha urbana, espaço canal de infraestruturas subterrâneas e espaço de referenciação e orientação.
in scheme: Tesauro SIPA
preferred label: Street @en
preferred label: Rue @fr
preferred label: Via (Strada) @it
alternative label: Arruamento
broader: Espaço canal segundo a escala

Ruela
type: Concept
scope note: Rua pequena e estreita.
in scheme: Tesauro SIPA
preferred label: Bystreet (Alleyway) @en
broader: Espaço canal segundo a escala

Travessa (Espaço canal)
type: Concept
scope note: Espaço urbano público, estreito e curto, que estabelece ligação entre duas ou mais vias de hierarquia superior.
in scheme: Tesauro SIPA
preferred label: Lane (Channel space) @en
broader: Espaço canal segundo a escala
narrower: Via

Via
type: Concept
in scheme: Tesauro SIPA
preferred label: Lane (Road) @en
alternative label: Artéria
broader: Travessa (Espaço canal)

Viela
type: Concept
scope note: Rua estreita e curta, localizada entre edifícios ou muros.
in scheme: Tesauro SIPA
preferred label: Alleyway @en
broader: Espaço canal segundo a escala

Espaço canal segundo a localização
type: Concept
in scheme: Tesauro SIPA
preferred label: Channel space according to location @en
broader: Espaço canal (Espaço público não edificado de permanência e circulação)
narrower: Marginal

Marginal
type: Concept
scope note: Via que se desenvolve ao longo da margem de um rio ou do mar.
in scheme: Tesauro SIPA
preferred label: Waterfront (Promenade) @en
broader: Espaço canal segundo a localização

Espaço canal segundo a morfologia
type: Concept
in scheme: Tesauro SIPA
preferred label: Channel space according to morphology @en
broader: Espaço canal (Espaço público não edificado de permanência e circulação)
narrower: Circular (Espaço canal)
narrower: Eixo (Espaço canal)
narrower: Escadinha

Circular (Espaço canal)
type: Concept
scope note: Via que contorna um aglomerado ou parte deste, destinada a desviar o tráfego rodoviário, total ou parcialmente, do respetivo centro. As circulares cortam habitualmente as vias radiais segundo ângulos aproximadamente retos.
in scheme: Tesauro SIPA
preferred label: Ring road (Channel space) @en
broader: Espaço canal segundo a morfologia

Eixo (Espaço canal)
type: Concept
in scheme: Tesauro SIPA
preferred label: Axis (Hub) (Channel space) @en
broader: Espaço canal segundo a morfologia

Escadinha
type: Concept
scope note: Espaço linear desenvolvido em terreno com declive acentuado, com patamares e/ou degraus reduzindo o esforço do percurso. As escadinhas são uma solução comum em cidades defensivas de traçado orgânico. A sua presença permitiu a expansão nas encostas proporcionando uma maior densificação do tecido urbano, abrindo frentes de rua em terreno pouco propício à construção. A escadinha resolve assim o problema dos percursos mais curtos entre os pontos altos e baixos do aglomerado urbano. Na evolução da cidade as escadinhas têm tomado diferentes formas, desde o traçado irregular e muito estreito presente em cidades de cariz medieval, às mais largas e regulares resultantes de um traçado urbano racionalizado. Constituem geralmente eixos complementares na estrutura viária de uma cidade e estabelecem a ligação entre duas ou mais vias de hierarquia superior.
in scheme: Tesauro SIPA
preferred label: Ladder @en
broader: Espaço canal segundo a morfologia

Espaço canal segundo a técnica construtiva
type: Concept
in scheme: Tesauro SIPA
preferred label: Channel space according to construction technique @en
broader: Espaço canal (Espaço público não edificado de permanência e circulação)
narrower: Calçada
narrower: Via alcatroada

Calçada
type: Concept
scope note: Caminho ou rua empedrada geralmente com um grande declive.
in scheme: Tesauro SIPA
preferred label: Sidewalk @en
preferred label: Trottoir (Chaussée) @fr
preferred label: Vialetto (Marciapiede) @it
broader: Espaço canal segundo a técnica construtiva

Via alcatroada
type: Concept
in scheme: Tesauro SIPA
preferred label: Tarmac road @en
broader: Espaço canal segundo a técnica construtiva

Espaço canal segundo o contexto histórico
type: Concept
in scheme: Tesauro SIPA
preferred label: Channel space according to the historical context @en
broader: Espaço canal (Espaço público não edificado de permanência e circulação)
narrower: Boulevard
narrower: Alcaçaria
narrower: Cardus
narrower: Circunvalação (Espaço canal)
narrower: Decumanus
narrower: Rua Direita

Boulevard
type: Concept
scope note: Rua larga, frequentemente arborizada, que geralmente possui várias faixas de tráfego em ambos os sentidos, com um foco em elementos paisagísticos.
in scheme: Tesauro SIPA
preferred label: Boulevard (Viale) @it
broader: Espaço canal segundo o contexto histórico

Alcaçaria
type: Concept
scope note: Área do espaço urbano ou rua, onde apenas os judeus podiam praticar atividades comerciais.
in scheme: Tesauro SIPA
preferred label: Alcaiceria (Shop street) @en
preferred label: Alcaiceria (Rue marchande) @fr
preferred label: Conceria (Alcaiceria) @it
broader: Espaço canal segundo o contexto histórico

Cardus
type: Concept
scope note: Via principal de uma cidade ou acampamento da Antiga Roma, orientada no sentido norte-sul. Os antigos campos fortificados dos exércitos romanos designados por Castra ou Castrum eram constituídos por uma fortificação retangular com quatro entradas opostas duas a duas definidas por dois eixos Norte-Sul, o Cardo, e o Este-Oeste, o Decumano perpendicular ao anterior. A via Norte-Sul mais importante era designada por Cardus Maximus, a rua onde se encontravam as lojas, mercadores e artesãos.
in scheme: Tesauro SIPA
alternative label: Cardo
broader: Espaço canal segundo o contexto histórico

Circunvalação (Espaço canal)
type: Concept
scope note: Via que contorna um aglomerado, destinada a desviar o tráfego rodoviário, total ou parcialmente, do respetivo centro.
in scheme: Tesauro SIPA
preferred label: Bypass road (Ring road) (Channel space) @en
preferred label: Contournement @fr
preferred label: Circonvallazione @it
broader: Espaço canal segundo o contexto histórico

Decumanus
type: Concept
scope note: Via principal de uma cidade ou acampamento da Antiga Roma, orientada no sentido oriente - ocidente. Os antigos campos fortificados dos exércitos romanos designados por Castra ou Castrum eram constituídos por uma fortificação retangular com quatro entradas opostas duas a duas definidas por dois eixos Este-Oeste, o Decumano e o Norte-Sul, o Cardo, perpendicular ao anterior. Na intersecção dos dois eixos situava-se geralmente o fórum e o centro da vida económica. A via mais importante orientada no mesmo sentido era designada de Cardus Maximus, e habitualmente ligava a Porta Praetoria (mais próxima do inimigo) à Porta Decumana (mais afastada do inimigo).
in scheme: Tesauro SIPA
alternative label: Decumano
broader: Espaço canal segundo o contexto histórico

Rua Direita
type: Concept
scope note: Rua principal de uma localidade, estruturando o tecido urbano, com ligação ao centro histórico ou a pontos de referência como a igreja principal ou o castelo.
in scheme: Tesauro SIPA
preferred label: Straight street @en
broader: Espaço canal segundo o contexto histórico

Largo
type: Concept
scope note: Espaço público urbano, de natureza orgânica, tem a sua génese na cidade medieval e a sua forma surge espontaneamente no tecido urbano como extensão / alargamento do espaço da rua. O largo aparece em Itália e França, como place ou piazza, entre o século XI e o século XIV, tendo-se afirmado sobretudo neste último. Em Portugal, as primeiras referências ao termo largo, com as mesmas características morfológicas e funcionais, surgem apenas no século XIV. A partir do renascimento o largo dá origem à praça, que deixa de ser o espaço orgânico ao qual convergem as principais vias, para ter uma nova forma, dimensão e protagonismo que infundiram nos séculos seguintes. Formalmente os largos diferem das praças pela sua natureza orgânica, sem enquadramento arquitetónico planeado nem programa monumental associado. O largo surge como alargamento de uma rua ou ponto de confluência de várias ruas, de forma e dimensão variáveis, que vulgarmente tem o significado funcional de praça. O largo passa a afirmar-se como o lugar central da vida urbana, associado a um ou mais edifícios importantes, civis ou religiosos, proporcionando assim enquadramento necessário à intensificação da vida pública e das trocas comerciais. Este está diretamente associado a festas, touradas, mercados e outras manifestações da vida social.
in scheme: Tesauro SIPA
preferred label: Square @en
preferred label: Place @fr
preferred label: Piazza @it
broader: Espaço público não edificado de permanência e circulação segundo a forma
narrower: Largo segundo a localização ou o contexto

Largo segundo a localização ou o contexto
type: Concept
in scheme: Tesauro SIPA
preferred label: Square according to location or context @en
preferred label: Place selon le lieu ou le contexte @fr
preferred label: Piazza secondo il luogo o il contesto @it
broader: Largo
narrower: Rossio
narrower: Praça (Largo)
narrower: Terreiro (Largo)

Rossio
type: Concept
scope note: Espaço livre, amplo e plano, de utilização pública, especificamente vocacionado para a realização de mercados periódicos. Na origem, o termo rossio referia-se a terrenos intramuros desocupados. Os rossios privados, junto das habitações, eram apenas acessíveis aos proprietários mais ricos. Nos séculos XIV e XV, o rossio, pela sua génese de espaço desocupado, passa a espaço reservado para o mercado da cidade. Os rossios surgirem da necessidade de um espaço amplo para a realização de mercados de maior dimensão que o mercado diário, de escala regional e de menor periodicidade. Este espaço era incompatível com as malhas urbanas intramuros dos finais da idade média. O rossio localizava-se extramuros, geralmente perto da porta da cidade mais importante, que conduzia à rua Direita, a rua comercial. Com frequência eram aproveitados para rossio os espaços abertos que confrontavam conventos ou igrejas existentes fora de portas. Por esta razão é comum encontrar a designação de terreiro para designar o espaço do rossio.
in scheme: Tesauro SIPA
preferred label: Public square @en
broader: Largo segundo a localização ou o contexto

Praça (Largo)
type: Concept
scope note: Espaço público livre e amplo, de forma regular. Resultado da intenção de racionalizar o traçado urbano e de ciar o espaço central e nobre na cidade. Associada geralmente a um ou mais edifícios importantes, civis ou religiosos, é um espaço polivalente e centro nevrálgico da vida pública. Os primeiros espaços urbanos pensados enquanto lugares para a vida pública, com funções equivalentes às da praça, apesar de encerrarem conceitos arquitetónicos e urbanísticos díspares, foram os ágora gregos e os forum romanos. Ambos correspondiam ao conceito de espaço central, onde se concentravam o poder cívico e religioso. Nos países ocidentais a evolução da praça pode ser traçada em três grandes fases, salvaguardando as diferenças cronológicas dos acontecimentos de país para país. As cidades medievais, só em Itália conheceram espaços que se podem identificar como praças irregulares. Só no final da idade média a intensificação da vida urbana começou a gerar noutros países a necessidade de espaços alternativos à rua. Em França surgiu o termo place para espaços públicos com características funcionais e espaciais idênticas à piazza italiana desta época, que em Portugal correspondem ao conceito de largo. Geralmente associadas a um edifício importante civil ou religioso, eram espaços de encontro e de comércio. As de menor dimensão, no centro da cidade acolhiam pequenos mercados diários. Paralelamente junto a uma porta da cidade outras de maior dimensão estavam reservadas aos grandes mercados periódicos, que encontram correspondência ao conceito de rossio em Portugal. A praça geométrica racionalista surge na cidade do renascimento em Itália, difundida por toda a Europa durante os séculos XVI, XVII, XVIII. Estes espaços estavam ligados ao conceito de beleza e à imagem do poder político. Eram fruto da conceção de um arquiteto, com fundamentos teóricos vinculados em tratados urbanísticos e não mais uma ocorrência espacial e funcional mais ou menos espontânea. A praça do renascimento adquire…
in scheme: Tesauro SIPA
preferred label: Place @fr
preferred label: Piazza @it
preferred label: Plazza (Square) @en
broader: Largo segundo a localização ou o contexto
narrower: Praceta
narrower: Praça segundo a função
narrower: Praça segundo o contexto histórico

Praceta
type: Concept
scope note: Espaço urbano público confinado por edifícios, inserido numa área residencial, com forma de praça de menor dimensão e com predominância de área pavimentada e/ou arborizada
in scheme: Tesauro SIPA
preferred label: Small square @en
preferred label: Petite place @fr
preferred label: Piazzetta @it
broader: Praça (Largo)

Praça segundo a função
type: Concept
in scheme: Tesauro SIPA
preferred label: Square according to function @en
preferred label: Place par fonction @fr
preferred label: Piazza per funzione @it
broader: Praça (Largo)
narrower: Praça de armas (Praça segundo a função)
narrower: Praça do pelourinho
narrower: Rotunda

Praça de armas (Praça segundo a função)
type: Concept
in scheme: Tesauro SIPA
preferred label: Arms square (Main square) (Square according to function) @en
preferred label: Place d'armes (Place par fonction ) @fr
preferred label: Piazza d'armi (Piazza per funzione) @it
broader: Praça segundo a função

Praça do pelourinho
type: Concept
scope note: Praça onde se insere o centro político, administrativo e judicial de um concelho, marcado pela existência do pelourinho, normalmente localizado fronteiro ao edifício da Câmara.
in scheme: Tesauro SIPA
preferred label: Pillory square @en
broader: Praça segundo a função

Rotunda
type: Concept
scope note: Nó rodoviário que condiciona o trânsito a entrar sempre no mesmo sentido e girar em torno de uma placa central circular, ou pelo menos simétrica.
in scheme: Tesauro SIPA
preferred label: Roundabout @en
preferred label: Rond-point @fr
preferred label: Rotonda @it
broader: Praça segundo a função

Praça segundo o contexto histórico
type: Concept
in scheme: Tesauro SIPA
preferred label: Square according to historic context @en
preferred label: Place selon le contexte historique @fr
preferred label: Piazza secondo il contesto storico @it
broader: Praça (Largo)
narrower: Ágora
narrower: Fórum (Praça)
narrower: Place royale
narrower: Plaza mayor

Ágora
type: Concept
scope note: Praça pública na Grécia antiga, onde se realizava a vida pública e política, marcada por construções, pórticos e estatuária.
in scheme: Tesauro SIPA
preferred label: Agora @en
broader: Praça segundo o contexto histórico

Fórum (Praça)
type: Concept
scope note: Espaço público no centro da antiga cidade romana, sob a forma de praça, onde se reunia a Assembleia do Povo. A estrutura das cidades da Roma antiga baseava-se nos antigos campos fortificados dos exércitos romanos designados por Castra que eram constituídos por uma fortificação retangular com quatro entradas opostas duas a duas definidas por dois eixos Norte-Sul, o Cardo, e o Este-Oeste, o Decumano. Na intersecção dos dois eixos situava-se geralmente o Fórum e o centro da vida económica. O Fórum era ainda um local de encontro social onde se celebravam várias cerimónias, festas religiosas e jogos. A zona do Fórum romano equivale à Ágora grega.
in scheme: Tesauro SIPA
preferred label: Forum (Square) @en
broader: Praça segundo o contexto histórico

Place royale
type: Concept
in scheme: Tesauro SIPA
preferred label: Piazza reale @it
broader: Praça segundo o contexto histórico

Plaza mayor
type: Concept
scope note: Espaço de forma regular, cercada por edifícios em todos os lados sendo a sua entrada apenas possível através de pórticos.
in scheme: Tesauro SIPA
broader: Praça segundo o contexto histórico

Terreiro (Largo)
type: Concept
scope note: Espaço público plano e amplo, associado a um edifício importante, religioso ou civil. As referências primitivas ao termo terreiro estão associadas aos espaços fronteiros aos conventos de frades mendicantes, que se instalavam fora de portas, ou a outros templos que se erguiam nas imediações das cidades medievais. O terreiro proporcionava espaço para acontecimentos públicos religiosas ou civis e diversas manifestações de carácter social, cultural e comercial. De forma irregular e espontânea, define a área de influência do edifício que lhe deu origem. Geralmente era em terra batida, apesar de poder surgir calcetado. Os terreiros ganharam protagonismo com a sua inclusão na cidade, quando no final da época medieval os espaços urbanos extravasaram as muralhas e em muitos casos os centros do poder e de decisão foram deslocados. Associados à existência de um paço e de outros edifícios civis e religiosos, muitos dos antigos terreiros receberam posteriormente praças. Foram espaços fundamentais na definição de muitos traçados de expansão das cidades durante os séculos XIV, XV e XVI e tomaram o protagonismo dos espaços públicos, a par dos rossios e eram frequentemente ligados entre eles por um eixo determinante, constituído por uma rua com forte cariz comercial, que frequentemente se chamava rua Nova ou rua da Corredoura.
in scheme: Tesauro SIPA
preferred label: Forecourt; Yard (Square) @en
broader: Largo segundo a localização ou o contexto

Espaço público não edificado de permanência e circulação segundo a função
type: Concept
in scheme: Tesauro SIPA
preferred label: Unbuilt public space for permanence and circulation according to function) @en
broader: Espaço público não edificado de permanência e circulação
narrower: Bazar

Bazar
type: Concept
in scheme: Tesauro SIPA
preferred label: Bazaar @en
preferred label: Bazar; Bazaar @fr
alternative label: Suq
broader: Espaço público não edificado de permanência e circulação segundo a função

Terreno expectante
type: Concept
in scheme: Tesauro SIPA
preferred label: Expectative land (Land on hold) @en
broader: Espaço público não edificado segundo a função

Espaço público não edificado segundo a importância
type: Concept
in scheme: Tesauro SIPA
preferred label: Unbilt public space according to importance @en
preferred label: Espace public non bâti selon son importance @fr
preferred label: Spazio pubblico non edificato secondo la sua importanza @it
broader: Espaço público não edificado
narrower: Espaço complementar
narrower: Espaço estruturante
narrower: Espaço secundário

Espaço complementar
type: Concept
in scheme: Tesauro SIPA
preferred label: Complementary space @en
broader: Espaço público não edificado segundo a importância
narrower: Eixo complementar

Eixo complementar
type: Concept
in scheme: Tesauro SIPA
preferred label: Complementary axis @en
broader: Espaço complementar

Espaço estruturante
type: Concept
in scheme: Tesauro SIPA
preferred label: Structural space @en
alternative label: Espaço fundamental
alternative label: Eixo matricial
broader: Espaço público não edificado segundo a importância

Espaço secundário
type: Concept
in scheme: Tesauro SIPA
preferred label: Secondary space @en
broader: Espaço público não edificado segundo a importância
narrower: Eixo secundário

Eixo secundário
type: Concept
in scheme: Tesauro SIPA
preferred label: Secondary axis @en
broader: Espaço secundário

Espaço semipúblico não edificado
type: Concept
in scheme: Tesauro SIPA
preferred label: Unbuilt semi-public space @en
preferred label: Espace semi-public non bâti @fr
preferred label: Spazio semipubblico non edificato @it
broader: Espaço urbano não edificado segundo a propriedade
narrower: Adro (Espaço semipúblico não edificado)
narrower: Serventia semipública

Adro (Espaço semipúblico não edificado)
type: Concept
scope note: Terreno que margina uma zona edificada.
in scheme: Tesauro SIPA
preferred label: Yard; Curchyard (Unbuilt semi-public space) @en
preferred label: Court (Espace semi-public non bâti) @fr
preferred label: Cortile (Spazio semipubblico non edificato) @it
broader: Espaço semipúblico não edificado

Serventia semipública
type: Concept
in scheme: Tesauro SIPA
preferred label: Semi-public right of way @en
broader: Espaço semipúblico não edificado

Setor urbano
type: Concept
scope note: Área dentro de uma cidade ou região metropolitana, que forma uma unidade coesa
in scheme: Tesauro SIPA
preferred label: Urban sector @en
preferred label: Secteur urbain @fr
preferred label: Settore urbano @it
hidden label: Sector urbano
broader: Aglomerado urbano segundo a escala
narrower: Setor urbano segundo a função
narrower: Setor urbano segundo a localização ou contexto
narrower: Setor urbano segundo a morfologia

Setor urbano segundo a função
type: Concept
in scheme: Tesauro SIPA
preferred label: Urban sector according to function @en
preferred label: Secteur urbain selon la fonction @fr
preferred label: Settore urbano secondo la funzione @it
hidden label: Sector urbano segundo a função
broader: Setor urbano
narrower: Pólo urbano

Pólo urbano
type: Concept
in scheme: Tesauro SIPA
preferred label: Urban centre @en
alternative label: Nó
broader: Setor urbano segundo a função

Setor urbano segundo a localização ou contexto
type: Concept
in scheme: Tesauro SIPA
preferred label: Urban sector according to location or context @en
hidden label: Sector urbano segundo a localização ou contexto
broader: Setor urbano
narrower: Acrópole
narrower: Alcáçova (Setor urbano)
narrower: Arrabalde
narrower: Cidadela (Setor urbano)
narrower: Centro histórico
narrower: Envolvente
narrower: Hinterland
narrower: Judiaria
narrower: Medina
narrower: Moçarabaria
narrower: Mouraria
narrower: Núcleo urbano
narrower: Periferia
narrower: Subúrbio
narrower: Termo

Acrópole
type: Concept
scope note: Parte mais elevada das cidades gregas, com funções de cidadela, de caraterísticas defensivas e quase sempre cercadas por muralhas. A acrópole na Antiga Grécia era, como o próprio nome diz - cidade alta, construída no ponto mais alto da cidade, servia originalmente como proteção contra invasores e inimigos. Mais tarde a acrópole passou a ter também características religiosas e políticas.
in scheme: Tesauro SIPA
preferred label: Acropolis @en
preferred label: Acropole @fr
preferred label: Acropoli @it
broader: Setor urbano segundo a localização ou contexto

Alcáçova (Setor urbano)
type: Concept
scope note: Área onde se erguia o castelo ou casa fortificada do senhor de uma povoação.
in scheme: Tesauro SIPA
preferred label: Alcazaba (Urban sector) @en
preferred label: Alcazaba (Secteur urbain) @fr
preferred label: Alcazaba (Settore urbano) @it
hidden label: Alcáçova (Sector urbano)
broader: Setor urbano segundo a localização ou contexto

Arrabalde
type: Concept
scope note: Bairro exterior às muralhas numa cidade islâmica medieval. Surgiu da necessidade de expansão urbana da cidade fortificada. Espaço urbano e periurbano de transição entre a cidade e o espaço rural. Implantado junto das muralhas, preferencialmente perto de uma das portas, o arrabalde oferece a segurança da proximidade a quem de novo chegava ás cidades e a quem não tinha nem estatuto social nem capacidade económica para se instalar intramuros. No arrabalde instalavam-se as comunidades de religiões diferentes da instituída: muçulmanos, judeus e moçárabes. Em temos funcionais os arrabaldes serviam a cidade, com a instalação de oficinas de diversos ofícios, sobretudo os mais poluentes indesejados no interior da muralha, de moinhos, de hortas e pomares, etc. Eram espaços marginais à cidade, tidos como rurais. O arrabalde geralmente crescia sobre uma estrutura linear ao longo de uma via de acesso à cidade, multiplicando-se em caminhos calçadas e azinhagas. Outras vezes estes espaços estavam associados ao Rossio, a um edifício religiosos fora de portas ou à decisão de estabelecer uma comunidade específica, como no caso de algumas judiarias e mourarias. Neste caso o traçado era mais regular do que nos arrabaldes de origem espontânea, como por exemplo nos casos de Santana em Lisboa, na judiaria de Évora e na mouraria de Beja. O seu carácter urbano assumia-se nas edificações construídas em contínuo, constituindo frentes de rua. No entanto a presença de quintais, hortas, pomares e instalações para animais conferiam-lhe a ruralidade característica de um espaço periurbano. O termo arrabalde está conotado com as cidades medievais, apesar da sua utilização ter persistido. A grande expansão das cidades industriais do séc. XIX levou ao surgimento de novos arrabaldes, com outras características, que remetem para o termo subúrbio.
in scheme: Tesauro SIPA
preferred label: Outskirts @en
preferred label: Banlieue (Faubourg) @fr
preferred label: Sobborgo @it
broader: Setor urbano segundo a localização ou contexto

Cidadela (Setor urbano)
type: Concept
scope note: Área de um aglomerado urbano rodeado por uma muralha que o defende.
in scheme: Tesauro SIPA
preferred label: Citadel (Urban sector) @en
preferred label: Citadelle (Secteur urbain) @fr
preferred label: Cittadella (Settore urbano) @it
hidden label: Cidadela (Sector urbano)
broader: Setor urbano segundo a localização ou contexto

Centro histórico
type: Concept
scope note: Para efeito de identificar os centros históricos, tem-se em consideração não apenas os antigos centros urbanos, assim tradicionalmente entendidos, como também, de um modo geral, todos os assentamentos humanos cujas estruturas, unitárias ou fragmentárias, ainda que se tenham transformado ao longo do tempo, se hajam constituído no passado ou, entre muitos, os que eventualmente tenham adquirido um valor especial como testemunho histórico ou como características urbanísticas ou arquitetónicas particulares. A sua natureza histórica refere-se ao interesse que tais assentamentos apresentarem como testemunhos de civilizações do passado e como documentos de cultura urbana, inclusive independentemente de seu intrínseco valor artístico ou formal, ou do seu aspeto peculiar enquanto ambiente, que podem enriquecer e ressaltar posteriormente o seu valor, já que não só a arquitetura, mas também a estrutura urbanística, têm por si mesmas um significado e um valor.
in scheme: Tesauro SIPA
preferred label: Historic centre @en
preferred label: Vieille ville @fr
preferred label: Città vecchia @it
alternative label: Casco antigo
broader: Setor urbano segundo a localização ou contexto

Envolvente
type: Concept
scope note: Área que envolve um edifício ou um núcleo urbano. Pressupõe uma relação direta com o objeto de referência e implica uma área de influência e interdependência. A extensão de uma envolvente não é determinada por regras nem tem um limite físico. É um conceito que está ligado à noção abstrata da existência de um núcleo e de espaço sob a sua influência.
in scheme: Tesauro SIPA
preferred label: Surrounding @en
broader: Setor urbano segundo a localização ou contexto

Hinterland
type: Concept
in scheme: Tesauro SIPA
broader: Setor urbano segundo a localização ou contexto

Judiaria
type: Concept
scope note: Zona de uma cidade ou vila medieval, reservada para população judaica. As comunidades judaicas começaram a instalar-se em Portugal antes do período de romanização. A sua existência manteve-se pacífica, mas desde o período muçulmano se verificou a tendência de organização das populações de diferentes religiões por bairros próprios, sendo dessa época a existência das primeiras judiarias informais. Foi com o reinado de D. Pedro que se instituiu a obrigação legal de existência de bairros exclusivamente de população judaica, com delimitações físicas definidas. A judiaria podia ser composta por uma rua ou por vários quarteirões, em função da dimensão da comunidade judaica de cada cidade. Geralmente eram separadas da restante cidade por um portão que imponha o recolher obrigatório ao fim do dia. As judiarias eram áreas maioritariamente residenciais, mas incluíam oficinas e outros estabelecimentos de judeus bem como uma sinagoga. Em muitos países eram reguladas por leis próprias, e a autoridade maior era o maior era o arrabi-mor. Em Portugal dependiam diretamente do rei. Com o decreto de expulsão dos judeus no reinado de D. Manuel, as judiarias desaparecem enquanto guetos e integram-se nas cidades. Em muitos casos a sua rua principal depois de aberta a toda a população, toma o nome de Rua Nova.
in scheme: Tesauro SIPA
preferred label: Jewry @en
preferred label: Juiverie @fr
preferred label: Quartiere dei giudei @it
broader: Setor urbano segundo a localização ou contexto

Medina
type: Concept
scope note: Zona civil de uma cidade fortificada islâmica. Termo herdado da cultura árabe refere-se á área amuralhada da cidade, que contém a alcáçova e as principais funções civis e religiosas. O complexo edificado de uma fortaleza medieval muçulmana, composto por duas zonas distintas, a Medina e a Alcáçova, correspondentes a duas muralhas ou cercas defensivas. A Medina, que corresponde à cidade, é fundamentalmente residencial e comercial e tem equipamentos urbanos como os banhos públicos. Tem o seu núcleo na mesquita maior e no suk – o mercado de levante e caracteriza-se por um traçado urbano muito característico, estruturado numa rede de ruas sinuosas e becos estreitos. Na cerca da Medina existem várias portas para estabelecer ligação da cidade com o exterior, geralmente na continuidade dos eixos das vias de ligação às principais cidades. A expansão urbana extramuros fazia-se nos arrabaldes da medina.
in scheme: Tesauro SIPA
broader: Setor urbano segundo a localização ou contexto

Moçarabaria
type: Concept
scope note: Espaço num aglomerado urbano, onde habitavam os cristãos sob domínio muçulmano.
in scheme: Tesauro SIPA
preferred label: Mozarabaria; Mozarabia @en
broader: Setor urbano segundo a localização ou contexto

Mouraria
type: Concept
scope note: Zona de uma cidade ou vila medieval, reservada para população muçulmana. As comunidades muçulmanas que ficaram nas cidades conquistadas durante a reconquista cristã foram instaladas em bairros próprios, herdados de uma organização espacial e social que se manteve do período muçulmano. As cidades estavam organizadas com as populações de diferentes religiões por bairros próprios, que nas épocas de maior instabilidade mudavam de residentes em função de quem estava no poder. Referindo o caso de Lisboa, Alfama foi inicialmente, após a conquista muçulmana, o bairro da população moçárabe (cristãos convertidos), vindo a ser ocupada depois da reconquista pela população muçulmana, constituindo a primeira Mouraria da cidade. O aumento da população levou à constituição de uma segunda mouraria, que mantém a memória do seu topónimo. A mouraria não conheceu em nenhuma época o carácter de gueto atribuído ás judiarias nem tinha delimitações físicas. Era composta por uma rua ou por vários quarteirões, em função da dimensão da comunidade mourisca de cada cidade. Na mouraria predominava a função residencial e estavam instaladas as oficinas de diversos ofícios tradicionalmente ligados a esta população. Geralmente de condição social muito baixa, os mouros eram trabalhadores ou escravos, que não detinham nem a cultura nem o poder económico dos judeus, condição esta que se refletia, por exemplo, na não existência de uma mesquita na mouraria.
in scheme: Tesauro SIPA
preferred label: Moorery @en
preferred label: Quartier des maures @fr
preferred label: Quartiere dei mori @it
broader: Setor urbano segundo a localização ou contexto

Núcleo urbano
type: Concept
scope note: Célula fundacional de um território que representa o conjunto edificado consolidado que estrutura a própria rede urbana. A expressão de núcleo urbano, é de certa forma sinónimo de aglomerado, embora a primeira salienta a importância e o grau de consistência morfológica, uma vez que incorpora a noção essencial de centro e concomitante relação com a periferia e o perímetro, pressupondo uma organização espacial representativa da totalidade das funções urbanas.
in scheme: Tesauro SIPA
preferred label: Urban core @en
broader: Setor urbano segundo a localização ou contexto

Periferia
type: Concept
scope note: Área afastada do centro de um aglomerado urbano, normalmente menos desenvolvido.
in scheme: Tesauro SIPA
preferred label: Periphery @en
preferred label: Périphérie @fr
broader: Setor urbano segundo a localização ou contexto

Subúrbio
type: Concept
scope note: Área urbanizada que rodeia uma cidade. O conceito implica uma situação de dependência ou de inferioridade relativamente ao núcleo urbano que o gera, subjacente no próprio termo suburbano. Termo que substituiu gradualmente o termo medieval arrabalde, tem como sinónimo os vocábulos arredores, zona suburbana e periferia. Designa um território urbanizado que cresceu em função de uma cidade, resultado da pressão demográfica e da especulação imobiliária. Caracteriza-se por um crescimento rápido e pouco estruturado, que não garante as infraestruturas necessárias à concentração populacional que comporta. Diverge da cidade pela estratificação social, pela diversidade de equipamentos, pela oferta de comércio e emprego, pela rede de transportes e pela qualidade do espaço urbano. O conceito inicial de subúrbio do século XVIII referia-se a um espaço urbano de transição com o campo, composto por habitações unifamiliares, acessíveis a um número maior de pessoas devido a valores de solo mais baixos, com o objetivo de conciliar a qualidade de vida de um pequeno núcleo urbano à proximidade da cidade. Este conceito foi sendo progressivamente subvertido, com o crescimento das cidades industriais da Europa durante o século XIX, baseado no desenvolvimento das redes de transportes, até atingir a dimensão do fenómeno que conhecemos no século XX, com o crescimento exponencial da população e uma especulação imobiliária incompatíveis com o desenvolvimento de áreas urbanas de qualidade. No final do século XX e início do XXI políticas de ordenamento do território levaram a que alguns subúrbios vissem o seu estatuto mudar, tornando-se cidades, potenciais geradoras de novos subúrbios.
in scheme: Tesauro SIPA
preferred label: Banlieue (Faubourg) @fr
preferred label: Sobborgo @it
preferred label: Suburb @en
broader: Setor urbano segundo a localização ou contexto

Termo
type: Concept
scope note: Marca o limite administrativo de um aglomerado urbano.
in scheme: Tesauro SIPA
preferred label: Limit (Border) @en
preferred label: Terme (Limite) @fr
preferred label: Termine (Limite) @it
broader: Setor urbano segundo a localização ou contexto

Setor urbano segundo a morfologia
type: Concept
in scheme: Tesauro SIPA
preferred label: Urban sector according to morphology @en
hidden label: Sector urbano segundo a morfologia
broader: Setor urbano
narrower: Bairro (Setor urbano segundo a morfologia)
narrower: Conjunto edificado
narrower: Conjunto urbano

Bairro (Setor urbano segundo a morfologia)
type: Concept
scope note: Área de um aglomerado urbano com características próprias e geralmente com unidade formal e funcional que se distingue na envolvente. O termo tem origem controversa, mas está documentado desde 1321 - Barrho - significando povoado junto a uma cidade. Nas cidades de origem islâmica o bairro surge geralmente fora das muralhas e adquire o nome de arrabalde. Ao longo da história, com o crescimento dos aglomerados urbanos, os bairros são absorvidos pela cidade e o termo, bayrro - em 1611, passa a designar parte de uma cidade.
in scheme: Tesauro SIPA
preferred label: Quartier @fr
preferred label: Quartiere @it
preferred label: Borough; Neighbourhood (Urban sector according to morphology) @en
broader: Setor urbano segundo a morfologia

Conjunto edificado
type: Concept
scope note: Agrupamento de construções com relações entre si, funcionais ou espaciais.
in scheme: Tesauro SIPA
preferred label: Building set; Built complex @en
broader: Setor urbano segundo a morfologia

Conjunto urbano
type: Concept
scope note: Assentamento humano permanente materializado num agrupamento de construções, articulado de modo coerente e que constitua uma unidade espacial de natureza urbanística, em virtude da sua arquitetura, unidade ou integração na paisagem. O termo conjunto urbano aplica-se às diferentes escalas da organização do espaço urbano tal como o aglomerado urbano, mas distingue-se deste último pela sua unidade formal que o distingue na envolvente.
in scheme: Tesauro SIPA
preferred label: Urban set; Urban complex @en
broader: Setor urbano segundo a morfologia

Sistema urbano
type: Concept
scope note: Organização e funcionamento de um aglomerado urbano, abrangendo diversos elementos interligados como infraestruturas, serviços, instituições e a população.
in scheme: Tesauro SIPA
preferred label: Urban system @en
alternative label: Infraestrutura urbana
alternative label: Rede urbana
broader: Aglomerado urbano segundo a escala
narrower: Rede viária
narrower: Sistema de energia e telecomunicações
narrower: Sistema de saneamento e de abastecimento de água
narrower: Sistema de transportes

Rede viária
type: Concept
scope note: Conjunto de espaços reservados e equipados de modo a permitir a circulação de pessoas e veículos ou qualquer outro meio de transporte terrestre, assim como seu estacionamento.
in scheme: Tesauro SIPA
preferred label: Road network @en
preferred label: Réseau routier @fr
preferred label: Rete stradale @it
broader: Sistema urbano

Sistema de energia e telecomunicações
type: Concept
in scheme: Tesauro SIPA
preferred label: Energy and telecommunications system @en
preferred label: Système d’énergie et télécommunications @fr
preferred label: Sistema dell'energia e delle telecomunicazioni @it
broader: Sistema urbano

Sistema de saneamento e de abastecimento de água
type: Concept
in scheme: Tesauro SIPA
preferred label: Water supply and sanitation system @en
preferred label: Système d’assainissement et d’approvisionnement en eau @fr
preferred label: Sistema sanitario e di approvvigionamento idrico @it
broader: Sistema urbano

Sistema de transportes
type: Concept
scope note: Infraestrutura composta por um ou mais meios de deslocação e uma rede de linhas ou carreiras que asseguram a cobertura territorial de uma área. Uma rede de transportes é caracterizada pelos diferentes meios de deslocação, nomeadamente os transportes públicos, e pelas suas infraestruturas de apoio, praças de táxis, estações, terminais e outros interfaces, itinerários, capacidades de transporte e horários.
in scheme: Tesauro SIPA
preferred label: Transportation system @en
preferred label: Système des transports @fr
preferred label: Sistema dei trasporti @it
broader: Sistema urbano

ATRIBUTOS E PROPRIEDADES
type: Collection
type: ConceptGroup
preferred label: ATTRIBUTES AND PROPERTIES @en
preferred label: ATTRIBUTS ET PROPRIÉTÉS @fr
preferred label: ATTRIBUTI E PROPRIETÀ @it
member: Atributos e propriedades
member: Adaptabilidade
member: Atributos artificiais
member: Atributos artificiais segundo a forma de divisão
member: Bipartido
member: Quadripartido
member: Sexpartido
member: Tripartido
member: Atributos físicos
member: Absorção (Atributos físicos)
member: Condutividade
member: Cristalinidade
member: Dureza
member: Gravidade
member: Permeabilidade
member: Peso
member: Porosidade
member: Relevo
member: Alto relevo
member: Baixo relevo
member: Baixíssimo relevo
member: Médio relevo
member: Relevo negativo
member: Secura
member: Viscosidade
member: Volatibilidade
member: Volume
member: Atributos físico-químicos
member: Aquoso
member: Biodegradável
member: Biorecetividade
member: Composição
member: Heterogeneidade
member: Homogeneidade
member: Pureza
member: Durabilidade
member: Toxicidade
member: Atributos formais
member: Atributos formais genéricos
member: Afestoado
member: Amorfo
member: Anelar
member: Angular
member: Apainelado
member: Apontado
member: Arabesco
member: Arqueado
member: Subarqueado
member: Campaniforme
member: Claviforme
member: Contracurvado
member: Contrafortado
member: Cordiforme
member: Curvo
member: Duplo
member: Entrançado
member: Entrelaçado
member: Flabeliforme
member: Flechiforme
member: Fusiforme
member: Lanceolado
member: Ondeado
member: Pectínio
member: Pleno
member: Recortado
member: Rendilhado
member: Vazado
member: Volutado
member: Atributos formais para a arquitetura
member: Atributos genéricos do edificado
member: Piso (Atributos genéricos do edificado)
member: Arranha-céus
member: Dois pisos
member: Piso térreo

Atributos e propriedades
type: Concept
scope note: A hierarquia Atributos e Propriedades integra descritores que representam características, qualidades, valores e condições de natureza física, biológica, social, cultural, jurídica, económica e ou psicológica, entre outras, próprias de determinada Entidade ou grupo de entidades, Produtos, Objetos, sistemas ou locais, ou adquiridas na sequência de mudanças resultantes de Atividades, Eventos ou Processos.
in scheme: Tesauro SIPA
top concept of: Tesauro SIPA
preferred label: Attributes and properties @en
preferred label: Attributs et propriétés @fr
preferred label: Attributi e proprietà @it
narrower: Adaptabilidade
narrower: Atributos artificiais
narrower: Atributos físicos
narrower: Atributos físico-químicos
narrower: Atributos formais
narrower: Atributos operacionais
narrower: Atributos posicionais
narrower: Atributos qualitativos
narrower: Atributos relacionados com o tempo
narrower: Atributos segundo os processos de fabricação
narrower: Atributos térmicos
narrower: Cor
narrower: Densidade
narrower: Estabilidade
narrower: Polaridade
narrower: Propriedades acústicas
narrower: Propriedades elétricas
narrower: Propriedades geofísicas
narrower: Propriedades mecânicas
narrower: Propriedades químicas
narrower: Textura
related: Atividades, eventos, fenómenos, processos e técnicas
related: Compartimentos e espaços
related: Elementos arquitetónicos
related: Materiais e produtos
related: c 7e244aff
related: c 65005b47
related: c 8ab8573d
related: c 1c2d6140
modified: 2025-09-23T13:21:15

Adaptabilidade
type: Concept
scope note: Tipo de atributo que reporta à capacidade de adaptação a qualquer circunstância.
in scheme: Tesauro SIPA
preferred label: Adaptability @en
preferred label: Adaptabilité @fr
preferred label: Adattabilità @it
broader: Atributos e propriedades

Atributos artificiais
type: Concept
in scheme: Tesauro SIPA
preferred label: Artificial attributes @en
preferred label: Attributs artificiels @fr
preferred label: Attributi artificiali @it
broader: Atributos e propriedades
narrower: Atributos artificiais segundo a forma de divisão

Atributos artificiais segundo a forma de divisão
type: Concept
in scheme: Tesauro SIPA
preferred label: Artificial attributes according to division method @en
preferred label: Attributs artificiels selon la méthode de division @fr
preferred label: Attributi artificiali secondo il metodo della divisione @it
broader: Atributos artificiais
narrower: Bipartido
narrower: Quadripartido
narrower: Sexpartido
narrower: Tripartido

Bipartido
type: Concept
scope note: Elemento que se encontra dividido em duas partes iguais.
in scheme: Tesauro SIPA
preferred label: Bipartite @en
preferred label: Bipartito @it
broader: Atributos artificiais segundo a forma de divisão

Quadripartido
type: Concept
scope note: Elemento que se encontra dividido em quatro partes iguais.
in scheme: Tesauro SIPA
preferred label: Quadripartite @en
preferred label: Quadripartito @it
broader: Atributos artificiais segundo a forma de divisão

Sexpartido
type: Concept
scope note: Elemento que se encontra dividido em seis partes iguais.
in scheme: Tesauro SIPA
preferred label: Sextipartite @en
preferred label: Sexpartite @fr
preferred label: Sei-partito @it
broader: Atributos artificiais segundo a forma de divisão

Tripartido
type: Concept
scope note: Elemento que se encontra dividido em três partes iguais.
in scheme: Tesauro SIPA
preferred label: Tripartite @en
preferred label: Tripartito @it
broader: Atributos artificiais segundo a forma de divisão

Atributos físicos
type: Concept
in scheme: Tesauro SIPA
preferred label: Physical attributes @en
preferred label: Attributs physiques @fr
preferred label: Attributi fisici @it
broader: Atributos e propriedades
narrower: Absorção (Atributos físicos)
narrower: Condutividade
narrower: Cristalinidade
narrower: Dureza
narrower: Gravidade
narrower: Permeabilidade
narrower: Peso
narrower: Porosidade
narrower: Relevo
narrower: Secura
narrower: Viscosidade
narrower: Volatibilidade
narrower: Volume

Absorção (Atributos físicos)
type: Concept
in scheme: Tesauro SIPA
preferred label: Absorbency (Physical attributes) @en
preferred label: Absorption (Attributs physiques) @fr
preferred label: Assorbimento (Attributi fisici) @it
broader: Atributos físicos

Condutividade
type: Concept
in scheme: Tesauro SIPA
preferred label: Conductivity @en
preferred label: Conductivité @fr
preferred label: Conduttività @it
broader: Atributos físicos

Cristalinidade
type: Concept
in scheme: Tesauro SIPA
preferred label: Cristallinity @en
preferred label: Cristallinité @fr
preferred label: Cristallinità @it
broader: Atributos físicos

Dureza
type: Concept
in scheme: Tesauro SIPA
preferred label: Hardness @en
preferred label: Dureté @fr
preferred label: Durezza @it
broader: Atributos físicos

Gravidade
type: Concept
in scheme: Tesauro SIPA
preferred label: Gravity @en
preferred label: Gravité @fr
preferred label: Gravità @it
broader: Atributos físicos

Permeabilidade
type: Concept
scope note: Característica de um material ou de um objeto ser atravessado pelo ar, água, etc. No caso da construção, ocorre especialmente em paredes de adobe dado serem muito permeáveis à água. Por isso eram aplicados rebocos à base de cal apagada ou caiadas para as proteger da chuva e eram executadas sobre fundações de alvenaria de pedra (maioritariamente em xisto) que se elevavam mais de 0,50m acima do solo para prevenir a humidade ascendente.
in scheme: Tesauro SIPA
preferred label: Permeability @en
preferred label: Perméabilité @fr
preferred label: Permeabilità @it
broader: Atributos físicos

Peso
type: Concept
in scheme: Tesauro SIPA
preferred label: Weight @en
preferred label: Poids @fr
broader: Atributos físicos

Porosidade
type: Concept
scope note: Característica de um material ou de um objeto ter mais ou menos poros ou interstícios. Na construção civil, este atributo é particularmente importante nas coberturas, cuja porosidade aumenta com o fim da vida útil das telhas ou chapas, com a ventilação insuficiente e/ou com o apodrecimento de folhas sobre ela.
in scheme: Tesauro SIPA
preferred label: Porosity @en
preferred label: Porosité @fr
preferred label: Porosità @it
broader: Atributos físicos

Relevo
type: Concept
scope note: Característica de um objeto que apresenta elementos em ressalto a partir da sua superfície. No caso da escultura, refere-se a um objeto esculpido que apresenta elementos em ressalto a partir de um painel, que forma o fundo.
in scheme: Tesauro SIPA
preferred label: Relief @en
preferred label: Rilievo @it
broader: Atributos físicos
narrower: Alto relevo
narrower: Baixo relevo
narrower: Médio relevo
narrower: Relevo negativo

Alto relevo
type: Concept
scope note: Tipo de relevo, em que as figuras ou formas se salientam do suporte mais de metade do seu volume real, e em que algumas das partes podem estar completamente destacadas do fundo.
in scheme: Tesauro SIPA
preferred label: High relief @en
preferred label: Haut-relief @fr
preferred label: Alto rilievo @it
broader: Relevo

Baixo relevo
type: Concept
scope note: Tipo de relevo em que as formas se destacam do suporte em menos de metade do volume real.
in scheme: Tesauro SIPA
preferred label: Bas-relief @en
preferred label: Basso rilievo @it
broader: Relevo
narrower: Baixíssimo relevo

Baixíssimo relevo
type: Concept
scope note: Tipo de relevo em que as formas não se destacam do suporte, sendo, em vários casos apenas delineadas.
in scheme: Tesauro SIPA
preferred label: Very low relief @en
preferred label: Très bas-relief @fr
preferred label: Bassissimo rilievo @it
broader: Baixo relevo

Médio relevo
type: Concept
in scheme: Tesauro SIPA
preferred label: Medium relief @en
preferred label: Relief moyen @fr
preferred label: Rilievo medio @it
broader: Relevo

Relevo negativo
type: Concept
in scheme: Tesauro SIPA
preferred label: Negative relief @en
preferred label: Relief négatif @fr
preferred label: Rilievo negativo @it
broader: Relevo

Secura
type: Concept
in scheme: Tesauro SIPA
preferred label: Sécheresse @fr
preferred label: Dryness @en
preferred label: Secchezza @it
broader: Atributos físicos

Viscosidade
type: Concept
in scheme: Tesauro SIPA
preferred label: Viscosity @en
preferred label: Viscosité @fr
preferred label: Viscosità @it
broader: Atributos físicos

Volatibilidade
type: Concept
in scheme: Tesauro SIPA
preferred label: Volatility @en
preferred label: Volatilité @fr
preferred label: Volatilità @it
broader: Atributos físicos

Volume
type: Concept
in scheme: Tesauro SIPA
broader: Atributos físicos

Atributos físico-químicos
type: Concept
in scheme: Tesauro SIPA
preferred label: Physicochemical attributes @en
preferred label: Attributs physicochimiques @fr
preferred label: Attributi fisicochimici @it
broader: Atributos e propriedades
narrower: Aquoso
narrower: Biodegradável
narrower: Biorecetividade
narrower: Composição
narrower: Durabilidade
narrower: Toxicidade

Aquoso
type: Concept
in scheme: Tesauro SIPA
preferred label: Aqueous @en
preferred label: Aqueux @fr
preferred label: Acquoso @it
broader: Atributos físico-químicos

Biodegradável
type: Concept
in scheme: Tesauro SIPA
preferred label: Biodegradable @en
preferred label: Biodégradable @fr
preferred label: Biodegradabile @it
broader: Atributos físico-químicos

Biorecetividade
type: Concept
in scheme: Tesauro SIPA
preferred label: Bioreceptivity @en
preferred label: Bioreceptivité @fr
preferred label: Biorecettività @it
hidden label: Bioreceptividade
broader: Atributos físico-químicos

Composição
type: Concept
in scheme: Tesauro SIPA
preferred label: Composition @en
preferred label: Composizione @it
broader: Atributos físico-químicos
narrower: Heterogeneidade
narrower: Homogeneidade
narrower: Pureza

Heterogeneidade
type: Concept
in scheme: Tesauro SIPA
preferred label: Heterogeneity @en
preferred label: Hétérogénéité @fr
preferred label: Eterogeneità @it
broader: Composição

Homogeneidade
type: Concept
in scheme: Tesauro SIPA
preferred label: Homogeneity @en
preferred label: Homogénéité @fr
preferred label: Omogeneità @it
broader: Composição

Pureza
type: Concept
in scheme: Tesauro SIPA
preferred label: Fineness (Purity) @en
preferred label: Pureté @fr
preferred label: Purezza @it
broader: Composição

Durabilidade
type: Concept
in scheme: Tesauro SIPA
preferred label: Durability @en
preferred label: Durabilité @fr
preferred label: Durabilità @it
broader: Atributos físico-químicos

Toxicidade
type: Concept
in scheme: Tesauro SIPA
preferred label: Toxicity @en
preferred label: Toxicité @fr
preferred label: Tossicità @it
broader: Atributos físico-químicos

Atributos formais
type: Concept
in scheme: Tesauro SIPA
preferred label: Form attributes (Shape) @en
preferred label: Attributs de forme @fr
preferred label: Attributi formali @it
broader: Atributos e propriedades
narrower: Atributos formais genéricos
narrower: Atributos formais para a arquitetura
narrower: Atributos formais para a escultura
narrower: Atributos formais segundo o tipo
narrower: Atributos formais segundo a relação
narrower: Atributos formais segundo o estado de conservação
narrower: Atributos formais segundo o perfil
narrower: Atributos formais segundo o posicionamento
narrower: Formato

Atributos formais genéricos
type: Concept
in scheme: Tesauro SIPA
preferred label: Generic form attributes @en
preferred label: Attributs de forme génériques @fr
preferred label: Attributi formali generici @it
broader: Atributos formais
narrower: Afestoado
narrower: Amorfo
narrower: Anelar
narrower: Angular
narrower: Apainelado
narrower: Apontado
narrower: Arabesco
narrower: Arqueado
narrower: Campaniforme
narrower: Claviforme
narrower: Contracurvado
narrower: Contrafortado
narrower: Cordiforme
narrower: Curvo
narrower: Duplo
narrower: Entrançado
narrower: Entrelaçado
narrower: Flabeliforme
narrower: Flechiforme
narrower: Fusiforme
narrower: Lanceolado
narrower: Ondeado
narrower: Pectínio
narrower: Pleno
narrower: Recortado
narrower: Rendilhado
narrower: Vazado
narrower: Volutado

Afestoado
type: Concept
scope note: Elemento decorativo formado por uma sucessão de festões.
in scheme: Tesauro SIPA
preferred label: Festooned @en
preferred label: Festonné @fr
preferred label: Festonato @it
broader: Atributos formais genéricos

Amorfo
type: Concept
scope note: Objeto sem formas definidas.
in scheme: Tesauro SIPA
preferred label: Amorphous @en
preferred label: Amorphe @fr
broader: Atributos formais genéricos

Anelar
type: Concept
scope note: Elemento decorativo ou objeto em forma de anel.
in scheme: Tesauro SIPA
preferred label: Ring-shaped @en
preferred label: Annulaire @fr
preferred label: Anulare @it
broader: Atributos formais genéricos

Angular
type: Concept
scope note: Elemento que forma um ângulo.
in scheme: Tesauro SIPA
preferred label: Angulaire @fr
preferred label: Angolare @it
broader: Atributos formais genéricos

Apainelado
type: Concept
scope note: Elemento ou objeto constituído por um ou vários painéis.
in scheme: Tesauro SIPA
preferred label: Panelled @en
preferred label: Panneauté @fr
preferred label: Pannellato @it
broader: Atributos formais genéricos

Apontado
type: Concept
in scheme: Tesauro SIPA
preferred label: Pointed @en
preferred label: Pointu @fr
preferred label: Puntato @it
broader: Atributos formais genéricos

Arabesco
type: Concept
scope note: Elemento decorativo composto por formas curvilíneas, de variado teor, destacando-se, como arabescos, os painéis com decoração simétrica a partir de um eixo central.
in scheme: Tesauro SIPA
preferred label: Arabesque @en
broader: Atributos formais genéricos

Arqueado
type: Concept
scope note: Elemento que forma um arco ou um segmento de arco.
in scheme: Tesauro SIPA
preferred label: Arched @en
preferred label: Arqué @fr
preferred label: Arcuato @it
broader: Atributos formais genéricos
narrower: Subarqueado

Subarqueado
type: Concept
in scheme: Tesauro SIPA
preferred label: Sub-arched @en
preferred label: Sous-arqué @fr
preferred label: Sotto-arcuato @it
broader: Arqueado

Campaniforme
type: Concept
scope note: Elemento em forma de sino.
in scheme: Tesauro SIPA
preferred label: Campaniform (Bell-shaped) @en
broader: Atributos formais genéricos

Claviforme
type: Concept
in scheme: Tesauro SIPA
preferred label: Claviform @en
broader: Atributos formais genéricos

Contracurvado
type: Concept
in scheme: Tesauro SIPA
preferred label: Counter-curved @en
preferred label: Contre-courbé @fr
preferred label: Controcoperto @it
broader: Atributos formais genéricos

Contrafortado
type: Concept
in scheme: Tesauro SIPA
preferred label: Buttressed @en
preferred label: Contreforté @fr
preferred label: Contraforzato @it
broader: Atributos formais genéricos

Cordiforme
type: Concept
scope note: Elemento em forma de corda.
in scheme: Tesauro SIPA
preferred label: Heart-shaped @en
preferred label: En forme de cœur @fr
preferred label: A forma di cuore @it
broader: Atributos formais genéricos

Curvo
type: Concept
scope note: Elemento que forma uma curvatura.
in scheme: Tesauro SIPA
preferred label: Curved @en
preferred label: Courbé @fr
broader: Atributos formais genéricos

Duplo
type: Concept
in scheme: Tesauro SIPA
preferred label: Double @en
preferred label: Doppio @it
broader: Atributos formais genéricos

Entrançado
type: Concept
scope note: Elemento decorativo disposto em forma de trança ou encanastrado.
in scheme: Tesauro SIPA
preferred label: Plaiting (Braided) @en
preferred label: Tressé @fr
preferred label: Intrecciato @it
broader: Atributos formais genéricos

Entrelaçado
type: Concept
scope note: Elemento decorativo em que os motivos se sobrepõem geometricamente, de forma sucessiva.
in scheme: Tesauro SIPA
preferred label: Interwining @en
preferred label: Entrelacé @fr
preferred label: Intreccio @it
broader: Atributos formais genéricos

Flabeliforme
type: Concept
scope note: Elemento decorativo em forma de leque.
in scheme: Tesauro SIPA
preferred label: Flabeliform @en
preferred label: Flabelliforme @fr
broader: Atributos formais genéricos

Flechiforme
type: Concept
scope note: Elemento decorativo em forma de flecha.
in scheme: Tesauro SIPA
preferred label: Arrow-shaped @en
preferred label: En forme de flèche @fr
preferred label: A forma di freccia @it
broader: Atributos formais genéricos

Fusiforme
type: Concept
scope note: Elemento decorativo em forma de fuso.
in scheme: Tesauro SIPA
preferred label: Fusiform @en
broader: Atributos formais genéricos

Lanceolado
type: Concept
in scheme: Tesauro SIPA
preferred label: Lanceolate @en
preferred label: Lancéolé @fr
preferred label: Lanceolato @it
broader: Atributos formais genéricos

Ondeado
type: Concept
scope note: Elemento decorativo em forma de onda.
in scheme: Tesauro SIPA
preferred label: Wavy @en
preferred label: Ondulé @fr
preferred label: Ondulato @it
alternative label: Ondulado
broader: Atributos formais genéricos

Pectínio
type: Concept
scope note: Elemento decorativo ou objeto em forma de pente.
in scheme: Tesauro SIPA
preferred label: Pectinate @en
preferred label: Pectinée @fr
preferred label: Pettinato @it
broader: Atributos formais genéricos

Pleno
type: Concept
in scheme: Tesauro SIPA
preferred label: Full @en
preferred label: Plein @fr
preferred label: Pieno @it
broader: Atributos formais genéricos

Recortado
type: Concept
in scheme: Tesauro SIPA
preferred label: Notched @en
preferred label: Découpé @fr
preferred label: Ritagliato @it
broader: Atributos formais genéricos

Rendilhado
type: Concept
scope note: Elemento decorativo que imita a renda.
in scheme: Tesauro SIPA
preferred label: Lattice-like @en
preferred label: Dentelé @fr
preferred label: Merlettato @it
broader: Atributos formais genéricos

Vazado
type: Concept
in scheme: Tesauro SIPA
preferred label: Pierced (Hollowed) @en
preferred label: Perforé @fr
preferred label: Forato @it
broader: Atributos formais genéricos

Volutado
type: Concept
scope note: Elemento decorativo ou objeto em forma de voluta.
in scheme: Tesauro SIPA
preferred label: Volute-shaped @en
preferred label: Voluté @fr
preferred label: Voluto @it
broader: Atributos formais genéricos

Atributos formais para a arquitetura
type: Concept
in scheme: Tesauro SIPA
preferred label: Form attributes for architecture @en
preferred label: Attributs de forme pour l'architecture @fr
preferred label: Attributi formali per l'architettura @it
hidden label: Atributos formais para a arquitectura
broader: Atributos formais
narrower: Atributos genéricos do edificado
narrower: Fenestração
narrower: Modinatura
narrower: Tipo de planta

Atributos genéricos do edificado
type: Concept
in scheme: Tesauro SIPA
preferred label: Generic attributes of the built environment @en
preferred label: Attributs génériques du bâti @fr
preferred label: Attributi generici dell'edificato @it
broader: Atributos formais para a arquitetura
narrower: Piso (Atributos genéricos do edificado)

Piso (Atributos genéricos do edificado)
type: Concept
scope note: Elemento estruturante de um edifício, compreendido entre duas lajes, formando um plano habitável, qualquer que seja a sua cota em relação ao terreno, incluindo as caves e águas furtadas.
in scheme: Tesauro SIPA
preferred label: Story (Floors) (Generic attributes of the built environment) @en
preferred label: Étages (Attributs génériques du bâti) @fr
preferred label: Piani (Attributi generici dell'edificato) @it
broader: Atributos genéricos do edificado
narrower: Arranha-céus
narrower: Dois pisos
narrower: Piso térreo

Arranha-céus
type: Concept
scope note: Edifício de grande altura e continuamente habitável, geralmente com mais de 40 andares e altura superior a 150 metros, muito popularizado a partir do século XIX.
in scheme: Tesauro SIPA
preferred label: Skyscrapers @en
preferred label: Gratte-ciel @fr
preferred label: Grattacieli @it
broader: Piso (Atributos genéricos do edificado)

Dois pisos
type: Concept
scope note: Edifício que se desenvolve em altura, formando dois níveis de utilização.
in scheme: Tesauro SIPA
preferred label: Two-story @en
preferred label: Deux étages @fr
preferred label: Due piani @it
broader: Piso (Atributos genéricos do edificado)

Piso térreo
type: Concept
scope note: Piso de um edifício, situado ao nível da cota da via pública, denominado, por vezes, como primeiro piso.
in scheme: Tesauro SIPA
preferred label: Ground floor @en
preferred label: Rez-de-chaussée @fr
preferred label: Piano terra @it
broader: Piso (Atributos genéricos do edificado)

Fenestração
type: Concept
scope note: Forma de distribuição dos vãos (portas e janelas) numa fachada de uma estrutura ou de um edifício.
in scheme: Tesauro SIPA
preferred label: Fenestration @en
preferred label: Fenestrazione @it
broader: Atributos formais para a arquitetura

Modinatura
type: Concept
scope note: Forma como se desenvolvem as diferentes molduras de vãos ou elementos arquitetónicos num edifício ou numa estrutura.
in scheme: Tesauro SIPA
preferred label: Modinature (Moulding) @en
preferred label: Moulure @fr
preferred label: Modanatura @it
broader: Atributos formais para a arquitetura

Tipo de planta
type: Concept
in scheme: Tesauro SIPA
preferred label: Type of floor plan @en
preferred label: Type de plan d'étage @fr
preferred label: Tipo di pianta @it
broader: Atributos formais para a arquitetura
narrower: Planta axial
narrower: Planta basilical
narrower: Planta centralizada
narrower: Planta em cruz latina
narrower: Planta em estrela
narrower: Planta em H
narrower: Planta em L
narrower: Planta em U
narrower: Planta em T
narrower: Planta pavilhonada
narrower: Planta radial
narrower: Planta retangular
narrower: Planta trapezoidal

Planta axial
type: Concept
scope note: Edifício ou estrutura que, do ponto de vista planimétrico, se desenvolve segundo um eixo.
in scheme: Tesauro SIPA
preferred label: Axial plan @en
preferred label: Plan axial @fr
preferred label: Pianta assiale @it
broader: Tipo de planta

Planta basilical
type: Concept
in scheme: Tesauro SIPA
preferred label: Basilical plan @en
preferred label: Plan basilical @fr
preferred label: Pianta basilicale @it
broader: Tipo de planta

Planta centralizada
type: Concept
scope note: Edifício ou estrutura que, do ponto de vista planimétrico, se desenvolve em círculo, num octógono ou em cruz grega, criando um ponto ao centro, onde se intercetam todas as linhas que o constituem.
in scheme: Tesauro SIPA
preferred label: Centralized plan @en
preferred label: Plan centralisé @fr
preferred label: Pianta centralizzata @it
broader: Tipo de planta
narrower: Planta circular
narrower: Planta em cruz grega
narrower: Planta octogonal
narrower: Planta pentagonal
narrower: Planta quadrada

Planta circular
type: Concept
scope note: Tipo de planta centralizada, em que um edifício ou estrutura, do ponto de vista planimétrico. se desenvolve em círculo.
in scheme: Tesauro SIPA
preferred label: Circular plan @en
preferred label: Plan circulaire @fr
preferred label: Pianta circolare @it
broader: Planta centralizada

Planta em cruz grega
type: Concept
scope note: Tipo de planta centralizada aplicada a um edifício ou estrutura, o qual, do ponto de vista planimétrico, se desenvolve em cruz grega, composta por quatro braços de igual dimensão.
in scheme: Tesauro SIPA
preferred label: Greek cross plan @en
preferred label: Plan en croix grecque @fr
preferred label: Pianta a croce greca @it
broader: Planta centralizada

Planta octogonal
type: Concept
scope note: Tipo de planta centralizada aplicada a um edifício ou estrutura, o qual, do ponto de vista planimétrico, é composto por oito segmentos de reta e oito ângulos, formando um octógono.
in scheme: Tesauro SIPA
preferred label: Octagonal plan @en
preferred label: Plan octogonal @fr
preferred label: Pianta ottagonale @it
broader: Planta centralizada

Planta pentagonal
type: Concept
scope note: Tipo de planta centralizada aplicada a um edifício ou estrutura, o qual, do ponto de vista planimétrico, é composto por cinco segmentos de reta e cinco ângulos, formando um pentágono.
in scheme: Tesauro SIPA
preferred label: Pentagonal plan @en
preferred label: Plan pentagonal @fr
preferred label: Pianta pentagonale @it
broader: Planta centralizada

Planta quadrada
type: Concept
scope note: Tipo de planta centralizada aplicada a um edifício ou estrutura, o qual, do ponto de vista planimétrico, é composto por quatro segmentos de reta e quatro ângulos, formando um quadrado.
in scheme: Tesauro SIPA
preferred label: Square plan @en
preferred label: Plan carré @fr
preferred label: Pianta quadrata @it
broader: Planta centralizada

Planta em cruz latina
type: Concept
scope note: Edifício ou estrutura que, do ponto de vista planimétrico, se desenvolve em cruz latina, composta por quatro braços, três semelhantes e um deles, o inferior, de maiores dimensões.
in scheme: Tesauro SIPA
preferred label: Latin cross plan @en
preferred label: Plan en croix latine @fr
preferred label: Pianta a croce latina @it
broader: Tipo de planta

Planta em estrela
type: Concept
scope note: Tipo de planta centralizada aplicada a um edifício ou estrutura, o qual, do ponto de vista planimétrico, se desenvolve em forma de estrela.
in scheme: Tesauro SIPA
preferred label: Star plan @en
preferred label: Plan en étoile @fr
preferred label: Pianta a stella @it
broader: Tipo de planta

Planta em H
type: Concept
scope note: Edifício ou estrutura que, do ponto de vista planimétrico, é composto por dois braços paralelos unidos por um terceiro, formando um H.
in scheme: Tesauro SIPA
preferred label: H plan @en
preferred label: Plan en H @fr
preferred label: Pianta a H @it
broader: Tipo de planta

Planta em L
type: Concept
scope note: Edifício ou estrutura que, do ponto de vista planimétrico, é composto por dois segmentos de reta e um ângulo, formando um L.
in scheme: Tesauro SIPA
preferred label: L plan @en
preferred label: Plan en L @fr
preferred label: Pianta a L @it
broader: Tipo de planta

Planta em U
type: Concept
scope note: Edifício ou estrutura que, do ponto de vista planimétrico, se desenvolve em forma de U, com ângulos retos ou curvos.
in scheme: Tesauro SIPA
preferred label: U plan @en
preferred label: Plan en U @fr
preferred label: Pianta a U @it
broader: Tipo de planta

Planta em T
type: Concept
scope note: Edifício ou estrutura que, do ponto de vista planimétrico, é composto por dois braços perpendiculares, formando um T ou um Tau.
in scheme: Tesauro SIPA
preferred label: T plan @en
preferred label: Plan en T @fr
preferred label: Pianta a T @it
broader: Tipo de planta

Planta pavilhonada
type: Concept
scope note: Conjunto de edifícios dispostos de forma isolada, criando um conjunto de pavilhões.
in scheme: Tesauro SIPA
preferred label: Pavilioned plan @en
preferred label: Plan pavillonné @fr
preferred label: Pianta pavilionata @it
broader: Tipo de planta

Planta radial
type: Concept
scope note: Conjunto de edifícios dispostos em círculos, criando linhas concêntricas.
in scheme: Tesauro SIPA
preferred label: Radial plan @en
preferred label: Plan radial @fr
preferred label: Pianta radiale @it
broader: Tipo de planta

Planta retangular
type: Concept
scope note: Edifício ou estrutura que, do ponto de vista planimétrico, é composto por quatro segmentos de reta e quatro ângulos, dois deles paralelos e com maiores dimensões, formando um retângulo.
in scheme: Tesauro SIPA
preferred label: Retangular plan @en
preferred label: Plan rectangulaire @fr
preferred label: Pianta rettangolare @it
hidden label: Planta rectangular
broader: Tipo de planta

Planta trapezoidal
type: Concept
scope note: Edifício ou estrutura que, do ponto de vista planimétrico, é composto por quatro segmentos de reta e quatro ângulos, dois deles de dimensões distintas, unidas por dois segmentos oblíquos, formando um trapézio.
in scheme: Tesauro SIPA
preferred label: Trapezoidal plan @en
preferred label: Plan trapézoïdal @fr
preferred label: Pianta trapezoidale @it
broader: Tipo de planta

Atributos formais para a escultura
type: Concept
in scheme: Tesauro SIPA
preferred label: Formal attributes for sculpture @en
preferred label: Attributs formels pour la sculpture @fr
preferred label: Attributi formali per la scultura @it
broader: Atributos formais
narrower: Escultura segundo a superfície trabalhada
narrower: Escultura de vulto
narrower: Estatuária segundo a dimensão

Escultura segundo a superfície trabalhada
type: Concept
in scheme: Tesauro SIPA
preferred label: Sculpture according to the worked surface @en
preferred label: Sculpture selon la surface travaillée @fr
preferred label: Scultura secondo la superficie lavorata @it
broader: Atributos formais para a escultura

Escultura de vulto
type: Concept
scope note: Escultura que se apresenta trabalhada na íntegra ou, pelo menos, a 3/4 do volume real de um corpo ou de um objeto.
in scheme: Tesauro SIPA
preferred label: Sculpture in the round @en
preferred label: Sculpture en ronde-bosse @fr
preferred label: Scultura in tondo @it
broader: Atributos formais para a escultura
narrower: Escultura de meio vulto
narrower: Escultura de vulto a 3/4
narrower: Escultura de vulto pleno

Escultura de meio vulto
type: Concept
scope note: Tipo de escultura de vulto cujo volume corresponde apenas a metade do corpo ou do objeto que se pretende representar.
in scheme: Tesauro SIPA
preferred label: Half-round sculpture @en
preferred label: Sculpture en bas-relief @fr
preferred label: Scultura a mezzo rilievo @it
broader: Escultura de vulto

Escultura de vulto a 3/4
type: Concept
scope note: Tipo de escultura de vulto cujo volume corresponde apenas a 3/4 do volume real de um corpo ou de um objeto que pretende representar.
in scheme: Tesauro SIPA
preferred label: Three-quarter sculpture @en
preferred label: Sculpture en trois-quarts @fr
preferred label: Scultura a tre quarti @it
broader: Escultura de vulto

Escultura de vulto pleno
type: Concept
scope note: Tipo de escultura de vulto que se apresenta trabalhada na íntegra.
in scheme: Tesauro SIPA
preferred label: Full-round sculpture @en
preferred label: Sculpture en plein rond @fr
preferred label: Scultura a tutto tondo @it
broader: Escultura de vulto

Estatuária segundo a dimensão
type: Concept
in scheme: Tesauro SIPA
preferred label: Statues according to size @en
preferred label: Statuaire selon la dimension @fr
preferred label: Statue secondo la dimensione @it
broader: Atributos formais para a escultura
narrower: Estátua colossal
narrower: Estatueta
narrower: Metade do natural
narrower: Pequena escala
narrower: Tamanho natural

Estátua colossal
type: Concept
scope note: Escultura que se apresenta com dimensões muito superiores às dimensões naturais.
in scheme: Tesauro SIPA
preferred label: Colossal statue @en
preferred label: Statue colossale @fr
preferred label: Statua colossale @it
broader: Estatuária segundo a dimensão

Estatueta
type: Concept
scope note: Tipo de escultura de vulto, de reduzidas dimensões, com altura inferior a 25cm.
in scheme: Tesauro SIPA
preferred label: Statuette @en
preferred label: Statuetta @it
alternative label: Figurinha
broader: Estatuária segundo a dimensão

Metade do natural
type: Concept
in scheme: Tesauro SIPA
preferred label: Half life-size @en
preferred label: Moitié taille réelle @fr
preferred label: Mezza grandezza naturale @it
broader: Estatuária segundo a dimensão

Pequena escala
type: Concept
in scheme: Tesauro SIPA
preferred label: Small scale @en
preferred label: Petite échelle @fr
preferred label: Piccola scala @it
broader: Estatuária segundo a dimensão

Tamanho natural
type: Concept
in scheme: Tesauro SIPA
preferred label: Life-size @en
preferred label: Taille réelle @fr
preferred label: Grandezza naturale @it
broader: Estatuária segundo a dimensão

Atributos formais segundo o tipo
type: Concept
in scheme: Tesauro SIPA
preferred label: Formal attributes according to type @en
preferred label: Attributs formels selon le type @fr
preferred label: Attributi formali secondo il tipo @it
broader: Atributos formais
narrower: Atributos formais antropomórficos
narrower: Atributos formais fálicos
narrower: Atributos formais fitomórficos
narrower: Atributos formais geométricos
narrower: Atributos formais relacionados com a astronomia
narrower: Atributos formais zoomórficos

Atributos formais antropomórficos
type: Concept
scope note: Tipo de atributo que representa ou aparenta representar partes ou o todo do corpo humano
in scheme: Tesauro SIPA
preferred label: Anthropomorphic formal attributes @en
preferred label: Attributs formels anthropomorphiques @fr
preferred label: Attributi formali antropomorfici @it
broader: Atributos formais segundo o tipo
narrower: Denticulado

Denticulado
type: Concept
scope note: Elemento decorativo recortado, formando dentes.
in scheme: Tesauro SIPA
preferred label: Denticulated @en
preferred label: Denticulé @fr
preferred label: Dentellato @it
broader: Atributos formais antropomórficos

Atributos formais fálicos
type: Concept
in scheme: Tesauro SIPA
preferred label: Phallic formal attributes @en
preferred label: Attributs formels phalliques @fr
preferred label: Attributi formali fallici @it
broader: Atributos formais segundo o tipo

Atributos formais fitomórficos
type: Concept
scope note: Tipo de atributo que representa ou aparenta representar vegetação.
in scheme: Tesauro SIPA
preferred label: Phytomorphic formal attributes @en
preferred label: Attributs formels phytomorphiques @fr
preferred label: Attributi formali fitomorfici @it
broader: Atributos formais segundo o tipo
narrower: Abolotado
narrower: Acantado
narrower: Amendoado
narrower: Bolboso
narrower: Cauliforme
narrower: Flor-de-lisado
narrower: Floreado
narrower: Forma de pera
narrower: Gomado
narrower: Lobulado

Abolotado
type: Concept
scope note: Elemento decorativo ou objeto em forma de bolota.
in scheme: Tesauro SIPA
preferred label: Bulbous @en
preferred label: Bulbeux @fr
preferred label: Bombato @it
broader: Atributos formais fitomórficos

Acantado
type: Concept
scope note: Elemento decorativo ou objeto em forma de acanto.
in scheme: Tesauro SIPA
preferred label: Acanthus-like @en
preferred label: Acanthe @fr
broader: Atributos formais fitomórficos

Amendoado
type: Concept
scope note: Elemento decorativo ou objeto em forma de amêndoa.
in scheme: Tesauro SIPA
preferred label: Almond-shaped @en
preferred label: En forme d'amande @fr
preferred label: Amandorlato @it
broader: Atributos formais fitomórficos
narrower: Mandorla

Mandorla
type: Concept
scope note: Nimbo em forma de amêndoa, que envolve a figura de Cristo, normalmente entronizado, ou da Virgem. Pode aparecer na arte Paleocristã, mas divulga-se no período bizantino e no Românico.
in scheme: Tesauro SIPA
preferred label: Mandorle @fr
broader: Amendoado

Bolboso
type: Concept
scope note: Elemento arquitetónico, elemento decorativo ou objeto em forma de bolbo.
in scheme: Tesauro SIPA
preferred label: Bulbous @en
preferred label: Bulbeux @fr
preferred label: Bombato @it
broader: Atributos formais fitomórficos

Cauliforme
type: Concept
scope note: Elemento decorativo ou objeto em forma de flor-de-lis.
in scheme: Tesauro SIPA
preferred label: Cauliform @en
broader: Atributos formais fitomórficos

Flor-de-lisado
type: Concept
in scheme: Tesauro SIPA
preferred label: Fleur-de-lis-like @en
preferred label: Fleur-de-lisé @fr
preferred label: Fiore di giglio @it
broader: Atributos formais fitomórficos

Floreado
type: Concept
in scheme: Tesauro SIPA
preferred label: Floral @en
preferred label: Florale @fr
preferred label: Fiorato @it
broader: Atributos formais fitomórficos

Forma de pera
type: Concept
scope note: Elemento decorativo ou objeto em forma de pera.
in scheme: Tesauro SIPA
preferred label: Pear-shaped @en
preferred label: En forme de poire @fr
preferred label: A forma di pera @it
broader: Atributos formais fitomórficos

Gomado
type: Concept
scope note: Elemento decorativo ou objeto em forma de gomos.
in scheme: Tesauro SIPA
preferred label: Gum-like @en
preferred label: Gommeux @fr
preferred label: Gommoso @it
broader: Atributos formais fitomórficos

Lobulado
type: Concept
in scheme: Tesauro SIPA
preferred label: Lobed @en
preferred label: Lobé @fr
preferred label: Lobato @it
broader: Atributos formais fitomórficos
narrower: Trilobulado

Trilobulado
type: Concept
scope note: Elemento decorativo ou objeto em forma de três lóbulos.
in scheme: Tesauro SIPA
preferred label: Trilobed @en
preferred label: Trilobé @fr
preferred label: Trilobato @it
broader: Lobulado

Atributos formais geométricos
type: Concept
scope note: Tipo de atributo que representa ou aparenta representar formas ou objetos geométricos.
in scheme: Tesauro SIPA
preferred label: Geometric formal attributes @en
preferred label: Attributs formels géométriques @fr
preferred label: Attributi formali geometrici @it
broader: Atributos formais segundo o tipo
narrower: Figuras planas
narrower: Sólidos geométricos

Figuras planas
type: Concept
in scheme: Tesauro SIPA
preferred label: Flat figures @en
preferred label: Figures planes @fr
preferred label: Figure piane @it
broader: Atributos formais geométricos
narrower: Parábola
narrower: Circular
narrower: Cruciforme
narrower: Elíptico
narrower: Hiperbólico
narrower: Mistilíneo
narrower: Poligonal
narrower: Retilíneo
narrower: Ziguezagueado

Parábola
type: Concept
in scheme: Tesauro SIPA
preferred label: Parable @en
preferred label: Parabole @fr
preferred label: Parabola @it
broader: Figuras planas

Circular
type: Concept
scope note: Elemento decorativo ou representação em forma de círculo.
in scheme: Tesauro SIPA
preferred label: Circulaire @fr
preferred label: Circolare @it
broader: Figuras planas

Cruciforme
type: Concept
scope note: Elemento decorativo ou representação em forma de cruz, composto por dois segmentos que se intercetam.
in scheme: Tesauro SIPA
preferred label: Cruciform @en
broader: Figuras planas
narrower: Cruz segundo a forma

Cruz segundo a forma
type: Concept
in scheme: Tesauro SIPA
preferred label: Cross according to form @en
preferred label: Croix selon la forme @fr
preferred label: Croce secondo la forma @it
broader: Cruciforme
narrower: Crismon
narrower: Cruz aguçada
narrower: Cruz apontada
narrower: Cruz céltica
narrower: Cruz copta
narrower: Cruz de âncora
narrower: Cruz de Calatrava
narrower: Cruz de Cristo
narrower: Cruz de Malta
narrower: Cruz de Santiago
narrower: Cruz de Santo André
narrower: Cruz de São Pedro
narrower: Cruz egípcia
narrower: Cruz flor-de-lisada
narrower: Cruz florenciada
narrower: Cruz forquilhada
narrower: Cruz gamada
narrower: Cruz grega
narrower: Cruz lanceolada
narrower: Cruz latina
narrower: Cruz papal
narrower: Cruz pátea
narrower: Cruz patriarcal
narrower: Cruz pomeada
narrower: Cruz ponteaguda
narrower: Cruz potêntea
narrower: Cruz rasgada
narrower: Cruz recruzada
narrower: Cruz ressarcelada
narrower: Cruz rodeada
narrower: Cruz trevada
narrower: Tau
narrower: Tau bífida

Crismon
type: Concept
scope note: Tipo de cruz composta por dois braços oblíquos e um vertical, formando um P, constituindo o monograma paleocristão de Jesus Cristo, formado pelas letras X e P, utilizado a partir do século II. A partir do século IV, surge ladeado pelo Alfa e o Omega, primeira e última letras do alfabeto grego.
in scheme: Tesauro SIPA
preferred label: Crismone @it
broader: Cruz segundo a forma

Cruz aguçada
type: Concept
in scheme: Tesauro SIPA
preferred label: Spiked cross @en
preferred label: Croix à pointes @fr
preferred label: Croce acuminata @it
broader: Cruz segundo a forma

Cruz apontada
type: Concept
scope note: Cruz do tipo latino, cuja base termina em lanceta e as três hastes em polígono de quatro faces.
in scheme: Tesauro SIPA
preferred label: Pointed cross @en
preferred label: Croix pointue @fr
preferred label: Croce appuntita @it
broader: Cruz segundo a forma

Cruz céltica
type: Concept
scope note: Tipo de cruz composta por dois braços perpendiculares, de diferentes dimensões, com o transversal mais próximo do topo, tendo, a rodear a intersecção das hastes um círculo, símbolo solar.
in scheme: Tesauro SIPA
preferred label: Celtic cross @en
preferred label: Croix celtique @fr
preferred label: Croce celtica @it
broader: Cruz segundo a forma

Cruz copta
type: Concept
scope note: Tipo de cruz composta por quatro segmentos perpendiculares de iguais dimensões, interrompidos, ao centro, por um círculo, surgindo, em cada um dos vazios, uma cruz em T.
in scheme: Tesauro SIPA
preferred label: Coptic cross @en
preferred label: Croix copte @fr
preferred label: Croce copta @it
broader: Cruz segundo a forma

Cruz de âncora
type: Concept
scope note: Tipo de cruz composta por dois braços perpendiculares, de diferentes dimensões, com o transversal mais próximo do topo, encimado por um círculo, e tendo, na base, uma esfera, de onde saem dois braços curvos, formando o efeito de âncora.
in scheme: Tesauro SIPA
preferred label: Anchor cross @en
preferred label: Croix ancrée @fr
preferred label: Croce d'ancora @it
broader: Cruz segundo a forma

Cruz de Calatrava
type: Concept
scope note: Cruz do tipo latino, tendo as hastes a terminar em flores-de-lis.
in scheme: Tesauro SIPA
preferred label: Cross of Calatrava @en
preferred label: Croix de Calatrava @fr
preferred label: Croce di Calatrava @it
broader: Cruz segundo a forma

Cruz de Cristo
type: Concept
scope note: Cruz do tipo grego, cujas hastes terminam em pequenos trapézios.
in scheme: Tesauro SIPA
preferred label: Cross of Christ @en
preferred label: Croix du Christ @fr
preferred label: Croce di Cristo @it
broader: Cruz segundo a forma

Cruz de Malta
type: Concept
scope note: Cruz do tipo grego, com as hastes largas, tendo cada uma das faces côncava.
in scheme: Tesauro SIPA
preferred label: Maltese cross @en
preferred label: Croix de Malte @fr
preferred label: Croce di Malta @it
broader: Cruz segundo a forma

Cruz de Santiago
type: Concept
scope note: Cruz do tipo latino com as hastes lanceoladas ou com as hastes florenciadas, exceto o segmento da cruz vertical inferior, ele próprio em lança.
in scheme: Tesauro SIPA
preferred label: Cross of Saint James @en
preferred label: Croix de Saint-Jacques @fr
preferred label: Croce di San Giacomo @it
broader: Cruz segundo a forma

Cruz de Santo André
type: Concept
scope note: Tipo de cruz composta por dois braços oblíquos.
in scheme: Tesauro SIPA
preferred label: Saint Andrew’s cross @en
preferred label: Croix de Saint-André @fr
preferred label: Croce di Sant’Andrea @it
broader: Cruz segundo a forma

Cruz de São Pedro
type: Concept
scope note: Tipo de cruz composta por dois braços perpendiculares, de diferentes dimensões, com o transversal mais próximo da base.
in scheme: Tesauro SIPA
preferred label: Cross of Saint Peter @en
preferred label: Croix de Saint Pierre @fr
preferred label: Croce di San Pietro @it
broader: Cruz segundo a forma

Cruz egípcia
type: Concept
scope note: Tipo de cruz composta por dois braços perpendiculares, de diferentes dimensões, com o transversal mais próximo do topo, rematado por um círculo.
in scheme: Tesauro SIPA
preferred label: Egyptian cross (Ankh) @en
preferred label: Croix égyptienne (Ankh) @fr
preferred label: Croce egizia (Ankh) @it
broader: Cruz segundo a forma

Cruz flor-de-lisada
type: Concept
scope note: Cruz do tipo grego, cujas hastes terminam em flores-de-lis, podendo apresentar-se estilizadas.
in scheme: Tesauro SIPA
preferred label: Fleur-de-lis cross @en
preferred label: Croix fleurdelisée @fr
preferred label: Croce gigliata @it
broader: Cruz segundo a forma

Cruz florenciada
type: Concept
scope note: Cruz do tipo grego, com as hastes largas, tendo cada uma das faces côncavas e terminadas em recorte.
in scheme: Tesauro SIPA
preferred label: Florentine cross @en
preferred label: Croix florencée @fr
preferred label: Croce fiorentina @it
broader: Cruz segundo a forma

Cruz forquilhada
type: Concept
scope note: Cruz do tipo grego, com as hastes a terminar em forquilha.
in scheme: Tesauro SIPA
preferred label: Forked cross @en
preferred label: Croix fourchue @fr
broader: Cruz segundo a forma

Cruz gamada
type: Concept
scope note: Tipo de cruz composta por dois braços perpendiculares, de iguais dimensões, prolongados, em cada um dos extremos, por um segmento virado para o lado direito, pretendendo reproduzir o movimento solar. No século XX, foi aproveitada para identificar os membros que apoiavam o movimento nazi.
in scheme: Tesauro SIPA
preferred label: Swastika cross @en
preferred label: Croix gammée @fr
broader: Cruz segundo a forma

Cruz grega
type: Concept
scope note: Tipo de cruz composta por dois braços perpendiculares de iguais dimensões.
in scheme: Tesauro SIPA
preferred label: Greek cross @en
preferred label: Croix grecque @fr
preferred label: Croce greca @it
broader: Cruz segundo a forma

Cruz lanceolada
type: Concept
scope note: Cruz do tipo grego ou latino, com as hastes a terminar em triângulos.
in scheme: Tesauro SIPA
preferred label: Lanceolate cross @en
preferred label: Croix lancéolée @fr
preferred label: Croce lanceolata @it
broader: Cruz segundo a forma

Cruz latina
type: Concept
scope note: Tipo de cruz composta por dois braços perpendiculares, de diferentes dimensões, com o transversal no topo (cruz commissa) ou mais abaixo (cruz immisa), que servia de instrumento de tortura entre os Romanos, tendo sido utilizada para crucificar Jesus Cristo, tendo inspirado a forma de alguns templos católicos, especialmente durante a Idade Média e o período Contrarreformista.
in scheme: Tesauro SIPA
preferred label: Latin cross @en
preferred label: Croix latine @fr
preferred label: Croce latina @it
broader: Cruz segundo a forma

Cruz papal
type: Concept
scope note: Cruz composta por quatro braços, um vertical, com três transversais, que diminuem de tamanho da base para o topo.
in scheme: Tesauro SIPA
preferred label: Papal cross @en
preferred label: Croix papale @fr
preferred label: Croce papale @it
broader: Cruz segundo a forma

Cruz pátea
type: Concept
scope note: Cruz do tipo grego, composta por hastes largas, com os lados côncavos e os topos convexos.
in scheme: Tesauro SIPA
preferred label: Pattee cross @en
preferred label: Croix pattée @fr
preferred label: Croce patente @it
broader: Cruz segundo a forma

Cruz patriarcal
type: Concept
scope note: Tipo de cruz composta por três braços, um vertical e dois perpendiculares, junto aos topos.
in scheme: Tesauro SIPA
preferred label: Patriarchal cross @en
preferred label: Croix patriarcale @fr
preferred label: Croce patriarcale @it
broader: Cruz segundo a forma

Cruz pomeada
type: Concept
scope note: Cruz do tipo grego ou latino, com as hastes a terminar em círculos.
in scheme: Tesauro SIPA
preferred label: Pommeled cross @en
preferred label: Croix pommetée @fr
preferred label: Croce pomata @it
broader: Cruz segundo a forma

Cruz ponteaguda
type: Concept
scope note: Cruz do tipo grego, com as hastes a terminar em lanças.
in scheme: Tesauro SIPA
preferred label: Pointed cross @en
preferred label: Croix pointue @fr
preferred label: Croce appuntita @it
broader: Cruz segundo a forma

Cruz potêntea
type: Concept
scope note: Tipo de cruz composta por quatro braços de dimensões iguais, perpendiculares, cada um deles, com um braço transversal no topo.
in scheme: Tesauro SIPA
preferred label: Potent cross @en
preferred label: Croix potencée @fr
preferred label: Croce potenziata @it
broader: Cruz segundo a forma

Cruz rasgada
type: Concept
scope note: Tipo de cruz composta por oito segmentos de dimensões iguais, formando dois braços, ambos em aspa.
in scheme: Tesauro SIPA
preferred label: Raguled cross @en
preferred label: Croix écotée @fr
preferred label: Croce scorzata @it
broader: Cruz segundo a forma

Cruz recruzada
type: Concept
scope note: Tipo de cruz com dois braços perpendiculares, de iguais dimensões, tendo uma travessa no topo de cada um deles.
in scheme: Tesauro SIPA
preferred label: Cross crosslet @en
preferred label: Croix recroisetée @fr
preferred label: Croce recrociata @it
broader: Cruz segundo a forma

Cruz ressarcelada
type: Concept
scope note: Cruz do tipo grego ou latino, com os extremos terminados por duas esferas adossadas.
in scheme: Tesauro SIPA
preferred label: Sarcelled cross @en
preferred label: Croix sarcelée @fr
preferred label: Croce sarcellata @it
broader: Cruz segundo a forma

Cruz rodeada
type: Concept
scope note: Tipo de cruz composta por oito segmentos, de iguais dimensões e dispostos de forma radiante
in scheme: Tesauro SIPA
preferred label: Ringed cross encircled @en
preferred label: Croix cerclée @fr
preferred label: Croce cerchiata @it
broader: Cruz segundo a forma

Cruz trevada
type: Concept
scope note: Cruz do tipo latino ou grego com as hastes a terminar em trifólios.
in scheme: Tesauro SIPA
preferred label: Trefoil cross @en
preferred label: Croix trèflée @fr
preferred label: Croce trifogliata @it
broader: Cruz segundo a forma

Tau
type: Concept
scope note: Tipo de cruz composta por dois braços, o transversal colocado no topo.
in scheme: Tesauro SIPA
preferred label: Tau Cross @en
preferred label: Croix de Tau @fr
preferred label: Croce Tau @it
broader: Cruz segundo a forma

Tau bífida
type: Concept
scope note: Tipo de cruz composta por três braços, um vertical, de cujo topo, saem dois divergentes e oblíquos.
in scheme: Tesauro SIPA
preferred label: Bifid Tau @en
preferred label: Tau bifide @fr
preferred label: Tau bifido @it
broader: Cruz segundo a forma

Elíptico
type: Concept
scope note: Elemento decorativo ou representação em forma de elipse.
in scheme: Tesauro SIPA
preferred label: Elliptical @en
preferred label: Elliptique @fr
preferred label: Ellittico @it
alternative label: Oblongo
broader: Figuras planas

Hiperbólico
type: Concept
scope note: Elemento decorativo ou representação em forma de hipérbole.
in scheme: Tesauro SIPA
preferred label: Hiperboloyd @en
preferred label: Hyperbolique @fr
preferred label: Iperbolico @it
broader: Figuras planas

Mistilíneo
type: Concept
scope note: Elemento decorativo ou representação que integra linhas curvas e retas.
in scheme: Tesauro SIPA
preferred label: Curvilinear-composite (Mixed-line) @en
preferred label: Curvilinéaire mixte @fr
preferred label: Mistilineo @it
broader: Figuras planas

Poligonal
type: Concept
scope note: Elemento decorativo ou representação de uma forma geométrica fechada, formada por vários segmentos de reta e vários ângulos.
in scheme: Tesauro SIPA
preferred label: Polygonal @en
preferred label: Poligonale @it
broader: Figuras planas
narrower: Hexagonal
narrower: Octogonal
narrower: Pentagonal
narrower: Quadrangular
narrower: Semicircular
narrower: Retangular
narrower: Trapezoidal
narrower: Triangular

Hexagonal
type: Concept
scope note: Elemento decorativo ou representação de uma forma geométrica fechada, composta por seis segmentos de reta e seis ângulos.
in scheme: Tesauro SIPA
preferred label: Esagonale @it
broader: Poligonal

Octogonal
type: Concept
scope note: Elemento decorativo ou representação de uma forma geométrica fechada, composta por oito segmentos de reta e oito ângulos.
in scheme: Tesauro SIPA
preferred label: Ottagonale @it
broader: Poligonal

Pentagonal
type: Concept
scope note: Elemento decorativo ou representação de uma forma geométrica fechada, composta por cinco segmentos de reta e cinco ângulos.
in scheme: Tesauro SIPA
preferred label: Pentagonale @it
broader: Poligonal

Quadrangular
type: Concept
scope note: Elemento decorativo ou representação de uma forma geométrica fechada, composta por quatro segmentos de reta todos iguais e quatro ângulos.
in scheme: Tesauro SIPA
preferred label: Quadrangular (Four-sided) @en
preferred label: Quadrangulaire @fr
preferred label: Quadrangolare @it
broader: Poligonal

Semicircular
type: Concept
scope note: Elemento decorativo ou representação de uma forma hemisférica.
in scheme: Tesauro SIPA
preferred label: Semi-circulaire @fr
preferred label: Semicircolare @it
broader: Poligonal

Retangular
type: Concept
scope note: Elemento decorativo ou representação de uma forma geométrica fechada, composto por quatro segmentos de reta, iguais dois a dois, e quatro ângulos.
in scheme: Tesauro SIPA
preferred label: Rectangular @en
preferred label: Rectangulaire @fr
preferred label: Rettangolare @it
hidden label: Rectangular
broader: Poligonal

Trapezoidal
type: Concept
scope note: Elemento decorativo ou representação de uma forma geométrica fechada, em forma de trapézio.
in scheme: Tesauro SIPA
preferred label: Trapézoïdal @fr
preferred label: Trapezoidale @it
broader: Poligonal

Triangular
type: Concept
scope note: Elemento decorativo ou representação de uma forma geométrica fechada, em forma de triângulo.
in scheme: Tesauro SIPA
preferred label: Triangulaire @fr
preferred label: Triangolare @it
broader: Poligonal

Retilíneo
type: Concept
scope note: Elemento decorativo ou representação que forma uma linha ou um segmento de reta.
in scheme: Tesauro SIPA
preferred label: Rectilinear @en
preferred label: Rectiligne @fr
preferred label: Rettilineo @it
hidden label: Rectilíneo
broader: Figuras planas

Ziguezagueado
type: Concept
scope note: Elemento decorativo disposto em ziguezague, formando ângulos quebrados alternadamente salientes e reentrantes.
in scheme: Tesauro SIPA
preferred label: Zigzagged @en
preferred label: En zigzag @fr
broader: Figuras planas

Sólidos geométricos
type: Concept
scope note: Objetos ou representações de sólidos geométricos
in scheme: Tesauro SIPA
preferred label: Solid forms @en
preferred label: Solides @fr
preferred label: Solidi @it
broader: Atributos formais geométricos
narrower: Boleado
narrower: Cónico
narrower: Cúbico
narrower: Esférico
narrower: Hemisférico
narrower: Obcónico
narrower: Paralelepipédico
narrower: Piramidal
narrower: Prismático
narrower: Tubular

Boleado
type: Concept
scope note: Objeto ou representação que apresenta uma forma redonda ou de bola.
in scheme: Tesauro SIPA
preferred label: Bulbous @en
preferred label: Bombato @it
preferred label: Arrondi (Mouluré) @fr
broader: Sólidos geométricos

Cónico
type: Concept
scope note: Objeto ou representação que apresenta uma forma de cone.
in scheme: Tesauro SIPA
preferred label: Conical @en
preferred label: Conique @fr
preferred label: Conico @it
broader: Sólidos geométricos

Cúbico
type: Concept
scope note: Objeto ou representação em forma de sólido geométrico com todas as faces iguais.
in scheme: Tesauro SIPA
preferred label: Cubic @en
preferred label: Cubique @fr
preferred label: Cubico @it
broader: Sólidos geométricos

Esférico
type: Concept
scope note: Objeto ou representação em forma de esfera.
in scheme: Tesauro SIPA
preferred label: Spherical @en
preferred label: Sphérique @fr
preferred label: Sferico @it
broader: Sólidos geométricos

Hemisférico
type: Concept
scope note: Objeto ou representação em forma de meia laranja.
in scheme: Tesauro SIPA
preferred label: Hemispherical @en
preferred label: Hémisphérique @fr
preferred label: Semisferico @it
broader: Sólidos geométricos

Obcónico
type: Concept
scope note: Objeto ou elemento decorativo em forma de coração invertido.
in scheme: Tesauro SIPA
preferred label: Obconical @en
preferred label: Obconique @fr
preferred label: Obconico @it
broader: Sólidos geométricos

Paralelepipédico
type: Concept
scope note: Objeto ou representação em forma de sólido geométrico de seis faces, sendo que duas são idênticas e paralelas entre si, distintas das demais quatro faces.
in scheme: Tesauro SIPA
preferred label: Parallelepipedal @en
preferred label: Parallélépipédique @fr
broader: Sólidos geométricos

Piramidal
type: Concept
scope note: Objeto ou representação em forma de pirâmide.
in scheme: Tesauro SIPA
preferred label: Pyramidal @en
preferred label: Piramidale @it
broader: Sólidos geométricos

Prismático
type: Concept
scope note: Objeto ou representação em forma de sólido geométrico com bases poligonais paralelas e faces laterais formadas por paralelogramos.
in scheme: Tesauro SIPA
preferred label: Prismatic @en
preferred label: Prismatique @fr
preferred label: Prismatico @it
broader: Sólidos geométricos

Tubular
type: Concept
scope note: Objeto ou representação em forma de tubo.
in scheme: Tesauro SIPA
preferred label: Tubulaire @fr
preferred label: Tubolare @it
broader: Sólidos geométricos

Atributos formais relacionados com a astronomia
type: Concept
scope note: Tipo de atributo que representa ou aparenta representar elementos ligados à astronomia,
in scheme: Tesauro SIPA
preferred label: Formal attributes related to astronomy @en
preferred label: Attributs formels relatifs à l'astronomie @fr
preferred label: Attributi formali in relazione all'astronomia @it
broader: Atributos formais segundo o tipo
narrower: Estrelado
narrower: Meia-lua

Estrelado
type: Concept
scope note: Objeto, elemento decorativo ou representação em forma de estrela.
in scheme: Tesauro SIPA
preferred label: Star-shaped @en
preferred label: Étoilé @fr
preferred label: Stellato @it
broader: Atributos formais relacionados com a astronomia

Meia-lua
type: Concept
scope note: Objeto, elemento decorativo ou representação em forma de meia-lua, constituída por duas faces e dois flancos, com a gola recuada para o interior normalmente em formato de crescente.
in scheme: Tesauro SIPA
preferred label: Crescent-shaped (Mezzaluna) @en
preferred label: Croissant (Mezzaluna) @fr
preferred label: Mezzaluna @it
broader: Atributos formais relacionados com a astronomia

Atributos formais zoomórficos
type: Concept
scope note: Tipo de atributo que representa ou aparenta representar elementos ligados ao reino animal.
in scheme: Tesauro SIPA
preferred label: Formal zoomorphic attributes @en
preferred label: Attributs formels zoomorphiques @fr
preferred label: Attributi formali zoomorfi @it
broader: Atributos formais segundo o tipo
narrower: Alveolado
narrower: Concheado
narrower: Ovalado
narrower: Perlado
narrower: Vermiculado

Alveolado
type: Concept
in scheme: Tesauro SIPA
preferred label: Honeycombed @en
preferred label: Alvéolé @fr
preferred label: Alveolato @it
broader: Atributos formais zoomórficos

Concheado
type: Concept
scope note: Objeto, elemento decorativo ou representação em forma de concha. A concha pode apresentar-se completa, denominando-se vieira, ou em fragmentos assimétricos, assumindo a denominação de rocalha.
in scheme: Tesauro SIPA
preferred label: Shell-shaped @en
preferred label: Coquillé @fr
preferred label: Conchigliato @it
broader: Atributos formais zoomórficos

Ovalado
type: Concept
scope note: Objeto, elemento decorativo ou representação em forma de ovo.
in scheme: Tesauro SIPA
preferred label: Oval-shaped @en
preferred label: Ovale @fr
preferred label: Ovalato @it
broader: Atributos formais zoomórficos

Perlado
type: Concept
scope note: Objeto, elemento decorativo ou representação em forma de pérola, dispostas em sequência.
in scheme: Tesauro SIPA
preferred label: Beaded @en
preferred label: Perlé @fr
preferred label: Perlato @it
broader: Atributos formais zoomórficos

Vermiculado
type: Concept
in scheme: Tesauro SIPA
preferred label: Vermiculated @en
preferred label: Vermiculé @fr
preferred label: Vermicolato @it
broader: Atributos formais zoomórficos

Atributos formais segundo a relação
type: Concept
in scheme: Tesauro SIPA
preferred label: Formal attributes according to relationship @en
preferred label: Attributs formels selon la relation @fr
preferred label: Attributi formali secondo la relazione @it
broader: Atributos formais
narrower: Agregação
narrower: Agrupamento
narrower: Alinhamento (Atributos formais segundo a relação)
narrower: Andaina
narrower: Antecoluna
narrower: Apoio
narrower: Assimétrico
narrower: Em eixo
narrower: Fiada
narrower: Fileira
narrower: Intercolúnio

Agregação
type: Concept
in scheme: Tesauro SIPA
preferred label: Aggregation @en
preferred label: Agrégation @fr
preferred label: Aggregazione @it
broader: Atributos formais segundo a relação

Agrupamento
type: Concept
scope note: Termo aplicado à forma da disposição de colunas, tendo em consideração o número de colunas empregues, neste caso, em grupos de duas ou três.
in scheme: Tesauro SIPA
preferred label: Grouping @en
preferred label: Regroupement @fr
preferred label: Raggruppamento @it
broader: Atributos formais segundo a relação

Alinhamento (Atributos formais segundo a relação)
type: Concept
scope note: Colocação de estruturas ou elementos arquitetónicos ou decorativos segundo uma linha.
in scheme: Tesauro SIPA
preferred label: Alignment (Formal attributes according to relationship ) @en
preferred label: Alignement (Attributs formels selon la relation) @fr
preferred label: Allineamento (Attributi formali secondo la relazione) @it
broader: Atributos formais segundo a relação

Andaina
type: Concept
scope note: Fileira de esculturas ou elementos decorativos colocados no mesmo plano.
in scheme: Tesauro SIPA
preferred label: Sequence @en
preferred label: Enfilade @fr
preferred label: Andana @it
broader: Atributos formais segundo a relação

Antecoluna
type: Concept
scope note: Coluna isolada de um agrupamento de colunas, implantada na zona frontal de um edifício.
in scheme: Tesauro SIPA
preferred label: Pseudocolumn @en
preferred label: Pseudocolonne @fr
preferred label: Pseudocolonna @it
broader: Atributos formais segundo a relação

Apoio
type: Concept
in scheme: Tesauro SIPA
preferred label: Support @en
preferred label: Appui @fr
preferred label: Appoggio @it
broader: Atributos formais segundo a relação

Assimétrico
type: Concept
scope note: Estrutura ou elemento cujos componentes não são semelhantes a partir de um eixo imaginário central.
in scheme: Tesauro SIPA
preferred label: Asymmetrical @en
preferred label: Asymétrique @fr
preferred label: Asimmetrico @it
broader: Atributos formais segundo a relação

Em eixo
type: Concept
scope note: Elementos dispostos segundo uma linha reta, real ou imaginária.
in scheme: Tesauro SIPA
preferred label: On axis @en
preferred label: Dans l’axe @fr
preferred label: Assiale @it
broader: Atributos formais segundo a relação

Fiada
type: Concept
scope note: Conjunto de elementos de dimensões idênticas dispostos linearmente.
in scheme: Tesauro SIPA
preferred label: Course (Masonry) @en
preferred label: Assise (Maçonnerie) @fr
preferred label: Corso (Muratura) @it
broader: Atributos formais segundo a relação

Fileira
type: Concept
scope note: Conjunto de elementos semelhantes ou não que se dispõem linearmente.
in scheme: Tesauro SIPA
preferred label: Row @en
preferred label: Rangée @fr
preferred label: Fila @it
broader: Atributos formais segundo a relação

Intercolúnio
type: Concept
scope note: Espaço existente entre duas colunas.
in scheme: Tesauro SIPA
preferred label: Intercolumniation @en
preferred label: Intercolonnement @fr
preferred label: Intercolumnio @it
broader: Atributos formais segundo a relação
narrower: Intercolúnio segundo a dimensão

Intercolúnio segundo a dimensão
type: Concept
in scheme: Tesauro SIPA
preferred label: Intercolumniation by spacing @en
preferred label: Intercolonnement selon l’écartement @fr
preferred label: Intercolumnio secondo la distanza @it
broader: Intercolúnio
narrower: Areóstilo
narrower: Diástilo
narrower: Eustilo
narrower: Picnóstilo
narrower: Sistilo

Areóstilo
type: Concept
scope note: Espaço existente entre duas colunas correspondente a quatro diâmetros das mesmas.
in scheme: Tesauro SIPA
preferred label: Araeostyle @en
preferred label: Aréostyle @fr
preferred label: Areostilo @it
broader: Intercolúnio segundo a dimensão

Diástilo
type: Concept
scope note: Espaço existente entre duas colunas correspondente a três diâmetros das mesmas.
in scheme: Tesauro SIPA
preferred label: Diastyle @en
preferred label: Diastilo @it
broader: Intercolúnio segundo a dimensão

Eustilo
type: Concept
scope note: Espaço existente entre duas colunas correspondente a dois diâmetros e um quarto das mesmas.
in scheme: Tesauro SIPA
preferred label: Eustyle @en
broader: Intercolúnio segundo a dimensão

Picnóstilo
type: Concept
scope note: Espaço existente entre duas colunas correspondente a um diâmetro e meio das mesmas.
in scheme: Tesauro SIPA
preferred label: Pycnostyle @en
preferred label: Picnostilo @it
broader: Intercolúnio segundo a dimensão

Sistilo
type: Concept
scope note: Espaço existente entre duas colunas correspondente a dois diâmetros das mesmas.
in scheme: Tesauro SIPA
preferred label: Systyle @en
broader: Intercolúnio segundo a dimensão

Atributos formais segundo o estado de conservação
type: Concept
in scheme: Tesauro SIPA
preferred label: Formal attributes according to conservation state @en
preferred label: Attributs formels selon l’état de conservation @fr
preferred label: Attributi formali secondo lo stato di conservazione @it
broader: Atributos formais
narrower: Arruinado
narrower: Descolado
narrower: Íntegro
narrower: Fragmentado
narrower: Partido (Atributos formais segundo o estado de conservação)
narrower: Truncado

Arruinado
type: Concept
in scheme: Tesauro SIPA
preferred label: Ruined @en
preferred label: En ruine @fr
preferred label: Rovinato @it
broader: Atributos formais segundo o estado de conservação

Descolado
type: Concept
in scheme: Tesauro SIPA
preferred label: Detached @en
preferred label: Décollé @fr
preferred label: Distaccato @it
broader: Atributos formais segundo o estado de conservação

Íntegro
type: Concept
in scheme: Tesauro SIPA
preferred label: Intact @en
preferred label: Integro @it
broader: Atributos formais segundo o estado de conservação

Fragmentado
type: Concept
in scheme: Tesauro SIPA
preferred label: Fragmented @en
preferred label: Fragmenté @fr
preferred label: Frammentato @it
broader: Atributos formais segundo o estado de conservação

Partido (Atributos formais segundo o estado de conservação)
type: Concept
in scheme: Tesauro SIPA
preferred label: Broken (Formal attributes according to conservation state ) @en
preferred label: Brisé (Attributs formels selon l’état de conservation) @fr
preferred label: Rotto (Attributi formali secondo lo stato di conservazione) @it
broader: Atributos formais segundo o estado de conservação

Truncado
type: Concept
in scheme: Tesauro SIPA
preferred label: Truncated @en
preferred label: Tronqué @fr
preferred label: Troncato @it
broader: Atributos formais segundo o estado de conservação

Atributos formais segundo o perfil
type: Concept
in scheme: Tesauro SIPA
preferred label: Formal attributes according to profile @en
preferred label: Attributs formels selon le profil @fr
preferred label: Attributi formali secondo il profilo @it
broader: Atributos formais
narrower: Almofadado
narrower: Biselado
narrower: Cambado
narrower: Capialçado
narrower: Chanfrado
narrower: Côncavo
narrower: Convexo
narrower: Espiralado
narrower: Galbado
narrower: Torneado

Almofadado
type: Concept
in scheme: Tesauro SIPA
preferred label: Cushioned @en
preferred label: Bosselé @fr
preferred label: Bugnato @it
broader: Atributos formais segundo o perfil

Biselado
type: Concept
scope note: Elemento arquitetónico ou decorativo apresentando um corte oblíquo na(s) aresta(s).
in scheme: Tesauro SIPA
preferred label: Beveled @en
preferred label: Biseauté @fr
preferred label: Bisellato @it
broader: Atributos formais segundo o perfil

Cambado
type: Concept
in scheme: Tesauro SIPA
preferred label: Warped @en
preferred label: Tordu @fr
preferred label: Incurvato @it
broader: Atributos formais segundo o perfil

Capialçado
type: Concept
scope note: Atributo aplicado a um vão, quando ostenta uma inclinação oblíqua no interior ou no exterior, permitindo iluminar os espaços ou com mero propósito decorativo.
in scheme: Tesauro SIPA
preferred label: Projecting lintel @en
preferred label: Lintel saillant @fr
preferred label: Capialto @it
broader: Atributos formais segundo o perfil

Chanfrado
type: Concept
scope note: Elemento arquitetónico ou decorativo que apresenta os ângulos ou arestas seccionados.
in scheme: Tesauro SIPA
preferred label: Chamfered @en
preferred label: Chanfreiné @fr
preferred label: Smussato @it
broader: Atributos formais segundo o perfil

Côncavo
type: Concept
scope note: Elemento arquitetónico ou decorativo que apresenta uma depressão arredondada.
in scheme: Tesauro SIPA
preferred label: Concave @en
preferred label: Concavo @it
broader: Atributos formais segundo o perfil

Convexo
type: Concept
scope note: Elemento arquitetónico ou decorativo que apresenta uma saliência arredondada.
in scheme: Tesauro SIPA
preferred label: Convex @en
preferred label: Convexe @fr
preferred label: Convesso @it
broader: Atributos formais segundo o perfil

Espiralado
type: Concept
scope note: Elemento arquitetónico ou decorativo em forma de espiral.
in scheme: Tesauro SIPA
preferred label: Spiraled (Helical) @en
preferred label: En spirale @fr
preferred label: Elicoidale @it
broader: Atributos formais segundo o perfil

Galbado
type: Concept
in scheme: Tesauro SIPA
preferred label: Curved (Contoured ) @en
preferred label: Galbé @fr
preferred label: Sagomato @it
broader: Atributos formais segundo o perfil

Torneado
type: Concept
scope note: Elemento arquitetónico ou decorativo que parece ter sido desbastado no torno, ficando com formas curvas.
in scheme: Tesauro SIPA
preferred label: Turned (Lathe-turned) @en
preferred label: Tourné (Au tour) @fr
preferred label: Tornito @it
broader: Atributos formais segundo o perfil

Atributos formais segundo o posicionamento
type: Concept
in scheme: Tesauro SIPA
preferred label: Formal attributes according to positioning @en
preferred label: Attributs formels selon la disposition @fr
preferred label: Attributi formali secondo la posizione @it
broader: Atributos formais
narrower: Anfipróstilo
narrower: Decástilo
narrower: Dióstilo
narrower: Díptero
narrower: Hexastilo
narrower: Períptero
narrower: Pseudodíptero
narrower: Pseudoperíptero
narrower: Tetrástilo
related: Coluna
modified: 2025-09-23T13:22:14

Anfipróstilo
type: Concept
scope note: Categorização de um edifício clássico relativamente à forma como as colunas estão dispostas, neste caso, ostentando colunas apenas nas fachadas extremas.
in scheme: Tesauro SIPA
preferred label: Amphyprostyle @en
broader: Atributos formais segundo o posicionamento

Decástilo
type: Concept
scope note: Fachada ou templo clássico que ostenta dez colunas.
in scheme: Tesauro SIPA
preferred label: Decastyle @en
preferred label: Décastyle @fr
broader: Atributos formais segundo o posicionamento

Dióstilo
type: Concept
scope note: Templo ou edifício clássico com duas colunas na fachada.
in scheme: Tesauro SIPA
preferred label: Distyle @en
broader: Atributos formais segundo o posicionamento

Díptero
type: Concept
scope note: Categorização de um edifício clássico relativamente à forma como as colunas estão dispostas, neste caso, rodeado por duas fiadas de colunas.
in scheme: Tesauro SIPA
preferred label: Dipteral @en
preferred label: Diptère @fr
broader: Atributos formais segundo o posicionamento

Hexastilo
type: Concept
scope note: Templo ou edifício clássico com seis colunas na fachada.
in scheme: Tesauro SIPA
preferred label: Hexastyle @en
broader: Atributos formais segundo o posicionamento

Períptero
type: Concept
scope note: Categorização de um edifício clássico relativamente à forma como as colunas estão dispostas, neste caso rodeado por uma fiada de colunas.
in scheme: Tesauro SIPA
preferred label: Peripteral @en
preferred label: Périptère @fr
broader: Atributos formais segundo o posicionamento
narrower: Períptero redondo

Períptero redondo
type: Concept
scope note: Categorização de um edifício clássico de planta circular, relativamente à forma como as colunas estão dispostas, neste caso rodeado por uma fiada de colunas.
in scheme: Tesauro SIPA
preferred label: Round peripteral @en
preferred label: Périptère rond @fr
broader: Períptero

Pseudodíptero
type: Concept
scope note: Categorização de um edifício clássico de planta circular, relativamente à forma como as colunas estão dispostas, neste caso rodeado por duas fiadas de colunas apenas nas fachadas mais estreitas e com uma fila nas laterais, com as colunas muito espaçadas.
in scheme: Tesauro SIPA
preferred label: Pseudodipteral @en
preferred label: Pseudodiptère @fr
broader: Atributos formais segundo o posicionamento

Pseudoperíptero
type: Concept
scope note: Categorização de um edifício clássico de planta circular, relativamente à forma como as colunas estão dispostas, neste caso rodeado de colunas, as laterais adossadas ou encostadas às paredes exteriores do edifício.
in scheme: Tesauro SIPA
preferred label: Pseudoperipteral @en
preferred label: Pseudopériptère @fr
broader: Atributos formais segundo o posicionamento

Tetrástilo
type: Concept
scope note: Templo ou edifício clássico, em que as colunas laterais se adossam ou encostam às paredes exteriores do edifício
in scheme: Tesauro SIPA
preferred label: Tetrastyle @en
preferred label: Tétrastyle @fr
preferred label: Tetrastilo @it
broader: Atributos formais segundo o posicionamento

Formato
type: Concept
scope note: Templo ou edifício clássico com quatro colunas na fachada.
in scheme: Tesauro SIPA
preferred label: Format @en
broader: Atributos formais
narrower: Formato analógico
narrower: Formato digital
narrower: Grandes formatos

Formato analógico
type: Concept
in scheme: Tesauro SIPA
preferred label: Analog format @en
preferred label: Format analogique @fr
preferred label: Formato analogico @it
broader: Formato
narrower: Formato do desenho

Formato do desenho
type: Concept
in scheme: Tesauro SIPA
preferred label: Drawing format @en
preferred label: Format du dessin @fr
preferred label: Formato del disegno @it
broader: Formato analógico
narrower: A0
narrower: A1
narrower: A2
narrower: A3
narrower: A4
narrower: A5
narrower: Rolo

A0
type: Concept
scope note: É o maior formato de papel da classe A, constituindo a base de todos os outros, conforme o ISO 216. Uma folha A0 corresponde a um metro quadrado exato de papel: 84,1 cm x 118,9 cm.
in scheme: Tesauro SIPA
broader: Formato do desenho

A1
type: Concept
scope note: É o segundo formato de papel da classe A, conforme o ISO 216. Duas folhas A1 correspondem a um A0: 59,4 cm x 8,41 cm.
in scheme: Tesauro SIPA
broader: Formato do desenho

A2
type: Concept
scope note: É o terceiro formato de papel da classe A, conforme o ISO 216. Quatro folhas A2 correspondem a um A0: 4,2 cm x 5,94 cm.
in scheme: Tesauro SIPA
broader: Formato do desenho

A3
type: Concept
scope note: É o quarto formato de papel da classe A, conforme o ISO 216. Oito folhas A3 correspondem a um A0: 2,97 cm x 4,2 cm.
in scheme: Tesauro SIPA
broader: Formato do desenho

A4
type: Concept
scope note: É o quinto formato de papel da classe A, conforme o ISO 216. Dezasseis folhas A4 correspondem a um A0: 2,1 cm x 2,97 cm.
in scheme: Tesauro SIPA
broader: Formato do desenho

A5
type: Concept
scope note: É o sexto formato de papel da classe A, conforme o ISO 216. Trinta e duas folhas A5 correspondem a um A0: 1,48 cm x 2,1 cm.
in scheme: Tesauro SIPA
broader: Formato do desenho

Rolo
type: Concept
in scheme: Tesauro SIPA
preferred label: Roll @en
preferred label: Rouleau @fr
preferred label: Rotolo @it
broader: Formato do desenho

Formato digital
type: Concept
in scheme: Tesauro SIPA
preferred label: Digital format @en
preferred label: Format numérique @fr
preferred label: Formato digitale @it
broader: Formato
narrower: Formato digital de documentos de imagem
narrower: Formato digital de imagem em movimento

Formato digital de documentos de imagem
type: Concept
in scheme: Tesauro SIPA
preferred label: Digital image document format @en
preferred label: Format numérique de documents image @fr
preferred label: Formato digitale di documenti d'immagine @it
broader: Formato digital

Formato digital de imagem em movimento
type: Concept
in scheme: Tesauro SIPA
preferred label: Digital moving image format @en
preferred label: Format numérique d'image animée @fr
preferred label: Formato digitale di immagine in movimento @it
broader: Formato digital

Grandes formatos
type: Concept
scope note: Termo aplicados a formas de papel, cuja dimensão ultrapassa a classificação ISO 216.
in scheme: Tesauro SIPA
preferred label: Large formats @en
preferred label: Grands formats @fr
preferred label: Grandi formati @it
broader: Formato

Atributos operacionais
type: Concept
in scheme: Tesauro SIPA
preferred label: Operational attributes @en
preferred label: Attributs opérationnels @fr
preferred label: Attributi operativi @it
broader: Atributos e propriedades
narrower: Acessibilidade

Acessibilidade
type: Concept
scope note: Capacitação de aceder a um destino fixo (físico ou conceptual), variável em função das bases de referenciação: temporais; económicas; de conforto; de mobilidade; de comunicação viária ou pedonal. Constitui um elemento muito relevante na estruturação e qualidade do espaço urbano e habitacional, sendo, para além do mais, um factor fundamental no exercício dos direitos de concidadania numa sociedade democrática.
in scheme: Tesauro SIPA
preferred label: Accessibility @en
preferred label: Accessibilité @fr
preferred label: Accessibilità @it
broader: Atributos operacionais
narrower: Acessibilidade digital
narrower: Acessibilidade física
narrower: Acessibilidade urbana
narrower: Ajustável
narrower: Assistência
narrower: Interatividade

Acessibilidade digital
type: Concept
scope note: Capacitação de aceder a dados digitais.
in scheme: Tesauro SIPA
preferred label: Digital accessibility @en
preferred label: Accessibilité numérique @fr
preferred label: Accessibilità digitale @it
broader: Acessibilidade

Acessibilidade física
type: Concept
scope note: Capacitação de aceder a um destino fixo por cidadãos com mobilidade condicionada.
in scheme: Tesauro SIPA
preferred label: Physical accessibility @en
preferred label: Accessibilité physique @fr
preferred label: Accessibilità fisica @it
broader: Acessibilidade

Acessibilidade urbana
type: Concept
scope note: Capacitação de aceder a um destino fixo através de uma rede de transportes e vias de comunicação.
in scheme: Tesauro SIPA
preferred label: Urban accessibility @en
preferred label: Accessibilité urbaine @fr
preferred label: Accessibilità urbana @it
broader: Acessibilidade

Ajustável
type: Concept
in scheme: Tesauro SIPA
preferred label: Adjustable @en
preferred label: Ajustable @fr
preferred label: Regolabile @it
broader: Acessibilidade

Assistência
type: Concept
in scheme: Tesauro SIPA
preferred label: Assistance @en
preferred label: Assistenza @it
broader: Acessibilidade

Interatividade
type: Concept
in scheme: Tesauro SIPA
preferred label: Interactivity @en
preferred label: Interactivité @fr
preferred label: Interattività @it
hidden label: Interactividade
broader: Acessibilidade

Atributos posicionais
type: Concept
in scheme: Tesauro SIPA
preferred label: Positional attributes @en
preferred label: Attributs positionnels @fr
preferred label: Attributi posizionali @it
broader: Atributos e propriedades
narrower: Atributos posicionais segundo a forma de orientação
narrower: Atributos posicionais segundo a posição relativa
narrower: Atributos posicionais segundo o contexto
narrower: Atributos posicionais segundo uma porção do todo
narrower: Orientação
narrower: Pontos cardeais

Atributos posicionais segundo a forma de orientação
type: Concept
in scheme: Tesauro SIPA
preferred label: Positional attributes according to orientation @en
preferred label: Attributs positionnels selon la forme d’orientation @fr
preferred label: Attributi posizionali secondo la forma di orientamento @it
broader: Atributos posicionais
narrower: Diagonal
narrower: Frontal (Atributos posicionais segundo a forma de orientação)
narrower: Longitudinal
narrower: Perpendicular
narrower: Radial
narrower: Transversal

Diagonal
type: Concept
in scheme: Tesauro SIPA
preferred label: Diagonale @it
broader: Atributos posicionais segundo a forma de orientação

Frontal (Atributos posicionais segundo a forma de orientação)
type: Concept
in scheme: Tesauro SIPA
preferred label: Frontal (Positional attributes according to orientation ) @en
preferred label: Frontal (Attributs positionnels selon la forme d’orientation) @fr
preferred label: Frontale (Attributi posizionali secondo la forma di orientamento) @it
broader: Atributos posicionais segundo a forma de orientação

Longitudinal
type: Concept
in scheme: Tesauro SIPA
preferred label: Longitudinale @it
broader: Atributos posicionais segundo a forma de orientação

Perpendicular
type: Concept
in scheme: Tesauro SIPA
preferred label: Perpendiculaire @fr
preferred label: Perpendicolare @it
broader: Atributos posicionais segundo a forma de orientação

Radial
type: Concept
in scheme: Tesauro SIPA
preferred label: Radiale @it
broader: Atributos posicionais segundo a forma de orientação

Transversal
type: Concept
in scheme: Tesauro SIPA
preferred label: Transversale @it
broader: Atributos posicionais segundo a forma de orientação

Atributos posicionais segundo a posição relativa
type: Concept
in scheme: Tesauro SIPA
preferred label: Positional attributes according to relative position @en
preferred label: Attributs positionnels selon la position relative @fr
preferred label: Attributi posizionali secondo la posizione relativa @it
broader: Atributos posicionais
narrower: Adoçamento
narrower: Adossado
narrower: Assimétrico
narrower: Centrado
narrower: Colateral
narrower: Concêntrico
narrower: Contíguo
narrower: Cruzado
narrower: Destacado
narrower: Direito (Atributos posicionais segundo a posição relativa)
narrower: Elevado
narrower: Embebido
narrower: Embutido (Atributos posicionais segundo a posição relativa)
narrower: Emparelhado
narrower: Encadeado
narrower: Esquerdo
narrower: Exterior
narrower: Incluído
narrower: Interior
narrower: Flanqueado
narrower: Geminado
narrower: Harmónico
narrower: Ladeado
narrower: Lateral
narrower: Paralelo
narrower: Perpendicular
narrower: Simétrico

Adoçamento
type: Concept
scope note: Ligação de dois corpos ou dois elementos arquitetónicos por um chanfro, canelura ou moldura.
in scheme: Tesauro SIPA
preferred label: Hollow moulding @en
preferred label: Adoucissement (Adoucissage) @fr
preferred label: Addolcimento (Attenuazione) @it
broader: Atributos posicionais segundo a posição relativa

Adossado
type: Concept
scope note: Dois elementos ou corpos que se encostam entre si.
in scheme: Tesauro SIPA
preferred label: Adjoined (Attached) @en
preferred label: Adossé @fr
preferred label: Addossato @it
broader: Atributos posicionais segundo a posição relativa

Assimétrico
type: Concept
scope note: Estrutura ou elemento cujos componentes não são semelhantes a partir de um eixo imaginário central.
in scheme: Tesauro SIPA
preferred label: Asymmetrical @en
preferred label: Asymétrique @fr
preferred label: Asimmetrico @it
broader: Atributos posicionais segundo a posição relativa

Centrado
type: Concept
in scheme: Tesauro SIPA
preferred label: Centered @en
preferred label: Centré @fr
preferred label: Centrato @it
broader: Atributos posicionais segundo a posição relativa

Colateral
type: Concept
scope note: Objetos que se posicionam ao lado de um elemento central.
in scheme: Tesauro SIPA
preferred label: Collateral @en
preferred label: Collatéral @fr
preferred label: Collaterale @it
broader: Atributos posicionais segundo a posição relativa

Concêntrico
type: Concept
in scheme: Tesauro SIPA
preferred label: Concentric @en
preferred label: Concentrique @fr
preferred label: Concentrico @it
broader: Atributos posicionais segundo a posição relativa

Contíguo
type: Concept
scope note: Elemento que, posicionalmente, sucede a outro.
in scheme: Tesauro SIPA
preferred label: Contiguous @en
preferred label: Contigu @fr
preferred label: Contiguo @it
broader: Atributos posicionais segundo a posição relativa

Cruzado
type: Concept
scope note: Elemento composto por dois ou mais segmentos que se intercetam.
in scheme: Tesauro SIPA
preferred label: Crossed @en
preferred label: Croisé @fr
preferred label: Incrociato @it
broader: Atributos posicionais segundo a posição relativa

Destacado
type: Concept
in scheme: Tesauro SIPA
preferred label: Prominent (Projecting) @en
preferred label: Détaché @fr
preferred label: Evidenziato @it
broader: Atributos posicionais segundo a posição relativa

Direito (Atributos posicionais segundo a posição relativa)
type: Concept
in scheme: Tesauro SIPA
preferred label: Straight (Positional attributes according to relative position ) @en
preferred label: Droit (Attributs positionnels selon la position relative) @fr
preferred label: Dritto (Attributi posizionali secondo la posizione relativa) @it
broader: Atributos posicionais segundo a posição relativa

Elevado
type: Concept
in scheme: Tesauro SIPA
preferred label: Elevated @en
preferred label: Élevé @fr
preferred label: Elevato @it
broader: Atributos posicionais segundo a posição relativa

Embebido
type: Concept
scope note: Elemento arquitetónico ou peça escultórica que se encontra parcialmente inserido num muro ou pilar.
in scheme: Tesauro SIPA
preferred label: Embedded @en
preferred label: Enfoui @fr
preferred label: Incorporato @it
broader: Atributos posicionais segundo a posição relativa

Embutido (Atributos posicionais segundo a posição relativa)
type: Concept
scope note: Elemento arquitetónico que se encontra totalmente inserido num muro ou pilar.
in scheme: Tesauro SIPA
preferred label: Built-in (Embedded) (Positional attributes according to relative position ) @en
preferred label: Encaissé (Attributs positionnels selon la position relative) @fr
preferred label: Incassato (Attributi posizionali secondo la posizione relativa) @it
broader: Atributos posicionais segundo a posição relativa
narrower: Inglete

Inglete
type: Concept
scope note: Elemento que se encontra a meia-esquadria.
in scheme: Tesauro SIPA
preferred label: Mitre (Miter) @en
preferred label: Coupe d'onglet @fr
preferred label: Mitra (Smusso) @it
broader: Embutido (Atributos posicionais segundo a posição relativa)

Emparelhado
type: Concept
in scheme: Tesauro SIPA
preferred label: Paired @en
preferred label: Jumelé @fr
preferred label: Accoppiato @it
broader: Atributos posicionais segundo a posição relativa

Encadeado
type: Concept
in scheme: Tesauro SIPA
preferred label: Chain-linked @en
preferred label: Enchaîné @fr
preferred label: Incatenato @it
broader: Atributos posicionais segundo a posição relativa

Esquerdo
type: Concept
in scheme: Tesauro SIPA
preferred label: Left @en
preferred label: Gauche @fr
preferred label: Sinistro @it
broader: Atributos posicionais segundo a posição relativa

Exterior
type: Concept
in scheme: Tesauro SIPA
preferred label: Extérieur @fr
preferred label: Esterno @it
broader: Atributos posicionais segundo a posição relativa

Incluído
type: Concept
in scheme: Tesauro SIPA
preferred label: Inserted @en
preferred label: Inséré @fr
preferred label: Inserito @it
broader: Atributos posicionais segundo a posição relativa

Interior
type: Concept
in scheme: Tesauro SIPA
preferred label: Intérieur @fr
preferred label: Interno @it
broader: Atributos posicionais segundo a posição relativa

Flanqueado
type: Concept
scope note: Elemento que se encontra ladeado por dois outros, semelhantes ou distintos.
in scheme: Tesauro SIPA
preferred label: Flanked @en
preferred label: Flanqué @fr
preferred label: Fiancheggiato @it
broader: Atributos posicionais segundo a posição relativa

Geminado
type: Concept
scope note: Elemento que surge associado a outro exatamente igual.
in scheme: Tesauro SIPA
preferred label: Twinned @en
preferred label: JJumelé @fr
preferred label: Geminato @it
broader: Atributos posicionais segundo a posição relativa

Harmónico
type: Concept
in scheme: Tesauro SIPA
preferred label: Harmonic @en
preferred label: Harmonique @fr
preferred label: Armonico @it
broader: Atributos posicionais segundo a posição relativa

Ladeado
type: Concept
in scheme: Tesauro SIPA
preferred label: Side-by-side @en
preferred label: Latéral @fr
preferred label: Affiancato @it
broader: Atributos posicionais segundo a posição relativa

Lateral
type: Concept
in scheme: Tesauro SIPA
preferred label: Latéral @fr
preferred label: Laterale @it
broader: Atributos posicionais segundo a posição relativa

Paralelo
type: Concept
in scheme: Tesauro SIPA
preferred label: Parallel @en
preferred label: Parallèle @fr
preferred label: Parallelo @it
broader: Atributos posicionais segundo a posição relativa

Perpendicular
type: Concept
in scheme: Tesauro SIPA
preferred label: Perpendiculaire @fr
preferred label: Perpendicolare @it
broader: Atributos posicionais segundo a posição relativa

Simétrico
type: Concept
scope note: Estrutura ou elemento cujos componentes são exatamente semelhantes a partir de um eixo imaginário central.
in scheme: Tesauro SIPA
preferred label: Symmetrical @en
preferred label: Symétrique @fr
preferred label: Simmetrico @it
broader: Atributos posicionais segundo a posição relativa

Atributos posicionais segundo o contexto
type: Concept
in scheme: Tesauro SIPA
preferred label: Positional attributes according to context @en
preferred label: Attributs positionnels selon le contexte @fr
preferred label: Attributi posizionali secondo il contesto @it
broader: Atributos posicionais
narrower: Enterrado
narrower: In situ
narrower: Subterrâneo

Enterrado
type: Concept
in scheme: Tesauro SIPA
preferred label: Enfoui @fr
preferred label: Buried @en
preferred label: Interrato @it
broader: Atributos posicionais segundo o contexto

In situ
type: Concept
scope note: Elemento que permanece no local para o qual foi concebido.
in scheme: Tesauro SIPA
broader: Atributos posicionais segundo o contexto

Subterrâneo
type: Concept
scope note: Atributo para designar uma construção ou um compartimento situado abaixo do nível do solo.
in scheme: Tesauro SIPA
preferred label: Subterranean @en
preferred label: Sous-terrain @fr
preferred label: Sotterraneo @it
broader: Atributos posicionais segundo o contexto

Atributos posicionais segundo uma porção do todo
type: Concept
in scheme: Tesauro SIPA
preferred label: Positional attributes according to a portion of the whole @en
preferred label: Attributs positionnels selon une partie du tout @fr
preferred label: Attributi posizionali secondo una porzione del tutto @it
broader: Atributos posicionais
narrower: Canto
narrower: Centro
narrower: Frente
narrower: Fundo (Atributos posicionais segundo uma porção do todo)

Canto
type: Concept
in scheme: Tesauro SIPA
preferred label: Corner @en
preferred label: Coin @fr
preferred label: Angolo @it
broader: Atributos posicionais segundo uma porção do todo

Centro
type: Concept
in scheme: Tesauro SIPA
preferred label: Center @en
preferred label: Centre @fr
broader: Atributos posicionais segundo uma porção do todo

Frente
type: Concept
in scheme: Tesauro SIPA
preferred label: Front @en
preferred label: Devant @fr
preferred label: Davanti @it
broader: Atributos posicionais segundo uma porção do todo

Fundo (Atributos posicionais segundo uma porção do todo)
type: Concept
in scheme: Tesauro SIPA
preferred label: Bottom (Positional attributes according to a portion of the whole ) @en
preferred label: Fond (Attributs positionnels selon une partie du tout) @fr
preferred label: Fondo (Attributi posizionali secondo una porzione del tutto) @it
broader: Atributos posicionais segundo uma porção do todo

Orientação
type: Concept
in scheme: Tesauro SIPA
preferred label: Orientation @en
preferred label: Orientamento @it
broader: Atributos posicionais
narrower: Orientação solar

Orientação solar
type: Concept
in scheme: Tesauro SIPA
preferred label: Solar orientation @en
preferred label: Orientation solaire @fr
preferred label: Orientamento solare @it
broader: Orientação

Pontos cardeais
type: Concept
scope note: Pontos de referência utilizados para orientação na superfície terrestre.
in scheme: Tesauro SIPA
preferred label: Compass points @en
preferred label: Points cardinaux @fr
preferred label: Punti cardinali @it
broader: Atributos posicionais
narrower: Norte
narrower: Nordeste
narrower: Noroeste
narrower: Ocidente
narrower: Oriente
narrower: Sul
narrower: Sudeste
narrower: Sudoeste

Norte
type: Concept
in scheme: Tesauro SIPA
preferred label: North @en
preferred label: Nord @fr
broader: Pontos cardeais

Nordeste
type: Concept
scope note: Ponto cardeal que fica entre o norte e o oriente.
in scheme: Tesauro SIPA
preferred label: Northeast @en
preferred label: Nord-est @fr
broader: Pontos cardeais

Noroeste
type: Concept
scope note: Ponto cardeal que fica entre o norte e o ocidente.
in scheme: Tesauro SIPA
preferred label: Northwest @en
preferred label: Nord-ouest @fr
preferred label: Nord-ovest @it
broader: Pontos cardeais

Ocidente
type: Concept
scope note: Ponto cardeal virado ao lado em que o sol se põe.
in scheme: Tesauro SIPA
preferred label: West @en
preferred label: Occident @fr
preferred label: Occidente @it
alternative label: Oeste
broader: Pontos cardeais

Oriente
type: Concept
in scheme: Tesauro SIPA
preferred label: East @en
preferred label: Orient @fr
alternative label: Este
broader: Pontos cardeais

Sul
type: Concept
in scheme: Tesauro SIPA
preferred label: South @en
preferred label: Sud @fr
broader: Pontos cardeais

Sudeste
type: Concept
in scheme: Tesauro SIPA
preferred label: Southeast @en
preferred label: Sud-est @fr
broader: Pontos cardeais

Sudoeste
type: Concept
in scheme: Tesauro SIPA
preferred label: Southwest @en
preferred label: Sud-ouest @fr
preferred label: Sud-ovest @it
broader: Pontos cardeais

Atributos qualitativos
type: Concept
in scheme: Tesauro SIPA
preferred label: Qualitative attributes @en
preferred label: Attributs qualitatifs @fr
preferred label: Attributi qualitativi @it
broader: Atributos e propriedades
narrower: Autenticidade
narrower: Bom
narrower: Mau
narrower: Razoável

Autenticidade
type: Concept
scope note: Característica daquele que é autêntico.
in scheme: Tesauro SIPA
preferred label: Authenticity @en
preferred label: Authenticité @fr
preferred label: Autenticità @it
broader: Atributos qualitativos

Bom
type: Concept
in scheme: Tesauro SIPA
preferred label: Good @en
preferred label: Bon @fr
preferred label: Buono @it
broader: Atributos qualitativos

Mau
type: Concept
in scheme: Tesauro SIPA
preferred label: Bad @en
preferred label: Mauvais @fr
preferred label: Cattivo @it
broader: Atributos qualitativos

Razoável
type: Concept
in scheme: Tesauro SIPA
preferred label: Reasonable (Fair) @en
preferred label: Raisonnable (Acceptable) @fr
preferred label: Ragionevole (Accettabile) @it
broader: Atributos qualitativos

Atributos relacionados com o tempo
type: Concept
in scheme: Tesauro SIPA
preferred label: Time-related attributs @en
preferred label: Attributs liés au temps @fr
preferred label: Attributi relativi al tempo @it
broader: Atributos e propriedades
narrower: Duração
narrower: Extensão
narrower: Idade
narrower: Permanente
narrower: Temporário

Duração
type: Concept
in scheme: Tesauro SIPA
preferred label: Duration @en
preferred label: Durée @fr
preferred label: Durata @it
broader: Atributos relacionados com o tempo

Extensão
type: Concept
in scheme: Tesauro SIPA
preferred label: Extant @en
preferred label: Étendue temporelle @fr
preferred label: Estensione @it
broader: Atributos relacionados com o tempo

Idade
type: Concept
in scheme: Tesauro SIPA
preferred label: Age @en
preferred label: Âge @fr
preferred label: Età @it
broader: Atributos relacionados com o tempo

Permanente
type: Concept
in scheme: Tesauro SIPA
preferred label: Permanent @en
broader: Atributos relacionados com o tempo

Temporário
type: Concept
in scheme: Tesauro SIPA
preferred label: Temporary @en
preferred label: Temporaire @fr
preferred label: Temporaneo @it
broader: Atributos relacionados com o tempo

Atributos segundo os processos de fabricação
type: Concept
in scheme: Tesauro SIPA
preferred label: Attributes according to manufacturing process @en
preferred label: Attributs selon les procédés de fabrication @fr
preferred label: Attributi secondo i processi di fabbricazione @it
broader: Atributos e propriedades
narrower: À medida
narrower: Artesanal
narrower: Pintado à mão
narrower: Produzido à mão
narrower: Produzido à máquina
narrower: Sintético

À medida
type: Concept
in scheme: Tesauro SIPA
preferred label: Bespoke (Custom-made) @en
preferred label: Sur mesure @fr
preferred label: Su misura @it
broader: Atributos segundo os processos de fabricação

Artesanal
type: Concept
in scheme: Tesauro SIPA
preferred label: Handmade @en
preferred label: Artisanal @fr
preferred label: Artigianale @it
broader: Atributos segundo os processos de fabricação

Pintado à mão
type: Concept
in scheme: Tesauro SIPA
preferred label: Hand-painted @en
preferred label: Peint à la main @fr
preferred label: Dipinto a mano @it
broader: Atributos segundo os processos de fabricação

Produzido à mão
type: Concept
in scheme: Tesauro SIPA
preferred label: Handmade @en
preferred label: Fabriqué à la main @fr
preferred label: Fatto a mano @it
broader: Atributos segundo os processos de fabricação

Produzido à máquina
type: Concept
in scheme: Tesauro SIPA
preferred label: Machine-made @en
preferred label: Fabriqué à la machine @fr
preferred label: Fatto a macchina @it
broader: Atributos segundo os processos de fabricação

Sintético
type: Concept
in scheme: Tesauro SIPA
preferred label: Synthetic @en
preferred label: Synthétique @fr
preferred label: Sintetico @it
broader: Atributos segundo os processos de fabricação

Atributos térmicos
type: Concept
in scheme: Tesauro SIPA
preferred label: Thermal attributes @en
preferred label: Attributs thermiques @fr
preferred label: Attributi termici @it
broader: Atributos e propriedades
narrower: Temperatura

Temperatura
type: Concept
in scheme: Tesauro SIPA
preferred label: Temperature @en
preferred label: Température @fr
broader: Atributos térmicos
narrower: Ameno
narrower: Calor
narrower: Frio
narrower: Temperado

Ameno
type: Concept
in scheme: Tesauro SIPA
preferred label: Cool; Mild @en
preferred label: Doux; Tempéré @fr
preferred label: Mite @it
broader: Temperatura

Calor
type: Concept
in scheme: Tesauro SIPA
preferred label: Heat @en
preferred label: Chaleur @fr
preferred label: Calore @it
alternative label: Quente
broader: Temperatura

Frio
type: Concept
in scheme: Tesauro SIPA
preferred label: Cold @en
preferred label: Froid @fr
preferred label: Freddo @it
broader: Temperatura

Temperado
type: Concept
in scheme: Tesauro SIPA
preferred label: Temperate @en
preferred label: Tempéré @fr
preferred label: Temperato @it
broader: Temperatura

Cor
type: Concept
scope note: Impressão que a luz refletida ou absorvida pelos objetos produz nos nossos olhos e cérebro, determinada pela frequência da onda que ele reflete.
in scheme: Tesauro SIPA
preferred label: Colour @en
preferred label: Couleur @fr
preferred label: Colore @it
broader: Atributos e propriedades
narrower: Cor cromática
narrower: Cor indeterminada
narrower: Cor neutra
narrower: Efeitos de cor
narrower: Propriedades da cor
narrower: Tipos de cor

Cor cromática
type: Concept
scope note: Cor percecionada dentro do espetro visível.
in scheme: Tesauro SIPA
preferred label: Chromatic colour @en
preferred label: Couleur chromatique @fr
preferred label: Colore cromatico @it
broader: Cor
narrower: Cor amarela
narrower: Cor azul
narrower: Cor castanha
narrower: Cor laranja
narrower: Cor púrpura
narrower: Cor rosa
narrower: Cor verde
narrower: Cor vermelha

Cor amarela
type: Concept
in scheme: Tesauro SIPA
preferred label: Yellow @en
preferred label: Jaune @fr
preferred label: Giallo @it
broader: Cor cromática

Cor azul
type: Concept
in scheme: Tesauro SIPA
preferred label: Blue @en
preferred label: Bleu @fr
preferred label: Blu @it
broader: Cor cromática
narrower: Anil

Anil
type: Concept
scope note: Cor azul, muito utilizada em aguadas ou em tinturaria, obtida de um pigmento de origem vegetal.
in scheme: Tesauro SIPA
preferred label: Indigo @en
preferred label: Anile @it
broader: Cor azul

Cor castanha
type: Concept
in scheme: Tesauro SIPA
preferred label: Brown @en
preferred label: Marron @fr
preferred label: Marrone @it
broader: Cor cromática

Cor laranja
type: Concept
in scheme: Tesauro SIPA
preferred label: Orange colour @en
preferred label: Orange @fr
preferred label: Arancione @it
broader: Cor cromática

Cor púrpura
type: Concept
in scheme: Tesauro SIPA
preferred label: Purple @en
preferred label: Pourpre @fr
preferred label: Porpora @it
broader: Cor cromática

Cor rosa
type: Concept
in scheme: Tesauro SIPA
preferred label: Pink @en
preferred label: Rose @fr
preferred label: Rosa @it
broader: Cor cromática

Cor verde
type: Concept
in scheme: Tesauro SIPA
preferred label: Green @en
preferred label: Vert @fr
preferred label: Verde @it
broader: Cor cromática

Cor vermelha
type: Concept
in scheme: Tesauro SIPA
preferred label: Red @en
preferred label: Rouge @fr
preferred label: Rosso @it
broader: Cor cromática

Cor indeterminada
type: Concept
in scheme: Tesauro SIPA
preferred label: Indeterminate colour @en
preferred label: Couleur indéterminée @fr
preferred label: Colore indeterminato @it
broader: Cor

Cor neutra
type: Concept
scope note: Tipo de cor que não possui uma tonalidade específica, como o bege.
in scheme: Tesauro SIPA
preferred label: Neutral colour @en
preferred label: Couleur neutre @fr
preferred label: Colore neutro @it
alternative label: Cor acromática
broader: Cor
narrower: Branco
narrower: Cinza
narrower: Cor neutra variável
narrower: Preto
narrower: Preto e branco

Branco
type: Concept
in scheme: Tesauro SIPA
preferred label: White @en
preferred label: Blanc @fr
preferred label: Bianco @it
broader: Cor neutra

Cinza
type: Concept
in scheme: Tesauro SIPA
preferred label: Gray @en
preferred label: Gris @fr
preferred label: Grigio @it
broader: Cor neutra

Cor neutra variável
type: Concept
in scheme: Tesauro SIPA
preferred label: Variable neutral colour @en
broader: Cor neutra
narrower: Bege
narrower: Cinza claro
narrower: Cinza escuro
narrower: Cor de ébano
narrower: Cor marfim
narrower: Cor pérola
narrower: Creme
narrower: Cru

Bege
type: Concept
in scheme: Tesauro SIPA
preferred label: Beige @en
broader: Cor neutra variável

Cinza claro
type: Concept
in scheme: Tesauro SIPA
preferred label: Light gray @en
preferred label: Gris clair @fr
preferred label: Grigio chiaro @it
broader: Cor neutra variável

Cinza escuro
type: Concept
in scheme: Tesauro SIPA
preferred label: Dark gray @en
preferred label: Gris foncé @fr
preferred label: Grigio scuro @it
broader: Cor neutra variável

Cor de ébano
type: Concept
in scheme: Tesauro SIPA
preferred label: Ebony @en
preferred label: Couleur ébène @fr
preferred label: Colore ebano @it
broader: Cor neutra variável

Cor marfim
type: Concept
in scheme: Tesauro SIPA
preferred label: Ivory @en
preferred label: Couleur ivoire @fr
preferred label: Colore avorio @it
broader: Cor neutra variável

Cor pérola
type: Concept
in scheme: Tesauro SIPA
preferred label: Pearl colour @en
preferred label: Couleur perle @fr
preferred label: Colore perla @it
broader: Cor neutra variável

Creme
type: Concept
in scheme: Tesauro SIPA
preferred label: Cream @en
preferred label: Crème @fr
preferred label: Crema @it
broader: Cor neutra variável

Cru
type: Concept
in scheme: Tesauro SIPA
preferred label: Raw (Unbleached) @en
preferred label: Écru @fr
preferred label: Grezzo (Ecrù) @it
broader: Cor neutra variável

Preto
type: Concept
in scheme: Tesauro SIPA
preferred label: Black @en
preferred label: Noir @fr
preferred label: Nero @it
broader: Cor neutra

Preto e branco
type: Concept
in scheme: Tesauro SIPA
preferred label: Black and white @en
preferred label: Noir et blanc @fr
preferred label: Bianco e nero @it
broader: Cor neutra

Efeitos de cor
type: Concept
in scheme: Tesauro SIPA
preferred label: Colour effects @en
preferred label: Effets de couleur @fr
preferred label: Effetti cromatici @it
broader: Cor
narrower: Paleta
narrower: Tom
narrower: Vibração

Paleta
type: Concept
in scheme: Tesauro SIPA
preferred label: Palette @en
broader: Efeitos de cor

Tom
type: Concept
in scheme: Tesauro SIPA
preferred label: Tone @en
preferred label: Ton @fr
preferred label: Tono @it
broader: Efeitos de cor
narrower: Meio tom
narrower: Pontilhado
narrower: Tom contínuo

Meio tom
type: Concept
in scheme: Tesauro SIPA
preferred label: Halftone @en
preferred label: Demi-ton @fr
preferred label: Mezzotono @it
broader: Tom

Pontilhado
type: Concept
in scheme: Tesauro SIPA
preferred label: Dotted @en
preferred label: Pointillé @fr
preferred label: Puntinato @it
broader: Tom

Tom contínuo
type: Concept
in scheme: Tesauro SIPA
preferred label: Continuous tone @en
preferred label: Ton continu @fr
preferred label: Tono continuo @it
broader: Tom

Vibração
type: Concept
in scheme: Tesauro SIPA
preferred label: Vibration (chromatic) @en
preferred label: Vibration @fr
preferred label: Vibrazione cromatica @it
broader: Efeitos de cor

Propriedades da cor
type: Concept
in scheme: Tesauro SIPA
preferred label: Colour properties @en
preferred label: Propriétés de la couleur @fr
preferred label: Proprietà del colore @it
broader: Cor
narrower: Brilho
narrower: Intensidade
narrower: Luminosidade
narrower: Matiz
narrower: Palidez
narrower: Tonalidade

Brilho
type: Concept
scope note: Qualidade de um objeto de refletir a luz de forma intensa.
in scheme: Tesauro SIPA
preferred label: Brightness @en
preferred label: Brillance @fr
preferred label: Brillantezza @it
broader: Propriedades da cor

Intensidade
type: Concept
in scheme: Tesauro SIPA
preferred label: Intensity @en
preferred label: Intensité @fr
preferred label: Intensità @it
broader: Propriedades da cor

Luminosidade
type: Concept
in scheme: Tesauro SIPA
preferred label: Luminosity @en
preferred label: Luminosité @fr
preferred label: Luminosità @it
broader: Propriedades da cor

Matiz
type: Concept
in scheme: Tesauro SIPA
preferred label: Hue @en
preferred label: Teinte (Tonalité) @fr
preferred label: Tinta (Tonalità) @it
broader: Propriedades da cor

Palidez
type: Concept
in scheme: Tesauro SIPA
preferred label: Paleness @en
preferred label: Pâleur @fr
preferred label: Pallore @it
broader: Propriedades da cor

Tonalidade
type: Concept
in scheme: Tesauro SIPA
preferred label: Tonality (Shade) @en
preferred label: Tonalité (Nuance) @fr
preferred label: Tonalità @it
broader: Propriedades da cor

Tipos de cor
type: Concept
in scheme: Tesauro SIPA
preferred label: Colour types @en
preferred label: Types de couleur @fr
preferred label: Tipi di colore @it
broader: Cor
narrower: Cor complementar
narrower: Cor fria
narrower: Cor primária
narrower: Cor quente
narrower: Cor secundária

Cor complementar
type: Concept
scope note: Cor que está posicionada em lados opostos do círculo cromático, logo muito contrastantes e que se complementam, gerando um efeito visual intenso e vibrante.
in scheme: Tesauro SIPA
preferred label: Complementary colour @en
preferred label: Couleur complémentaire @fr
preferred label: Colore complementare @it
broader: Tipos de cor

Cor fria
type: Concept
scope note: Grupo de cores associadas à água, gelo, neve, céu e natureza em geral, constituindo o azul, verde e violeta.
in scheme: Tesauro SIPA
preferred label: Cool colour @en
preferred label: Couleur froide @fr
preferred label: Colore freddo @it
broader: Tipos de cor

Cor primária
type: Concept
scope note: Cor que combinada com outra, geram uma terceira.
in scheme: Tesauro SIPA
preferred label: Primary colour @en
preferred label: Couleur primaire @fr
preferred label: Colore primario @it
broader: Tipos de cor

Cor quente
type: Concept
scope note: Grupo de cores associadas ao calor e à energia, como o vermelho, laranja e amarelo, contemplando todas as suas variações e tons.
in scheme: Tesauro SIPA
preferred label: Warm colour @en
preferred label: Couleur chaude @fr
preferred label: Colore caldo @it
broader: Tipos de cor

Cor secundária
type: Concept
scope note: Cor formada pela mistura de duas cores primárias.
in scheme: Tesauro SIPA
preferred label: Secondary colour @en
preferred label: Couleur secondaire @fr
preferred label: Colore secondario @it
broader: Tipos de cor

Densidade
type: Concept
in scheme: Tesauro SIPA
preferred label: Density @en
preferred label: Densité @fr
preferred label: Densità @it
broader: Atributos e propriedades

Estabilidade
type: Concept
in scheme: Tesauro SIPA
preferred label: Stability @en
preferred label: Stabilité @fr
preferred label: Stabilità @it
broader: Atributos e propriedades

Polaridade
type: Concept
in scheme: Tesauro SIPA
preferred label: Polarity @en
preferred label: Polarité @fr
preferred label: Polarità @it
broader: Atributos e propriedades
narrower: Negativo
narrower: Positivo

Negativo
type: Concept
in scheme: Tesauro SIPA
preferred label: Negative @en
preferred label: Négatif @fr
broader: Polaridade

Positivo
type: Concept
in scheme: Tesauro SIPA
preferred label: Positive @en
preferred label: Positif @fr
broader: Polaridade

Propriedades acústicas
type: Concept
in scheme: Tesauro SIPA
preferred label: Acoustic properties @en
preferred label: Propriétés acoustiques @fr
preferred label: Proprietà acustiche @it
broader: Atributos e propriedades

Propriedades elétricas
type: Concept
in scheme: Tesauro SIPA
preferred label: Electrical properties @en
preferred label: Propriétés électriques @fr
preferred label: Proprietà elettriche @it
hidden label: Propriedades eléctricas
broader: Atributos e propriedades
narrower: Condutividade elétrica
narrower: Resistência elétrica

Condutividade elétrica
type: Concept
in scheme: Tesauro SIPA
preferred label: Electrical conductivity @en
preferred label: Conductivité électrique @fr
preferred label: Conduttività elettrica @it
hidden label: Condutividade eléctrica
broader: Propriedades elétricas

Resistência elétrica
type: Concept
in scheme: Tesauro SIPA
preferred label: Electrical resistance @en
preferred label: Résistance électrique @fr
preferred label: Resistenza elettrica @it
hidden label: Resistência eléctrica
broader: Propriedades elétricas

Propriedades geofísicas
type: Concept
in scheme: Tesauro SIPA
preferred label: Geophysical properties @en
preferred label: Propriétés géophysiques @fr
preferred label: Proprietà geofisiche @it
broader: Atributos e propriedades
narrower: Sismicidade

Sismicidade
type: Concept
in scheme: Tesauro SIPA
preferred label: Seismicity @en
preferred label: Sismicité @fr
preferred label: Sismicità @it
broader: Propriedades geofísicas

Propriedades mecânicas
type: Concept
in scheme: Tesauro SIPA
preferred label: Mechanical properties @en
preferred label: Propriétés mécaniques @fr
preferred label: Proprietà meccaniche @it
broader: Atributos e propriedades
narrower: Compressibilidade
narrower: Desgaste
narrower: Ductilidade
narrower: Elasticidade
narrower: Fragilidade
narrower: Maleabilidade
narrower: Plasticidade
narrower: Resistência mecância
narrower: Rigidez

Compressibilidade
type: Concept
in scheme: Tesauro SIPA
preferred label: Compressibility @en
preferred label: Compressibilité @fr
preferred label: Compressibilità @it
broader: Propriedades mecânicas

Desgaste
type: Concept
in scheme: Tesauro SIPA
preferred label: Wear (Abrasion) @en
preferred label: Usure (Abrasion) @fr
preferred label: Usura (Abrasione) @it
broader: Propriedades mecânicas

Ductilidade
type: Concept
scope note: Propriedade de um elemento de se deformar sob tensão, sem fratura.
in scheme: Tesauro SIPA
preferred label: Ductility @en
preferred label: Ductilité @fr
preferred label: Duttilità @it
broader: Propriedades mecânicas

Elasticidade
type: Concept
in scheme: Tesauro SIPA
preferred label: Elasticity @en
preferred label: Élasticité @fr
preferred label: Elasticità @it
broader: Propriedades mecânicas

Fragilidade
type: Concept
in scheme: Tesauro SIPA
preferred label: Fragilitty @en
preferred label: Fragilité @fr
preferred label: Fragilità @it
broader: Propriedades mecânicas

Maleabilidade
type: Concept
in scheme: Tesauro SIPA
preferred label: Malleability @en
preferred label: Malléabilité @fr
preferred label: Malleabilità @it
broader: Propriedades mecânicas

Plasticidade
type: Concept
in scheme: Tesauro SIPA
preferred label: Plasticity @en
preferred label: Plasticité @fr
preferred label: Plasticità @it
broader: Propriedades mecânicas

Resistência mecância
type: Concept
in scheme: Tesauro SIPA
preferred label: Mechanical strenght @en
preferred label: Résistance mécanique @fr
preferred label: Resistenza meccanica @it
broader: Propriedades mecânicas
narrower: Resistência à compressão
narrower: Resistência à tração
narrower: Resistência ao cisalhamento

Resistência à compressão
type: Concept
in scheme: Tesauro SIPA
preferred label: Compressive strength @en
preferred label: Résistance à la compression @fr
preferred label: Resistenza a compressione @it
broader: Resistência mecância

Resistência à tração
type: Concept
in scheme: Tesauro SIPA
preferred label: Tensile strength @en
preferred label: Résistance à la traction @fr
preferred label: Resistenza a trazione @it
hidden label: Resistência à tracção
broader: Resistência mecância

Resistência ao cisalhamento
type: Concept
in scheme: Tesauro SIPA
preferred label: Shear strength @en
preferred label: Résistance au cisaillement @fr
preferred label: Resistenza al taglio @it
broader: Resistência mecância

Rigidez
type: Concept
in scheme: Tesauro SIPA
preferred label: Stiffness @en
preferred label: Rigidité @fr
preferred label: Rigidità @it
broader: Propriedades mecânicas

Propriedades químicas
type: Concept
in scheme: Tesauro SIPA
preferred label: Chemical properties @en
preferred label: Propriétés chimiques @fr
preferred label: Proprietà chimiche @it
broader: Atributos e propriedades
narrower: Acidez
narrower: Alacalinidade
narrower: Concentração
narrower: Neutralidade
narrower: Radioatividade
narrower: Salinidade

Acidez
type: Concept
scope note: Propriedade do que é ácido.
in scheme: Tesauro SIPA
preferred label: Acidity @en
preferred label: Acidité @fr
preferred label: Acidità @it
broader: Propriedades químicas

Alacalinidade
type: Concept
scope note: Determina a quantidade de substâncias presentes numa solução aquosa, que determinam o seu PH
in scheme: Tesauro SIPA
preferred label: Alcalinity @en
preferred label: Alcalinité @fr
preferred label: Alcalinità @it
broader: Propriedades químicas

Concentração
type: Concept
in scheme: Tesauro SIPA
preferred label: Concentration @en
preferred label: Concentrazione @it
broader: Propriedades químicas

Neutralidade
type: Concept
in scheme: Tesauro SIPA
preferred label: Neutrality @en
preferred label: Neutralité @fr
preferred label: Neutralità @it
broader: Propriedades químicas

Radioatividade
type: Concept
in scheme: Tesauro SIPA
preferred label: Radioactivity @en
preferred label: Radioactivité @fr
preferred label: Radioattività @it
broader: Propriedades químicas

Salinidade
type: Concept
in scheme: Tesauro SIPA
preferred label: Salinity @en
preferred label: Salinité @fr
preferred label: Salinità @it
broader: Propriedades químicas

Textura
type: Concept
scope note: Características visuais e tácteis das superfícies de um objeto, dadas pela dimensão, forma, grão e as partículas do(s) material(is) por que é composto.
in scheme: Tesauro SIPA
preferred label: Texture @en
broader: Atributos e propriedades
narrower: Arenoso
narrower: Granularidade
narrower: Suavidade
narrower: Rugosidade

Arenoso
type: Concept
in scheme: Tesauro SIPA
preferred label: Sandy; Arenaceous @en
preferred label: Sableux @fr
preferred label: Sabbioso @it
broader: Textura

Granularidade
type: Concept
in scheme: Tesauro SIPA
preferred label: Sabbioso @it
preferred label: Granularity @en
preferred label: Sablonneux @fr
broader: Textura

Suavidade
type: Concept
in scheme: Tesauro SIPA
preferred label: Smoothness @en
preferred label: Douceur @fr
preferred label: Morbidezza @it
broader: Textura

Rugosidade
type: Concept
in scheme: Tesauro SIPA
preferred label: Roughness @en
preferred label: Rugosité @fr
preferred label: Ruvidità @it
broader: Textura
narrower: Asperesa

Asperesa
type: Concept
in scheme: Tesauro SIPA
preferred label: Coarseness @en
preferred label: Aspérité @fr
preferred label: Asprezza @it
broader: Rugosidade

COMPARTIMENTOS E ESPAÇOS
type: Collection
type: ConceptGroup
preferred label: COMPARTMENTS AND SPACES @en
preferred label: COMPARTIMENTS ET ESPACES @fr
preferred label: COMPARTI E SPAZI @it
member: Compartimentos e espaços
member: Compartimentos e espaços específicos
member: Compartimentos e espaços científicos
member: Compartimentos e espaços de observação e análise, de experiência e diagnóstico técnico e científico (Compartimentos e espaços científicos)
member: Casa da mira
member: Laboratório de restauro
member: Oficina de óptica
member: Pavilhão de espectroheliógrafo
member: Sala da luneta meridiana
member: Sala de observação astronómica
member: Sala do sismógrafo
member: Sala do barómetro
member: Compartimentos e espaços comerciais
member: Compartimentos e espaços específicos de banho, de vestir e sanitários (Compartimentos e espaços comerciais)
member: Fraldário
member: Compartimentos e espaços específicos de exposição (Compartimentos e espaços comerciais)
member: Stand
member: Compartimentos e espaços específicos de criação e exploração animal e vegetal
member: Loja (Compartimentos e espaços específicos de criação e exploração animal e vegetal)
member: Sala de ordenha
member: Compartimentos e espaços culturais e recreativos
member: Compartimentos e espaços de acesso, circulação, distribuição e transição (Compartimentos e espaços culturais e recreativos)
member: Compartimentos e espaços de acesso, circulação, distribuição e transição de pessoas (Compartimentos e espaços culturais e recreativos)
member: Corredor-entre-barreiras
member: Pátio da quadrilha
member: Párodo
member: Praecinctio
member: Túnel de acesso (Compartimentos e espaços de acesso, circulação, distribuição e transição - Espaços culturais e recreativos)
member: Vomitório
member: Compartimentos e espaços de armazenamento (Compartimentos e espaços culturais e recreativos)
member: Sala de reservados
member: Depósito de documentação (Compartimentos e espaços de armazenamento (Compartimentos e espaços culturais e recreativos))
member: Depósito de quarentena
member: Depósito limpo
member: Depósito sujo
member: Sala de espólios
member: Sala de microfilmes
member: Compartimento e espaços de comunicação e de difusão de dados e registos (Compartimentos e espaços culturais e recreativos)
member: Hemeroteca (Compartimento e espaços específicos de comunicação e de difusão de dados e registos)
member: Mapoteca
member: Memeroteca
member: Sala de empréstimos
member: Sala de intercâmbio entre bibliotecas
member: Sala de leitura
member: Sala de leitura de cartografia
member: Sala de leitura de documentos legíveis por máquinas
member: Filmoteca
member: Fonoteca (Sala de leitura de documentos legíveis por máquinas)
member: Sala de audição
member: Sala de audiovisuais
member: Sala de leitura de microfilmes
member: Sala de projeções
member: Videoteca
member: Sala de leitura de iconografia
member: Sala de leitura de periódicos
member: Sala de leitura de reservados
member: Sala de leitura especial
member: Sala de leitura informal
member: Sala de música
member: Sala de numismática
member: Sala de referência
member: Compartimentos e espaços de processamento e de transformação de materiais e produtos (Compartimentos e espaços culturais e recreativos)
member: Estúdio para pintura de cenários e telões
member: Zona de pré-arquivagem, restauro e encadernação
member: Compartimentos e espaços de recolha, de produção e de processamento de dados e registos (Compartimentos e espaços culturais e recreativos)
member: Gabinete do arquivista
member: Gabinete do bibliotecário
member: Compartimentos e espaços de saúde e bem-estar
member: Compartimentos e espaços de banho, de vestir e sanitários (Compartimentos e espaços de saúde e bem-estar)
member: Apoditério
member: Caldário
member: Eleotésio
member: Frigidário
member: Laconicum

Compartimentos e espaços
type: Concept
in scheme: Tesauro SIPA
top concept of: Tesauro SIPA
preferred label: Compartments and spaces @en
preferred label: Compartiments et espaces @fr
preferred label: Comparti e spazi @it
narrower: Compartimentos e espaços específicos
narrower: Compartimentos e espaços genéricos
related: Atributos e propriedades
related: Elementos arquitetónicos
related: Materiais e produtos
related: Objetos, Equipamentos, Mobiliário e Veículos
related: c 65005b47
modified: 2025-09-23T13:22:43

Compartimentos e espaços específicos
type: Concept
in scheme: Tesauro SIPA
preferred label: Specific compartments and spaces @en
preferred label: Compartiments et espaces spécifiques @fr
preferred label: Compartimenti e spazi specifici @it
broader: Compartimentos e espaços
narrower: Compartimentos e espaços científicos
narrower: Compartimentos e espaços comerciais
narrower: Compartimentos e espaços específicos de criação e exploração animal e vegetal
narrower: Compartimentos e espaços culturais e recreativos
narrower: Compartimentos e espaços de saúde e bem-estar
narrower: Compartimentos e espaços de transportes
narrower: Compartimentos e espaços educativos e formativos
narrower: Compartimentos e espaços funerários
narrower: Compartimentos e espaços industriais
narrower: Compartimentos e espaços judiciais
narrower: Compartimentos e espaços militares
narrower: Compartimentos e espaços prisionais
narrower: Compartimentos e espaços religiosos
narrower: Compartimentos e espaços residenciais

Compartimentos e espaços científicos
type: Concept
in scheme: Tesauro SIPA
preferred label: Scientific compartments and spaces @en
preferred label: Compartiments et espaces scientifiques @fr
preferred label: Compartimenti e spazi scientifici @it
broader: Compartimentos e espaços específicos
narrower: Compartimentos e espaços de observação e análise, de experiência e diagnóstico técnico e científico (Compartimentos e espaços científicos)

Compartimentos e espaços de observação e análise, de experiência e diagnóstico técnico e científico (Compartimentos e espaços científicos)
type: Concept
in scheme: Tesauro SIPA
preferred label: Compartments and spaces for observation and analysis, technical and scientific experimentation and diagnosis (Scientific specific compartments and spaces) @en
preferred label: Compartiments et espaces d'observation et d'analyse, d'expérimentation technique et scientifique et de diagnostic (Compartiments et espaces scientifiques spécifiques) @fr
preferred label: Compartimenti e spazi per l'osservazione e l'analisi, la sperimentazione tecnica e scientifica e la diagnosi (Compartimenti e spazi scientifici specifici) @it
broader: Compartimentos e espaços científicos
narrower: Casa da mira
narrower: Laboratório de restauro
narrower: Oficina de óptica
narrower: Pavilhão de espectroheliógrafo
narrower: Sala da luneta meridiana
narrower: Sala de observação astronómica
narrower: Sala do sismógrafo
narrower: Sala do barómetro

Casa da mira
type: Concept
in scheme: Tesauro SIPA
preferred label: Sight room @en
broader: Compartimentos e espaços de observação e análise, de experiência e diagnóstico técnico e científico (Compartimentos e espaços científicos)

Laboratório de restauro
type: Concept
in scheme: Tesauro SIPA
preferred label: Restoration room @en
preferred label: Laboratoire de restauration @fr
preferred label: Laboratorio di restauro @it
broader: Compartimentos e espaços de observação e análise, de experiência e diagnóstico técnico e científico (Compartimentos e espaços científicos)

Oficina de óptica
type: Concept
in scheme: Tesauro SIPA
preferred label: Optics workshop @en
preferred label: Atelier d'optique @fr
preferred label: Laboratorio di ottica @it
broader: Compartimentos e espaços de observação e análise, de experiência e diagnóstico técnico e científico (Compartimentos e espaços científicos)

Pavilhão de espectroheliógrafo
type: Concept
in scheme: Tesauro SIPA
preferred label: Spectroheliograph pavilion @en
preferred label: Pavillon des spectrophotographes @fr
preferred label: Sala della spettrofotografia @it
broader: Compartimentos e espaços de observação e análise, de experiência e diagnóstico técnico e científico (Compartimentos e espaços científicos)

Sala da luneta meridiana
type: Concept
in scheme: Tesauro SIPA
preferred label: Meridian bezel room @en
preferred label: Salle du télescope méridien @fr
preferred label: Sala del telescopio meridiano @it
broader: Compartimentos e espaços de observação e análise, de experiência e diagnóstico técnico e científico (Compartimentos e espaços científicos)

Sala de observação astronómica
type: Concept
in scheme: Tesauro SIPA
preferred label: Astronomical observation room @en
preferred label: Salle d'observation astronomique @fr
preferred label: Sala di osservazione astronomica @it
broader: Compartimentos e espaços de observação e análise, de experiência e diagnóstico técnico e científico (Compartimentos e espaços científicos)

Sala do sismógrafo
type: Concept
in scheme: Tesauro SIPA
preferred label: Seismograph room @en
preferred label: Salle des sismographes @fr
preferred label: Sala del sismografo @it
broader: Compartimentos e espaços de observação e análise, de experiência e diagnóstico técnico e científico (Compartimentos e espaços científicos)

Sala do barómetro
type: Concept
in scheme: Tesauro SIPA
preferred label: Barometer room @en
preferred label: Salle des baromètres @fr
preferred label: Sala barometri @it
broader: Compartimentos e espaços de observação e análise, de experiência e diagnóstico técnico e científico (Compartimentos e espaços científicos)

Compartimentos e espaços comerciais
type: Concept
in scheme: Tesauro SIPA
preferred label: Commercial and tourist compartments and spaces @en
preferred label: Compartiments et espaces commerciaux et touristiques @fr
preferred label: Compartimenti e spazi commerciali e turistiche @it
broader: Compartimentos e espaços específicos
narrower: Compartimentos e espaços específicos de banho, de vestir e sanitários (Compartimentos e espaços comerciais)
narrower: Compartimentos e espaços específicos de exposição (Compartimentos e espaços comerciais)

Compartimentos e espaços específicos de banho, de vestir e sanitários (Compartimentos e espaços comerciais)
type: Concept
in scheme: Tesauro SIPA
preferred label: Bathrooms, dressing rooms and sanitary specific compartments and spaces (Commercial and tourism compartments and spaces) @en
preferred label: Compartiments et espaces spécifiques de bain, d'habillage et sanitaires (Compartiments et espaces commerciaux et touristiques) @fr
preferred label: Compartimenti e spazi specifici per bagni, medicazioni e servizi igienici (Compartimenti e spazi commerciali e turistiche) @it
broader: Compartimentos e espaços comerciais
narrower: Fraldário

Fraldário
type: Concept
scope note: Espaço numa superfície comercial, equipado para a muda das fraldas dos bebés.
in scheme: Tesauro SIPA
preferred label: Baby changing station @en
preferred label: Salle de change de couches @fr
preferred label: Fasciatoio per pannolini @it
broader: Compartimentos e espaços específicos de banho, de vestir e sanitários (Compartimentos e espaços comerciais)

Compartimentos e espaços específicos de exposição (Compartimentos e espaços comerciais)
type: Concept
in scheme: Tesauro SIPA
preferred label: Exhibition compartments and spaces (Commercial and tourism compartments and spaces) @en
preferred label: Compartiments et espaces d'exposition (Compartiments et espaces commerciaux et touristiques) @fr
preferred label: Compartimenti e spazi espositivi (Compartimenti e spazi commerciali e turistici) @it
broader: Compartimentos e espaços comerciais
narrower: Stand

Stand
type: Concept
in scheme: Tesauro SIPA
broader: Compartimentos e espaços específicos de exposição (Compartimentos e espaços comerciais)

Compartimentos e espaços específicos de criação e exploração animal e vegetal
type: Concept
in scheme: Tesauro SIPA
preferred label: Animal and vegetal breeding and exploration compartments and spaces (Agricultural compartments and spaces) @en
preferred label: Compartiments et espaces de l'élevage et de l'agriculture (compartiments et espaces agropastoraux) @fr
preferred label: Compartimenti e aree agricole e zootecniche (Comparti e aree agropastorali) @it
broader: Compartimentos e espaços específicos
narrower: Loja (Compartimentos e espaços específicos de criação e exploração animal e vegetal)
narrower: Sala de ordenha

Loja (Compartimentos e espaços específicos de criação e exploração animal e vegetal)
type: Concept
in scheme: Tesauro SIPA
preferred label: Store (Livestock and crop farming compartments and spaces) @en
broader: Compartimentos e espaços específicos de criação e exploração animal e vegetal

Sala de ordenha
type: Concept
in scheme: Tesauro SIPA
preferred label: Milking room @en
preferred label: Salle de traite @fr
preferred label: Sala di mungitura @it
broader: Compartimentos e espaços específicos de criação e exploração animal e vegetal

Compartimentos e espaços culturais e recreativos
type: Concept
in scheme: Tesauro SIPA
preferred label: Cultural and recreational compartments and spaces @en
preferred label: Compartiments et espaces culturels et récréatifs @fr
preferred label: Compartimenti e spazi culturali e ricreativi @it
broader: Compartimentos e espaços específicos
narrower: Compartimentos e espaços de acesso, circulação, distribuição e transição (Compartimentos e espaços culturais e recreativos)
narrower: Compartimentos e espaços de armazenamento (Compartimentos e espaços culturais e recreativos)
narrower: Compartimento e espaços de comunicação e de difusão de dados e registos (Compartimentos e espaços culturais e recreativos)
narrower: Compartimentos e espaços de processamento e de transformação de materiais e produtos (Compartimentos e espaços culturais e recreativos)
narrower: Compartimentos e espaços de recolha, de produção e de processamento de dados e registos (Compartimentos e espaços culturais e recreativos)

Compartimentos e espaços de acesso, circulação, distribuição e transição (Compartimentos e espaços culturais e recreativos)
type: Concept
in scheme: Tesauro SIPA
preferred label: Compartments and spaces for access, circulation, distribution and transition (Cultural and recreational compartments and spaces) @en
preferred label: Compartiments et espaces d'accès, de circulation, de distribution et de transition (Compartiments et espaces culturels et récréatifs) @fr
preferred label: Compartimenti e spazi per l'accesso, la circolazione, la distribuzione e la transizione (Compartimenti e spazi culturali e ricreativi) @it
broader: Compartimentos e espaços culturais e recreativos
narrower: Compartimentos e espaços de acesso, circulação, distribuição e transição de pessoas (Compartimentos e espaços culturais e recreativos)

Compartimentos e espaços de acesso, circulação, distribuição e transição de pessoas (Compartimentos e espaços culturais e recreativos)
type: Concept
in scheme: Tesauro SIPA
preferred label: Compartments and spaces for the access, circulation, distribution and transition of persons (Cultural and recreational compartments and spaces) @en
preferred label: Compartiments et espaces pour l'accès, la circulation, la distribution et la transition des personnes (Compartiments et espaces culturels et récréatifs) @fr
preferred label: Compartimenti e spazi per l'accesso, la circolazione, la distribuzione e la transizione delle persone (Compartimenti e spazi culturali e ricreati) @it
broader: Compartimentos e espaços de acesso, circulação, distribuição e transição (Compartimentos e espaços culturais e recreativos)
narrower: Corredor-entre-barreiras
narrower: Pátio da quadrilha
narrower: Párodo
narrower: Praecinctio
narrower: Túnel de acesso (Compartimentos e espaços de acesso, circulação, distribuição e transição - Espaços culturais e recreativos)
narrower: Vomitório

Corredor-entre-barreiras
type: Concept
in scheme: Tesauro SIPA
preferred label: Corridor-between-barriers @en
broader: Compartimentos e espaços de acesso, circulação, distribuição e transição de pessoas (Compartimentos e espaços culturais e recreativos)

Pátio da quadrilha
type: Concept
in scheme: Tesauro SIPA
preferred label: Gang courtyard @en
broader: Compartimentos e espaços de acesso, circulação, distribuição e transição de pessoas (Compartimentos e espaços culturais e recreativos)

Párodo
type: Concept
scope note: Espaço de entrada do coro no antigo teatro grego, podendo também designar as passagens laterais de acesso ao palco por onde o coro e o público entravam.
in scheme: Tesauro SIPA
preferred label: Parodoi @en
preferred label: Párodos @fr
broader: Compartimentos e espaços de acesso, circulação, distribuição e transição de pessoas (Compartimentos e espaços culturais e recreativos)

Praecinctio
type: Concept
in scheme: Tesauro SIPA
broader: Compartimentos e espaços de acesso, circulação, distribuição e transição de pessoas (Compartimentos e espaços culturais e recreativos)

Túnel de acesso (Compartimentos e espaços de acesso, circulação, distribuição e transição - Espaços culturais e recreativos)
type: Concept
in scheme: Tesauro SIPA
preferred label: Access tunnel @en
preferred label: Tunnel d'accès (Compartiments et espaces pour l'accès, la circulation, la distribution et la transition des personnes (Compartiments et espaces culturels et récréatifs)) @fr
preferred label: Tunnel di accesso (Compartimenti e spazi per l'accesso, la circolazione, la distribuzione e la transizione delle persone (Compartimenti e spazi culturali e ricreati)) @it
broader: Compartimentos e espaços de acesso, circulação, distribuição e transição de pessoas (Compartimentos e espaços culturais e recreativos)

Vomitório
type: Concept
in scheme: Tesauro SIPA
preferred label: Vomitory; Vomitorium @en
preferred label: Vomitoire @fr
preferred label: Vomitorio @it
broader: Compartimentos e espaços de acesso, circulação, distribuição e transição de pessoas (Compartimentos e espaços culturais e recreativos)

Compartimentos e espaços de armazenamento (Compartimentos e espaços culturais e recreativos)
type: Concept
in scheme: Tesauro SIPA
preferred label: Compartments and storage spaces (Cultural and recreational compartments and spaces) @en
preferred label: Compartiments et espaces de stockage (Compartiments et espaces culturels et récréatifs) @fr
preferred label: Compartimenti e spazi di stoccaggio (Compartimenti e spazi culturali e ricreativi) @it
broader: Compartimentos e espaços culturais e recreativos
narrower: Sala de reservados
narrower: Depósito de documentação (Compartimentos e espaços de armazenamento (Compartimentos e espaços culturais e recreativos))

Sala de reservados
type: Concept
in scheme: Tesauro SIPA
preferred label: Reserve room @en
preferred label: Salle de réservation @fr
preferred label: Camera di prenotazione @it
broader: Compartimentos e espaços de armazenamento (Compartimentos e espaços culturais e recreativos)

Depósito de documentação (Compartimentos e espaços de armazenamento (Compartimentos e espaços culturais e recreativos))
type: Concept
in scheme: Tesauro SIPA
preferred label: Documentation room (Compartments and storage spaces (Cultural and recreational compartments and spaces)) @en
preferred label: Salle de documentation (Compartiments et espaces de stockage (Compartiments et espaces culturels et récréatifs)) @fr
preferred label: Deposito documentazione (Compartimenti e spazi di stoccaggio (Compartimenti e spazi culturali e ricreativi)) @it
broader: Compartimentos e espaços de armazenamento (Compartimentos e espaços culturais e recreativos)
narrower: Depósito de quarentena
narrower: Depósito limpo
narrower: Depósito sujo
narrower: Sala de espólios
narrower: Sala de microfilmes

Depósito de quarentena
type: Concept
in scheme: Tesauro SIPA
preferred label: Quarentine deposit @en
preferred label: Dépôt de quarantaine @fr
preferred label: Magazzino di quarantena @it
broader: Depósito de documentação (Compartimentos e espaços de armazenamento (Compartimentos e espaços culturais e recreativos))

Depósito limpo
type: Concept
scope note: Tipo de depósito existente num arquivo, onde se guarda a documentação depois de tratada arquivisticamente.
in scheme: Tesauro SIPA
preferred label: Clean storage @en
preferred label: Dépôt propre @fr
preferred label: Deposito pulito @it
broader: Depósito de documentação (Compartimentos e espaços de armazenamento (Compartimentos e espaços culturais e recreativos))

Depósito sujo
type: Concept
scope note: Tipo de depósito existente num arquivo, onde se guarda a documentação que ainda não foi alvo de tratamento.
in scheme: Tesauro SIPA
preferred label: Dirty storage @en
preferred label: Dépôt non nettoyé @fr
preferred label: Deposito non pulito @it
broader: Depósito de documentação (Compartimentos e espaços de armazenamento (Compartimentos e espaços culturais e recreativos))

Sala de espólios
type: Concept
in scheme: Tesauro SIPA
preferred label: Collectionroom @en
preferred label: Salle des dépouilles @fr
preferred label: Sala di raccolta @it
broader: Depósito de documentação (Compartimentos e espaços de armazenamento (Compartimentos e espaços culturais e recreativos))

Sala de microfilmes
type: Concept
in scheme: Tesauro SIPA
preferred label: Microfilm room @en
preferred label: Salle des microfilms @fr
preferred label: Sala microfilm @it
broader: Depósito de documentação (Compartimentos e espaços de armazenamento (Compartimentos e espaços culturais e recreativos))

Compartimento e espaços de comunicação e de difusão de dados e registos (Compartimentos e espaços culturais e recreativos)
type: Concept
in scheme: Tesauro SIPA
preferred label: Communication and data dissemination compartments and spaces (Cultural and recreational compartments and spaces) @en
preferred label: Compartiments et espaces de communication et de diffusion de données (Compartiments et espaces culturels et récréatifs) @fr
preferred label: Compartimenti e spazi per la comunicazione e la diffusione dei dati (Compartimenti e spazi culturali e ricreativi) @it
broader: Compartimentos e espaços culturais e recreativos
narrower: Hemeroteca (Compartimento e espaços específicos de comunicação e de difusão de dados e registos)
narrower: Mapoteca
narrower: Memeroteca
narrower: Sala de empréstimos
narrower: Sala de intercâmbio entre bibliotecas
narrower: Sala de leitura

Hemeroteca (Compartimento e espaços específicos de comunicação e de difusão de dados e registos)
type: Concept
in scheme: Tesauro SIPA
preferred label: Newspaper library (Specific compartment and spaces for communication and dissemination of data and records) @en
preferred label: Hémérothèque (compartiments et espaces spécifiques pour la communication et la diffusion de données et de documents) @fr
preferred label: Emeroteca (Comparti e spazi specifici per la comunicazione e la divulgazione di dati e documenti) @it
broader: Compartimento e espaços de comunicação e de difusão de dados e registos (Compartimentos e espaços culturais e recreativos)

Mapoteca
type: Concept
scope note: Numa biblioteca, consiste no espaço de consulta e conservação de cartografia.
in scheme: Tesauro SIPA
preferred label: Map collection @en
preferred label: Cartothèque @fr
preferred label: Cartoteca @it
broader: Compartimento e espaços de comunicação e de difusão de dados e registos (Compartimentos e espaços culturais e recreativos)

Memeroteca
type: Concept
in scheme: Tesauro SIPA
preferred label: Comics collection @en
preferred label: Bibliothèque de bandes dessinées @fr
preferred label: Biblioteca di fumetti @it
broader: Compartimento e espaços de comunicação e de difusão de dados e registos (Compartimentos e espaços culturais e recreativos)

Sala de empréstimos
type: Concept
in scheme: Tesauro SIPA
preferred label: Borrowing room @en
preferred label: Salle de prêt @fr
preferred label: Sala prestiti @it
broader: Compartimento e espaços de comunicação e de difusão de dados e registos (Compartimentos e espaços culturais e recreativos)

Sala de intercâmbio entre bibliotecas
type: Concept
in scheme: Tesauro SIPA
preferred label: Interlibrary loan room @en
preferred label: Salle d'échange interbibliothèques @fr
preferred label: Sala di scambio tra biblioteche @it
broader: Compartimento e espaços de comunicação e de difusão de dados e registos (Compartimentos e espaços culturais e recreativos)

Sala de leitura
type: Concept
in scheme: Tesauro SIPA
preferred label: Reading room @en
preferred label: Salle de lecture @fr
preferred label: Sala di lettura @it
broader: Compartimento e espaços de comunicação e de difusão de dados e registos (Compartimentos e espaços culturais e recreativos)
narrower: Sala de leitura de cartografia
narrower: Sala de leitura de documentos legíveis por máquinas
narrower: Sala de leitura de iconografia
narrower: Sala de leitura de periódicos
narrower: Sala de leitura de reservados
narrower: Sala de leitura especial
narrower: Sala de leitura informal
narrower: Sala de música
narrower: Sala de numismática
narrower: Sala de referência

Sala de leitura de cartografia
type: Concept
in scheme: Tesauro SIPA
preferred label: Map reading room @en
preferred label: Salle de lecture de cartographie @fr
preferred label: Sala di lettura di cartografia @it
broader: Sala de leitura

Sala de leitura de documentos legíveis por máquinas
type: Concept
in scheme: Tesauro SIPA
preferred label: Machine-readable documents room @en
preferred label: Salle de lecture des documents lisibles par machine @fr
preferred label: Sala di lettura dei documenti a lettura ottica @it
broader: Sala de leitura
narrower: Filmoteca
narrower: Fonoteca (Sala de leitura de documentos legíveis por máquinas)
narrower: Sala de audição
narrower: Sala de audiovisuais
narrower: Sala de leitura de microfilmes
narrower: Sala de projeções
narrower: Videoteca

Filmoteca
type: Concept
in scheme: Tesauro SIPA
preferred label: Film library @en
preferred label: Filmothèque @fr
broader: Sala de leitura de documentos legíveis por máquinas

Fonoteca (Sala de leitura de documentos legíveis por máquinas)
type: Concept
in scheme: Tesauro SIPA
preferred label: Phonoteque (Sound library) (Machine-readable documents room) @en
preferred label: Phonotèque (Salle de lecture des documents lisibles par machine) @fr
preferred label: Fonoteca (Sala di lettura dei documenti a lettura ottica) @it
broader: Sala de leitura de documentos legíveis por máquinas

Sala de audição
type: Concept
in scheme: Tesauro SIPA
preferred label: Listening room @en
preferred label: Salle d'audition @fr
preferred label: Sala d'ascolto @it
broader: Sala de leitura de documentos legíveis por máquinas

Sala de audiovisuais
type: Concept
in scheme: Tesauro SIPA
preferred label: Audiovisual room @en
preferred label: Salle audiovisuelle @fr
preferred label: Sala audiovisivi @it
broader: Sala de leitura de documentos legíveis por máquinas

Sala de leitura de microfilmes
type: Concept
in scheme: Tesauro SIPA
preferred label: Microfilm reading room @en
preferred label: Salle de lecture de microfilms @fr
preferred label: Sala lettura microfilm @it
broader: Sala de leitura de documentos legíveis por máquinas

Sala de projeções
type: Concept
in scheme: Tesauro SIPA
preferred label: Screening room @en
preferred label: Salle de projection @fr
preferred label: Sala proiezioni @it
hidden label: Sala de projecções
broader: Sala de leitura de documentos legíveis por máquinas

Videoteca
type: Concept
in scheme: Tesauro SIPA
preferred label: Video library @en
preferred label: Vidéothèque @fr
broader: Sala de leitura de documentos legíveis por máquinas

Sala de leitura de iconografia
type: Concept
in scheme: Tesauro SIPA
preferred label: Iconography reading room @en
preferred label: Salle de lecture iconographique @fr
preferred label: Sala lettura iconografica @it
broader: Sala de leitura

Sala de leitura de periódicos
type: Concept
in scheme: Tesauro SIPA
preferred label: Periodical reading room @en
preferred label: Salle de lecture des revues @fr
preferred label: Sala lettura periodici @it
broader: Sala de leitura

Sala de leitura de reservados
type: Concept
in scheme: Tesauro SIPA
preferred label: Confidential reading room @en
preferred label: Salle de lecture des réservations @fr
preferred label: Sala di lettura riservata @it
broader: Sala de leitura

Sala de leitura especial
type: Concept
in scheme: Tesauro SIPA
preferred label: Special reading room @en
preferred label: Salle de lecture spéciale @fr
preferred label: Sala di lettura speciale @it
broader: Sala de leitura

Sala de leitura informal
type: Concept
in scheme: Tesauro SIPA
preferred label: Informal reading room @en
preferred label: Salle de lecture informelle @fr
preferred label: Sala di lettura informale @it
broader: Sala de leitura

Sala de música
type: Concept
in scheme: Tesauro SIPA
preferred label: Music room @en
preferred label: Salle de musique @fr
preferred label: Sala della musica @it
broader: Sala de leitura

Sala de numismática
type: Concept
in scheme: Tesauro SIPA
preferred label: Numismatics room @en
preferred label: Salle de numismatique @fr
preferred label: Sala di numismatica @it
broader: Sala de leitura

Sala de referência
type: Concept
in scheme: Tesauro SIPA
preferred label: Reference room @en
preferred label: Salle de référence @fr
preferred label: Sala di riferimento @it
broader: Sala de leitura

Compartimentos e espaços de processamento e de transformação de materiais e produtos (Compartimentos e espaços culturais e recreativos)
type: Concept
in scheme: Tesauro SIPA
preferred label: Compartments and spaces for processing and transforming materials and products (Specific cultural and recreational compartments and spaces) @en
broader: Compartimentos e espaços culturais e recreativos
narrower: Estúdio para pintura de cenários e telões
narrower: Zona de pré-arquivagem, restauro e encadernação

Estúdio para pintura de cenários e telões
type: Concept
in scheme: Tesauro SIPA
preferred label: Scenery and screens painting studio @en
preferred label: Atelier de peinture de décors et d'écrans @fr
preferred label: Studio per la pittura di scenografie e schermi @it
alternative label: Sala de pintura
broader: Compartimentos e espaços de processamento e de transformação de materiais e produtos (Compartimentos e espaços culturais e recreativos)

Zona de pré-arquivagem, restauro e encadernação
type: Concept
in scheme: Tesauro SIPA
preferred label: Pre-archiving, restoration and binding area @en
preferred label: Zone de pré-archivage, de restauration et de reliure @fr
preferred label: Area di pre-archiviazione, restauro e rilegatura @it
broader: Compartimentos e espaços de processamento e de transformação de materiais e produtos (Compartimentos e espaços culturais e recreativos)

Compartimentos e espaços de recolha, de produção e de processamento de dados e registos (Compartimentos e espaços culturais e recreativos)
type: Concept
in scheme: Tesauro SIPA
preferred label: Data and records collection, production and processing compartments and spaces (Specific cultural and recreational compartments and spaces) @en
preferred label: Compartiments et espaces de collecte, de production et de traitement de données et d'archives (compartiments et espaces culturels et récréatifs spécifiques) @fr
preferred label: Comparti e spazi per la raccolta, la produzione e l'elaborazione di dati e registrazioni (Comparti e spazi culturali e ricreativi specifici) @it
broader: Compartimentos e espaços culturais e recreativos
narrower: Gabinete do arquivista
narrower: Gabinete do bibliotecário

Gabinete do arquivista
type: Concept
in scheme: Tesauro SIPA
preferred label: Archivist's office @en
preferred label: Bureau de l'archiviste @fr
preferred label: Ufficio dell'archivista @it
broader: Compartimentos e espaços de recolha, de produção e de processamento de dados e registos (Compartimentos e espaços culturais e recreativos)

Gabinete do bibliotecário
type: Concept
in scheme: Tesauro SIPA
preferred label: Librarian’s office @en
preferred label: Bureau du bibliothécaire @fr
preferred label: Ufficio del bibliotecario @it
broader: Compartimentos e espaços de recolha, de produção e de processamento de dados e registos (Compartimentos e espaços culturais e recreativos)

Compartimentos e espaços de saúde e bem-estar
type: Concept
in scheme: Tesauro SIPA
preferred label: Assistance and healthcare compartments and spaces @en
preferred label: Compartiments et espaces de soins et de santé @fr
preferred label: Compartimenti e aree per la salute e l'assistenza @it
broader: Compartimentos e espaços específicos
narrower: Compartimentos e espaços de banho, de vestir e sanitários (Compartimentos e espaços de saúde e bem-estar)
narrower: Compartimento e espaços de dormida e de repouso (Compartimento e espaços de saúde e bem-estar)
narrower: Compartimentos e espaços de observação e análise, de experiência e diagnóstico técnico e científico (Compartimento e espaços de saúde e bem-estar)
narrower: Compartimentos e espaços de prevenção, de tratamento clínico e intervenção cirúrgica (Compartimento e espaços de saúde e bem-estar)

Compartimentos e espaços de banho, de vestir e sanitários (Compartimentos e espaços de saúde e bem-estar)
type: Concept
in scheme: Tesauro SIPA
preferred label: Bathing, dressing and sanitary compartments and spaces (Cultural and recreational compartments and spaces) @en
preferred label: Compartiments et espaces de baignade, d'habillage et sanitaires (Compartiments et espaces culturels et récréatifs) @fr
preferred label: Compartimenti e spazi per bagni, medicazioni e servizi igienici (Comparti e spazi culturali e ricreativi) @it
broader: Compartimentos e espaços de saúde e bem-estar
narrower: Apoditério
narrower: Caldário
narrower: Eleotésio
narrower: Frigidário
narrower: Laconicum
narrower: Tepidário

Apoditério
type: Concept
scope note: Espaço das antigas termas romanas, onde as pessoas se despiam e guardavam seus pertences antes de entrar nos banhos.
in scheme: Tesauro SIPA
preferred label: Dressing room @en
preferred label: Apoditerium @fr
preferred label: Apoditerio @it
broader: Compartimentos e espaços de banho, de vestir e sanitários (Compartimentos e espaços de saúde e bem-estar)

Caldário
type: Concept
scope note: Espaço onde, nas termas romanas, se encontram instalados os banhos de água quente.
in scheme: Tesauro SIPA
preferred label: Caldarium @en
preferred label: Calidario @it
broader: Compartimentos e espaços de banho, de vestir e sanitários (Compartimentos e espaços de saúde e bem-estar)

Eleotésio
type: Concept
scope note: Compartimento das termas romanas onde se aplicava azeite nos frequentadores.
in scheme: Tesauro SIPA
preferred label: Eleothesium @en
preferred label: Eleotesio @it
broader: Compartimentos e espaços de banho, de vestir e sanitários (Compartimentos e espaços de saúde e bem-estar)

Frigidário
type: Concept
scope note: Nas termas romanas, designa uma sala com piscina de água fria, onde os utilizadores se refrescavam após passarem pelos banhos quentes ou depois de realizarem atividades físicas.
in scheme: Tesauro SIPA
preferred label: Frigidarium @en
preferred label: Frigidario @it
broader: Compartimentos e espaços de banho, de vestir e sanitários (Compartimentos e espaços de saúde e bem-estar)

Laconicum
type: Concept
in scheme: Tesauro SIPA
broader: Compartimentos e espaços de banho, de vestir e sanitários (Compartimentos e espaços de saúde e bem-estar)

Tepidário
type: Concept
in scheme: Tesauro SIPA
preferred label: Tepidarium @en
preferred label: Tepidario @it
broader: Compartimentos e espaços de banho, de vestir e sanitários (Compartimentos e espaços de saúde e bem-estar)

Compartimento e espaços de dormida e de repouso (Compartimento e espaços de saúde e bem-estar)
type: Concept
in scheme: Tesauro SIPA
preferred label: Sleeping and resting compartments and spaces (Assistance and healthcare compartments and spaces) @en
preferred label: Compartiments et espaces de sommeil et de repos (Compartiments et espaces de soins et de santé) @fr
preferred label: Compartimenti e aree per dormire e riposare (Compartimenti e aree per la salute e l'assistenza) @it
broader: Compartimentos e espaços de saúde e bem-estar
narrower: Internato médico

Internato médico
type: Concept
in scheme: Tesauro SIPA
preferred label: Medical internship @en
preferred label: Internat médical (Stage) @fr
preferred label: Internato medico @it
broader: Compartimento e espaços de dormida e de repouso (Compartimento e espaços de saúde e bem-estar)

Compartimentos e espaços de observação e análise, de experiência e diagnóstico técnico e científico (Compartimento e espaços de saúde e bem-estar)
type: Concept
in scheme: Tesauro SIPA
preferred label: Observation and analysis, technical and scientific experimentation and diagnosis compartments and spaces (Assistance and healthcare compartments and spaces) @en
preferred label: Compartiments et espaces d'observation et d'analyse, d'expérience et de diagnostic technique et scientifique (Compartiments et espaces de soins et de santé) @fr
preferred label: Compartimenti e spazi per l'osservazione e l'analisi, per l'esperienza tecnica e scientifica e per la diagnosi (Comparti e spazi per la cura e la salute) @it
broader: Compartimentos e espaços de saúde e bem-estar
narrower: Gabinete de veterinário
narrower: Laboratório psicotécnico
narrower: Posto antropométrico

Gabinete de veterinário
type: Concept
in scheme: Tesauro SIPA
preferred label: Veterinary clinic @en
preferred label: Cabinet vétérinaire @fr
preferred label: Studio veterinario @it
broader: Compartimentos e espaços de observação e análise, de experiência e diagnóstico técnico e científico (Compartimento e espaços de saúde e bem-estar)

Laboratório psicotécnico
type: Concept
in scheme: Tesauro SIPA
preferred label: Psychotechnical laboratory @en
preferred label: Laboratoire psychométrique @fr
preferred label: Laboratorio psicotecnico @it
broader: Compartimentos e espaços de observação e análise, de experiência e diagnóstico técnico e científico (Compartimento e espaços de saúde e bem-estar)

Posto antropométrico
type: Concept
in scheme: Tesauro SIPA
preferred label: Antropometric station @en
preferred label: Station anthropométrique @fr
preferred label: Stazione antropometrica @it
alternative label: Sala de observação antropométrica
broader: Compartimentos e espaços de observação e análise, de experiência e diagnóstico técnico e científico (Compartimento e espaços de saúde e bem-estar)

Compartimentos e espaços de prevenção, de tratamento clínico e intervenção cirúrgica (Compartimento e espaços de saúde e bem-estar)
type: Concept
in scheme: Tesauro SIPA
preferred label: Compartments and spaces for prevention, clinical treatment and surgical intervention (Assistance and healthcare compartments and spaces) @en
preferred label: Compartiments et espaces de prévention, de traitement clinique et d'intervention chirurgicale (Compartiments et espaces d'assistance et de santé) @fr
preferred label: Compartimenti e spazi per la prevenzione, il trattamento clinico e l'intervento chirurgico (Comparti e spazi assistenziali e sanitari) @it
broader: Compartimentos e espaços de saúde e bem-estar
narrower: Ala de infetocontagioso
narrower: Ala de urgências
narrower: Berçário (Compartimentos e espaços específicos de prevenção, de tratamento clínico e intervenção cirúrgica)
narrower: Galeria de cura
narrower: Quarto de isolamento (Compartimentos e espaços específicos de prevenção, de tratamento clínico e intervenção cirúrgica)
narrower: Sala de abafo
narrower: Sala de cuidados intensivos
narrower: Sala de emanatório
narrower: Sala de gargarejos
narrower: Sala de hemodiálise
narrower: Sala de inalações
narrower: Sala de massagens
narrower: Sala de operações
narrower: Sala de partos
narrower: Sala de quimioterapia
narrower: Sala de radiologia
narrower: Sala de tratamento ambulatório

Ala de infetocontagioso
type: Concept
scope note: Parte não autónoma de um edifício hospitalar destinada exclusivamente para o atendimento de pacientes com suspeita ou confirmação de determinada doença infectocontagiosa.
in scheme: Tesauro SIPA
preferred label: Infetocontagious diseases ward @en
preferred label: Service des maladies infectieuses @fr
preferred label: Reparto malattie infettive @it
hidden label: Ala de infectocontagioso
broader: Compartimentos e espaços de prevenção, de tratamento clínico e intervenção cirúrgica (Compartimento e espaços de saúde e bem-estar)

Ala de urgências
type: Concept
scope note: Parte não autónoma de um edifício hospitalar, destinado a receber os casos urgentes e potencialmente graves, onde o tempo de resposta é crucial. É dotado de receção, gabinetes de triagem, gabinetes de atendimento, sala de estabilização, onde se fornecem cuidados intensivos, bem como de tecnologia médica avançada, contando com uma equipe de profissionais de saúde (médicos, enfermeiros, técnicos) preparados para lidar com emergências. Coordena o encaminhamento de pacientes para outros serviços ou unidades hospitalares quando necessário.
in scheme: Tesauro SIPA
preferred label: Emergency ward @en
preferred label: Service des urgences @fr
preferred label: Reparto di emergenza @it
broader: Compartimentos e espaços de prevenção, de tratamento clínico e intervenção cirúrgica (Compartimento e espaços de saúde e bem-estar)

Berçário (Compartimentos e espaços específicos de prevenção, de tratamento clínico e intervenção cirúrgica)
type: Concept
scope note: Compartimento em contexto hospitalar onde se encontram os bebés após o nascimento.
in scheme: Tesauro SIPA
preferred label: Neonatal unit (Specific compartments and spaces for prevention, clinical treatment and surgical intervention) @en
preferred label: Pouponnière (Compartiments et espaces spécifiques pour la prévention, le traitement clinique et l'intervention chirurgicale) @fr
preferred label: Vivaio (Asilo nido) (Compartimenti e spazi generali per il sonno e il riposo) @it
broader: Compartimentos e espaços de prevenção, de tratamento clínico e intervenção cirúrgica (Compartimento e espaços de saúde e bem-estar)

Galeria de cura
type: Concept
in scheme: Tesauro SIPA
preferred label: Healing room @en
preferred label: Salle de soins @fr
preferred label: Sala di cura @it
broader: Compartimentos e espaços de prevenção, de tratamento clínico e intervenção cirúrgica (Compartimento e espaços de saúde e bem-estar)

Quarto de isolamento (Compartimentos e espaços específicos de prevenção, de tratamento clínico e intervenção cirúrgica)
type: Concept
in scheme: Tesauro SIPA
preferred label: Isolation room (Specific compartments and paces for prevention, clinical treatment and surgery) @en
preferred label: Salle d'isolement (Salles et espaces spécifiques pour la prévention, le traitement clinique et l'intervention chirurgicale) @fr
preferred label: Sala di isolamento (Compartimenti e spazi specifici per la prevenzione, il trattamento clinico e l'intervento chirurgico) @it
broader: Compartimentos e espaços de prevenção, de tratamento clínico e intervenção cirúrgica (Compartimento e espaços de saúde e bem-estar)

Sala de abafo
type: Concept
in scheme: Tesauro SIPA
preferred label: Muffler room @en
broader: Compartimentos e espaços de prevenção, de tratamento clínico e intervenção cirúrgica (Compartimento e espaços de saúde e bem-estar)
narrower: Sala de grande abafo
narrower: Sala de pequeno abafo

Sala de grande abafo
type: Concept
in scheme: Tesauro SIPA
preferred label: Great muffler room @en
broader: Sala de abafo

Sala de pequeno abafo
type: Concept
in scheme: Tesauro SIPA
preferred label: Little muffler room @en
broader: Sala de abafo

Sala de cuidados intensivos
type: Concept
in scheme: Tesauro SIPA
preferred label: Intensive care room @en
preferred label: Salle de soins intensifs @fr
preferred label: Sala di terapia intensiva @it
broader: Compartimentos e espaços de prevenção, de tratamento clínico e intervenção cirúrgica (Compartimento e espaços de saúde e bem-estar)

Sala de emanatório
type: Concept
in scheme: Tesauro SIPA
preferred label: Emanation room @en
broader: Compartimentos e espaços de prevenção, de tratamento clínico e intervenção cirúrgica (Compartimento e espaços de saúde e bem-estar)

Sala de gargarejos
type: Concept
in scheme: Tesauro SIPA
preferred label: Garglig room @en
preferred label: Salle des gargarismes @fr
preferred label: Sala gargarismi @it
broader: Compartimentos e espaços de prevenção, de tratamento clínico e intervenção cirúrgica (Compartimento e espaços de saúde e bem-estar)

Sala de hemodiálise
type: Concept
in scheme: Tesauro SIPA
preferred label: Hemodialysis room @en
preferred label: Salle d'hémodialyse @fr
preferred label: Sala emodialisi @it
broader: Compartimentos e espaços de prevenção, de tratamento clínico e intervenção cirúrgica (Compartimento e espaços de saúde e bem-estar)

Sala de inalações
type: Concept
in scheme: Tesauro SIPA
preferred label: Inhalation room @en
preferred label: Salle d'inhalation @fr
preferred label: Sala inalazioni @it
broader: Compartimentos e espaços de prevenção, de tratamento clínico e intervenção cirúrgica (Compartimento e espaços de saúde e bem-estar)

Sala de massagens
type: Concept
in scheme: Tesauro SIPA
preferred label: Massage room @en
preferred label: Salle de massage @fr
preferred label: Sala massaggi @it
broader: Compartimentos e espaços de prevenção, de tratamento clínico e intervenção cirúrgica (Compartimento e espaços de saúde e bem-estar)

Sala de operações
type: Concept
in scheme: Tesauro SIPA
preferred label: Operating room @en
preferred label: Bloc opératoire @fr
preferred label: Sala operatoria @it
broader: Compartimentos e espaços de prevenção, de tratamento clínico e intervenção cirúrgica (Compartimento e espaços de saúde e bem-estar)

Sala de partos
type: Concept
in scheme: Tesauro SIPA
preferred label: Delivery room @en
preferred label: Salle d'accouchement @fr
preferred label: Sala parto @it
broader: Compartimentos e espaços de prevenção, de tratamento clínico e intervenção cirúrgica (Compartimento e espaços de saúde e bem-estar)

Sala de quimioterapia
type: Concept
in scheme: Tesauro SIPA
preferred label: Chemotherapy room @en
preferred label: Salle de chimiothérapie @fr
preferred label: Sala chemioterapia @it
broader: Compartimentos e espaços de prevenção, de tratamento clínico e intervenção cirúrgica (Compartimento e espaços de saúde e bem-estar)

Sala de radiologia
type: Concept
in scheme: Tesauro SIPA
preferred label: Radiology room @en
preferred label: Salle de radiologie @fr
preferred label: Sala di radiologia @it
broader: Compartimentos e espaços de prevenção, de tratamento clínico e intervenção cirúrgica (Compartimento e espaços de saúde e bem-estar)

Sala de tratamento ambulatório
type: Concept
in scheme: Tesauro SIPA
preferred label: Outpatient treatment room @en
preferred label: Salle de traitement ambulatoire @fr
preferred label: Sala per trattamenti ambulatoriali @it
broader: Compartimentos e espaços de prevenção, de tratamento clínico e intervenção cirúrgica (Compartimento e espaços de saúde e bem-estar)

Compartimentos e espaços de transportes
type: Concept
in scheme: Tesauro SIPA
preferred label: Communications and transport rooms and spaces @en
preferred label: Compartiments et espaces de communication et de transport @fr
preferred label: Compartimenti e spazi di comunicazione e trasporto @it
broader: Compartimentos e espaços específicos
narrower: Compartimentos e espaços de acesso, circulação distribuição e transição (Compartimentos e espaços de transportes)
narrower: Compartimentos e espaços de monitorização e de controlo (Compartimentos e espaços de transportes)

Compartimentos e espaços de acesso, circulação distribuição e transição (Compartimentos e espaços de transportes)
type: Concept
in scheme: Tesauro SIPA
preferred label: Access, circulation, distribution and transition compartments and spaces (Communications and transport compartments and spaces) @en
preferred label: Compartiments et espaces d'accès, de circulation, de distribution et de transition (Compartiments et espaces de communication et de transport) @fr
preferred label: Compartimenti e spazi di accesso, circolazione, distribuzione e transizione (Comparti e spazi di comunicazione e trasporto) @it
broader: Compartimentos e espaços de transportes
narrower: Zona de bagagens
narrower: Zona de chegadas
narrower: Zona de embarque

Zona de bagagens
type: Concept
in scheme: Tesauro SIPA
preferred label: Baggage area @en
preferred label: Zone d'embarquement des bagages @fr
preferred label: Sala bagagli @it
broader: Compartimentos e espaços de acesso, circulação distribuição e transição (Compartimentos e espaços de transportes)

Zona de chegadas
type: Concept
in scheme: Tesauro SIPA
preferred label: Arrivals area @en
preferred label: Zone d'arrivée @fr
preferred label: Sala arrivi @it
broader: Compartimentos e espaços de acesso, circulação distribuição e transição (Compartimentos e espaços de transportes)

Zona de embarque
type: Concept
in scheme: Tesauro SIPA
preferred label: Boarding area @en
preferred label: Zone d'embarquement @fr
preferred label: Area imbarchi @it
broader: Compartimentos e espaços de acesso, circulação distribuição e transição (Compartimentos e espaços de transportes)

Compartimentos e espaços de monitorização e de controlo (Compartimentos e espaços de transportes)
type: Concept
in scheme: Tesauro SIPA
preferred label: Monitoring and control compartments and spaces (Communication and transport specific compartments and spaces) @en
preferred label: Compartiments et espaces de contrôle et de surveillance (Compartiments et espaces spécifiques aux communications et aux transports) @fr
preferred label: Compartimenti e spazi di monitoraggio e controllo (Compartimenti e spazi specifici per le comunicazioni e i trasporti) @it
broader: Compartimentos e espaços de transportes
narrower: Sala de trânsitos
narrower: Sala do chefe de estação
narrower: Zona de controlo de passaportes
narrower: Zona de controlo de passageiros

Sala de trânsitos
type: Concept
in scheme: Tesauro SIPA
preferred label: Transit room @en
preferred label: Salle de transit @fr
preferred label: Sala del transito @it
broader: Compartimentos e espaços de monitorização e de controlo (Compartimentos e espaços de transportes)

Sala do chefe de estação
type: Concept
in scheme: Tesauro SIPA
preferred label: Stationmaster’s office @en
preferred label: Bureau du chef de gare @fr
preferred label: Ufficio del capostazione @it
broader: Compartimentos e espaços de monitorização e de controlo (Compartimentos e espaços de transportes)

Zona de controlo de passaportes
type: Concept
in scheme: Tesauro SIPA
preferred label: Passport control area @en
preferred label: Zone de contrôle des passeports @fr
preferred label: Area controllo passaporti @it
broader: Compartimentos e espaços de monitorização e de controlo (Compartimentos e espaços de transportes)

Zona de controlo de passageiros
type: Concept
in scheme: Tesauro SIPA
preferred label: Passenger control area @en
preferred label: Zone de contrôle des passagers @fr
preferred label: Area controllo passeggeri @it
broader: Compartimentos e espaços de monitorização e de controlo (Compartimentos e espaços de transportes)

Compartimentos e espaços educativos e formativos
type: Concept
in scheme: Tesauro SIPA
preferred label: Educational and training compartments and spaces @en
preferred label: Compartiments et espaces d'éducation et de formation @fr
preferred label: Compartimenti e spazi per l'istruzione e la formazione @it
broader: Compartimentos e espaços específicos
narrower: Compartimentos e espaços de dormida e de repouso (Compartimentos e espaços educativos e formativos)
narrower: Compartimentos e espaços de educação (Compartimentos e espaços educativos e formativos)
narrower: Compartimentos e espaços de estar e de convívio social (Compartimentos e espaços educativos e formativos)
narrower: Compartimentos e espaços de exposição (Compartimentos e espaços educativos e formativos)

Compartimentos e espaços de dormida e de repouso (Compartimentos e espaços educativos e formativos)
type: Concept
in scheme: Tesauro SIPA
preferred label: Sleeping and resting compartments and spaces (Educational and training compartments and spaces) @en
preferred label: Compartiments et espaces de couchage et de sommeil (Compartiments et espaces d'éducation et de formation) @fr
preferred label: Compartimenti e spazi per dormire e riposare (Compartimenti e spazi per l'istruzione e la formazione) @it
broader: Compartimentos e espaços educativos e formativos
narrower: Quarto do precetor

Quarto do precetor
type: Concept
in scheme: Tesauro SIPA
preferred label: Preceptor's room @en
preferred label: Chambre du précepteur @fr
preferred label: Camera da letto del precettore @it
hidden label: Quarto do preceptor
broader: Compartimentos e espaços de dormida e de repouso (Compartimentos e espaços educativos e formativos)

Compartimentos e espaços de educação (Compartimentos e espaços educativos e formativos)
type: Concept
in scheme: Tesauro SIPA
preferred label: Educational compartments and spaces (Educational and training compartments and spaces) @en
preferred label: Compartiments et espaces éducatifs (Compartiments et espaces d'éducation et de formation) @fr
preferred label: Compartimenti e spazi per l'istruzione (Compartimenti e spazi per l'istruzione e la formazione) @it
broader: Compartimentos e espaços educativos e formativos

Atelier de expressão
type: Concept
scope note: Numa biblioteca pública, espaço infantil onde se desenvolvem atividades ligadas à expressão plástica, como colagens, pintura ou desenhos. O atelier de expressão contém, geralmente, uma mesa grande ou bancas de trabalho, um lavatório com água corrente e armários onde são guardados os materiais utilizados.
in scheme: Tesauro SIPA
preferred label: Expression workshop @en
preferred label: Atelier d'expression @fr
preferred label: Laboratorio di espressione @it
narrower: Sala de atos
narrower: Sala de aula de geografia
narrower: Sala de aula de geometria
narrower: Sala de doutoramentos
narrower: Sala de educação musical
narrower: Sala de educação tecnológica
narrower: Sala de exames
narrower: Sala de ensino de informática
narrower: Sala de mestrados
narrower: Sala de trabalhos manuais

Sala de atos
type: Concept
in scheme: Tesauro SIPA
preferred label: Hall of acts (Plenary chamber) @en
preferred label: Salle des actes @fr
preferred label: Sala degli atti @it
hidden label: Sala de actos
broader: Atelier de expressão

Sala de aula de geografia
type: Concept
in scheme: Tesauro SIPA
preferred label: Geography classroom @en
preferred label: Salle de géographie @fr
preferred label: Aula di geografia @it
broader: Atelier de expressão

Sala de aula de geometria
type: Concept
in scheme: Tesauro SIPA
preferred label: Geometry classroom @en
preferred label: Salle de géométrie @fr
preferred label: Aula di geometria @it
broader: Atelier de expressão

Sala de doutoramentos
type: Concept
in scheme: Tesauro SIPA
preferred label: PhD room @en
preferred label: Salle de doctorat @fr
preferred label: Aula del dottorato @it
broader: Atelier de expressão

Sala de educação musical
type: Concept
scope note: Espaço localizado em estabelecimentos escolares, onde sejam ministrados os 2.º e 3.º ciclos do ensino básico, destinado à educação musical, podendo também ser utilizado para recitais ou ensaios de música.
in scheme: Tesauro SIPA
preferred label: Musical education classroom @en
preferred label: Salle d'éducation musicale @fr
preferred label: Aula di educazione musicale @it
broader: Atelier de expressão

Sala de educação tecnológica
type: Concept
scope note: Num estabelecimento de ensino básico, local destinado à disciplina de Educação Visual e Tecnológica, do 2.º ciclo, e às disciplinas de Educação Visual e Educação Tecnológica, do 3.º ciclo. Este espaço, geralmente amplo, é concebido de forma a poderem ser desenvolvidas diversas atividades práticas, que necessitam de áreas diferenciadas, como trabalhos desenvolvidos com eletrónica, eletricidade, madeira, metais, desenho, cor e textura, manuseamento de barro ou outras pastas, fotografia, impressão, tecelagem, ou ainda, exercícios ligados à preservação do ambiente.
in scheme: Tesauro SIPA
preferred label: Technology education classroom @en
preferred label: Salle d'éducation technologique @fr
preferred label: Aula di educazione tecnologica @it
broader: Atelier de expressão

Sala de exames
type: Concept
in scheme: Tesauro SIPA
preferred label: Examination room @en
preferred label: Salle d'examens @fr
preferred label: Aula esami @it
broader: Atelier de expressão

Sala de ensino de informática
type: Concept
in scheme: Tesauro SIPA
preferred label: Computer teaching room @en
preferred label: Salle de cours d'informatique @fr
preferred label: Aula didattica di informatica @it
broader: Atelier de expressão

Sala de mestrados
type: Concept
in scheme: Tesauro SIPA
preferred label: Master's degree room @en
preferred label: Salle des cours de maîtrise @fr
preferred label: Sala di laurea di secondo livello/magistrale/ master @it
broader: Atelier de expressão

Sala de trabalhos manuais
type: Concept
scope note: Espaço existente em antigos estabelecimentos de ensino preparatório, destinado a atividades ligadas ao estudo de materiais como argilas, madeira, têxteis, papel e metais, à planificação de trabalhos e respetiva execução.
in scheme: Tesauro SIPA
preferred label: Crafts room @en
preferred label: Salle d'artisanat @fr
preferred label: Sala dell'artigianato @it
broader: Atelier de expressão

Compartimentos e espaços de estar e de convívio social (Compartimentos e espaços educativos e formativos)
type: Concept
in scheme: Tesauro SIPA
preferred label: Living and socialising compartments and spaces (Educational and training compartments and spaces) @en
preferred label: Compartiments et espaces de vie et de socialisation (Compartiments et espaces d'éducation et de formation) @fr
preferred label: Compartimenti e spazi di vita e socializzazione (Compartimenti e spazi per l'istruzione e la formazione) @it
broader: Compartimentos e espaços educativos e formativos
narrower: Sala de alunos
narrower: Sala de professores

Sala de alunos
type: Concept
in scheme: Tesauro SIPA
preferred label: Students room @en
preferred label: Salle des élèves @fr
preferred label: Stanza degli alunni @it
broader: Compartimentos e espaços de estar e de convívio social (Compartimentos e espaços educativos e formativos)

Sala de professores
type: Concept
in scheme: Tesauro SIPA
preferred label: Teachers room @en
preferred label: Salle des professeurs @fr
preferred label: Sala insegnanti @it
broader: Compartimentos e espaços de estar e de convívio social (Compartimentos e espaços educativos e formativos)

Compartimentos e espaços de exposição (Compartimentos e espaços educativos e formativos)
type: Concept
in scheme: Tesauro SIPA
preferred label: Exhibition compartments and spaces (Educational and training compartments and spaces) @en
preferred label: Compartiments et espaces d'exposition (Compartiments et espaces d'éducation et de formation) @fr
preferred label: Sale e spazi espositivi (Compartimenti e spazi per l'istruzione e la formazione) @it
broader: Compartimentos e espaços educativos e formativos
narrower: Museu escolar

Museu escolar
type: Concept
in scheme: Tesauro SIPA
preferred label: School museum @en
preferred label: Musée de l'école @fr
preferred label: Museo della scuola @it
alternative label: Gabinete de lições de coisas
alternative label: Museu maternal
broader: Compartimentos e espaços de exposição (Compartimentos e espaços educativos e formativos)

Compartimentos e espaços funerários
type: Concept
in scheme: Tesauro SIPA
preferred label: Funeral compartments and spaces @en
preferred label: Compartiments et espaces funéraires @fr
preferred label: Compartimenti e spazi funerari @it
broader: Compartimentos e espaços específicos
narrower: Compartimentos e espaços de culto e devoção (Compartimentos e espaços funerários)
narrower: Compartimentos e espaços de inumação (Compartimentos e espaços funerários)

Compartimentos e espaços de culto e devoção (Compartimentos e espaços funerários)
type: Concept
in scheme: Tesauro SIPA
preferred label: Compartments and spaces for worship and devotion (Funerary compartments and spaces) @en
preferred label: Compartiments et espaces de culte et de dévotion (Compartiments et espaces funéraires) @fr
preferred label: Compartimenti e spazi per il culto e la devozione (Compartimenti e spazi funerari) @it
broader: Compartimentos e espaços funerários
narrower: Capela mortuária (Compartimentos e espaços específicos de culto e devoção)
narrower: Sala de velório

Capela mortuária (Compartimentos e espaços específicos de culto e devoção)
type: Concept
in scheme: Tesauro SIPA
preferred label: Mortuary chapel (Specific compartments and spaces for worship and devotion) @en
preferred label: Chapelle mortuaire (Compartiments et espaces spécifiques pour le culte et la dévotion) @fr
preferred label: Cappella funeraria (Compartimenti e spazi specifici per il culto e la devozione) @it
alternative label: Casa mortuária
broader: Compartimentos e espaços de culto e devoção (Compartimentos e espaços funerários)

Sala de velório
type: Concept
in scheme: Tesauro SIPA
preferred label: Wake room @en
preferred label: Salon funéraire @fr
preferred label: Sala funeraria @it
broader: Compartimentos e espaços de culto e devoção (Compartimentos e espaços funerários)

Compartimentos e espaços de inumação (Compartimentos e espaços funerários)
type: Concept
in scheme: Tesauro SIPA
preferred label: Burial compartments and spaces (Funerary compartments and spaces) @en
preferred label: Compartiments et espaces funéraires (Compartiments et espaces funéraires) @fr
preferred label: Compartimenti e spazi di sepoltura (Compartimenti e spazi funerari) @it
broader: Compartimentos e espaços funerários
narrower: Câmara (Compartimentos e espaços de inumação)
narrower: Capela funerária
narrower: Carneiro
narrower: Columbário (Compartimentos e espaços de inumação)
narrower: Cripta (Compartimentos e espaços de inumação (Compartimentos e espaços funerários))
narrower: Ossário

Câmara (Compartimentos e espaços de inumação)
type: Concept
in scheme: Tesauro SIPA
preferred label: Chamber (Inhumation compartments and spaces) @en
preferred label: Chambre (Compartiments et espaces d'inhumation) @fr
preferred label: Camera (Compartimenti e spazi per le inumazioni) @it
broader: Compartimentos e espaços de inumação (Compartimentos e espaços funerários)

Capela funerária
type: Concept
scope note: Espaço adossado ou integrado numa igreja ou num hospital, onde são realizados os velórios.
in scheme: Tesauro SIPA
preferred label: Funeral chapel @en
preferred label: Chapelle funéraire @fr
preferred label: Cappella funeraria @it
broader: Compartimentos e espaços de inumação (Compartimentos e espaços funerários)

Carneiro
type: Concept
scope note: Numa igreja, constitui uma galeria ou compartimento funerário subterrâneo, normalmente abobadado, onde eram colocados cadáveres e ossadas.
in scheme: Tesauro SIPA
preferred label: Ossuary (Charnel house) @en
preferred label: Maison charnière (Ossuaire) @fr
preferred label: Ossario @it
broader: Compartimentos e espaços de inumação (Compartimentos e espaços funerários)

Columbário (Compartimentos e espaços de inumação)
type: Concept
scope note: Num cemitério que possua um crematório, local com pequenos compartimentos onde são depositadas urnas com cinzas, após a cremação de um cadáver.
in scheme: Tesauro SIPA
preferred label: Columbarium (Inhumation compartments and spaces) @en
preferred label: Columbarium (Compartiments et espaces d'inhumation) @fr
preferred label: Columbarium (Compartimenti e spazi per le inumazioni) @it
broader: Compartimentos e espaços de inumação (Compartimentos e espaços funerários)

Cripta (Compartimentos e espaços de inumação (Compartimentos e espaços funerários))
type: Concept
scope note: Espaço subterrâneo ou semi-subterrâneo, de um modo geral abobadado, destinado a enterramento e a veneração e depósito de relíquias, localizado sob o pavimento de uma igreja. No período Românico chega a atingir dimensões consideráveis, possuindo deambulatório, cruzeiro e naves, formando uma verdadeira igreja subterrânea. Na cripta, para além dos mártires, tinham sepultura altos dignitários, eclesiásticos ou civis, como reis ou abades.
in scheme: Tesauro SIPA
preferred label: Crypt (Burial compartments and spaces (Funerary compartments and spaces)) @en
preferred label: Crypte (Compartiments et espaces funéraires (Compartiments et espaces funéraires)) @fr
preferred label: Cripta (Compartimenti e spazi di sepoltura (Compartimenti e spazi funerari)) @it
broader: Compartimentos e espaços de inumação (Compartimentos e espaços funerários)
narrower: Confissão

Confissão
type: Concept
scope note: Denominação atribuída inicialmente ao local de enterramento de um mártir, estendendo-se, de uma forma gradual, à cripta que continha o túmulo de um mártir, localizada nas igrejas medievais sob a capela-mor e em correspondência, na vertical, com o altar.
in scheme: Tesauro SIPA
preferred label: Confession @en
preferred label: Confessione @it
broader: Cripta (Compartimentos e espaços de inumação (Compartimentos e espaços funerários))

Ossário
type: Concept
scope note: Num cemitério, local ou construção destinado a acolher urnas com ossadas, normalmente após a exumação, ou corpos de pequenas dimensões, de um modo geral, em compartimentos ou células. Esta designação é por vezes também atribuída a nichos existentes nas paredes de igrejas que contenham ossadas.
in scheme: Tesauro SIPA
preferred label: Ossario @it
preferred label: Ossuary @en
preferred label: Ossuaire @fr
broader: Compartimentos e espaços de inumação (Compartimentos e espaços funerários)

Compartimentos e espaços industriais
type: Concept
in scheme: Tesauro SIPA
preferred label: Industrial compartments and spaces @en
preferred label: Compartiments et espaces industriels @fr
preferred label: Compartimenti e spazi industriali @it
broader: Compartimentos e espaços específicos
narrower: Compartimentos e espaços de processamento e de transformação de materiais e produtos (Compartimentos e espaços industriais)

Compartimentos e espaços de processamento e de transformação de materiais e produtos (Compartimentos e espaços industriais)
type: Concept
in scheme: Tesauro SIPA
preferred label: Compartments and spaces for processing and transformation of material and products (Agricultural compartments and spaces) @en
preferred label: Compartiments et espaces pour le traitement et la transformation des matières et produits (Compartiments et espaces agricoles) @fr
preferred label: Compartimenti e spazi per la lavorazione e la trasformazione di materiali e prodotti (Compartimenti e spazi agricoli) @it
broader: Compartimentos e espaços industriais
narrower: Casa da chamusca
narrower: Casa das peles
narrower: Sala de enxugo
narrower: Sala de matança
narrower: Triparia

Casa da chamusca
type: Concept
in scheme: Tesauro SIPA
preferred label: Scorch house @en
preferred label: Maison de flambage @fr
preferred label: Casa della flambatura @it
broader: Compartimentos e espaços de processamento e de transformação de materiais e produtos (Compartimentos e espaços industriais)

Casa das peles
type: Concept
in scheme: Tesauro SIPA
preferred label: Fur house @en
preferred label: Maison de la fourrure @fr
preferred label: Casa delle pellicce @it
broader: Compartimentos e espaços de processamento e de transformação de materiais e produtos (Compartimentos e espaços industriais)

Sala de enxugo
type: Concept
in scheme: Tesauro SIPA
preferred label: Drying room @en
preferred label: Salle de séchage @fr
preferred label: Sala di asciugatura @it
broader: Compartimentos e espaços de processamento e de transformação de materiais e produtos (Compartimentos e espaços industriais)

Sala de matança
type: Concept
in scheme: Tesauro SIPA
preferred label: Slaughterhouse @en
preferred label: Abattoir @fr
preferred label: Mattatoio @it
broader: Compartimentos e espaços de processamento e de transformação de materiais e produtos (Compartimentos e espaços industriais)

Triparia
type: Concept
in scheme: Tesauro SIPA
preferred label: Tripe shop @en
preferred label: Triperie @fr
preferred label: Tripperia @it
broader: Compartimentos e espaços de processamento e de transformação de materiais e produtos (Compartimentos e espaços industriais)

Compartimentos e espaços judiciais
type: Concept
in scheme: Tesauro SIPA
preferred label: Judicial compartments and spaces @en
preferred label: Compartiments et espaces judiciaires @fr
preferred label: Compartimenti e spazi giudiziari @it
broader: Compartimentos e espaços específicos
narrower: Compartimentos e espaços específicos de acesso, circulação, distribuição e transição (Compartimentos e espaços judiciais)
narrower: Compartimentos e espaços de recolha, de produção e de processamento de dados e registos (Compartimentos e espaços específicos judiciais)
narrower: Compartimentos e espaços de reunião e assembleia (Compartimentos e espaços específicos judiciais)

Compartimentos e espaços específicos de acesso, circulação, distribuição e transição (Compartimentos e espaços judiciais)
type: Concept
in scheme: Tesauro SIPA
preferred label: Generic access, circulation, distribution and transition compartments and spaces (Judicial compartments and spaces) @en
preferred label: Compartiments et espaces génériques d'accès, de circulation, de distribution et de transition (Compartiments et espaces judiciaires) @fr
preferred label: Compartimenti e spazi generici di accesso, circolazione, distribuzione e transizione (Compartimenti e spazi giudiziari) @it
broader: Compartimentos e espaços judiciais
narrower: Sala de testemunhas

Sala de testemunhas
type: Concept
scope note: Num tribunal, espaço onde as testemunhas num processo judicial aguardam o momento em que serão chamadas a depor na sala de audiências.
in scheme: Tesauro SIPA
preferred label: Witness room @en
preferred label: Salle des témoins @fr
preferred label: Stanza del testimone @it
broader: Compartimentos e espaços específicos de acesso, circulação, distribuição e transição (Compartimentos e espaços judiciais)

Compartimentos e espaços de recolha, de produção e de processamento de dados e registos (Compartimentos e espaços específicos judiciais)
type: Concept
in scheme: Tesauro SIPA
preferred label: Data and records collection, production and processing compartments and spaces (Judicial compartments and spaces) @en
preferred label: Compartiments et espaces de collecte, de production et de traitement des données et des enregistrements (Compartiments et espaces judiciaires) @fr
preferred label: Compartimenti e spazi per la raccolta, la produzione e l'elaborazione di dati e registrazioni (Compartimenti e spazi giudiziari) @it
broader: Compartimentos e espaços judiciais
narrower: Gabinete de advogados
narrower: Gabinete de magistrados
narrower: Gabinete do curador de menores
narrower: Gabinete do delegado de vigilância
narrower: Gabinete para instrução de processos
narrower: Secretaria judicial

Gabinete de advogados
type: Concept
scope note: Num tribunal, espaço onde os advogados podem reunir com os elementos direta ou indiretamente associados a um processo judicial (caso dos arguidos ou das testemunhas).
in scheme: Tesauro SIPA
preferred label: Lawyers’ offices @en
preferred label: Bureau d'avocats @fr
preferred label: Studio legale @it
broader: Compartimentos e espaços de recolha, de produção e de processamento de dados e registos (Compartimentos e espaços específicos judiciais)

Gabinete de magistrados
type: Concept
scope note: Num tribunal, sala de trabalho reservada aos procuradores da República (representantes do Ministério Público) e juízes.
in scheme: Tesauro SIPA
preferred label: Magistrates’ office @en
preferred label: Bureau des magistrats @fr
preferred label: Ufficio del magistrato @it
broader: Compartimentos e espaços de recolha, de produção e de processamento de dados e registos (Compartimentos e espaços específicos judiciais)
narrower: Gabinete do juiz

Gabinete do juiz
type: Concept
in scheme: Tesauro SIPA
preferred label: Judge’s office @en
preferred label: Bureau du juge @fr
preferred label: Ufficio del giudice @it
broader: Gabinete de magistrados

Gabinete do curador de menores
type: Concept
in scheme: Tesauro SIPA
preferred label: Curator of minors’ office @en
preferred label: Bureau du curateur des mineurs @fr
preferred label: Ufficio del curatore minorile @it
broader: Compartimentos e espaços de recolha, de produção e de processamento de dados e registos (Compartimentos e espaços específicos judiciais)

Gabinete do delegado de vigilância
type: Concept
in scheme: Tesauro SIPA
preferred label: Surveillance deputy office @en
preferred label: Bureau du délégué à la surveillance @fr
preferred label: Ufficio del delegato alla vigilanza @it
broader: Compartimentos e espaços de recolha, de produção e de processamento de dados e registos (Compartimentos e espaços específicos judiciais)

Gabinete para instrução de processos
type: Concept
in scheme: Tesauro SIPA
preferred label: Judicial enquiry office @en
preferred label: Bureau de traitement des dossiers @fr
preferred label: Ufficio di trattamento dei fascicoli @it
broader: Compartimentos e espaços de recolha, de produção e de processamento de dados e registos (Compartimentos e espaços específicos judiciais)

Secretaria judicial
type: Concept
in scheme: Tesauro SIPA
preferred label: Judicial secretariat @en
preferred label: Greffe du tribunal @fr
preferred label: Cancelleria del tribunale (Segreteria giudiziaria) @it
broader: Compartimentos e espaços de recolha, de produção e de processamento de dados e registos (Compartimentos e espaços específicos judiciais)

Compartimentos e espaços de reunião e assembleia (Compartimentos e espaços específicos judiciais)
type: Concept
in scheme: Tesauro SIPA
preferred label: Meeting and assembly compartments and spaces (Judicial compartments and spaces) @en
preferred label: Compartiments et espaces de réunion et d'assemblée (Compartiments et espaces judiciaires) @fr
preferred label: Compartimenti e spazi per riunioni e assemblee (Compartimenti e spazi giudiziari) @it
broader: Compartimentos e espaços judiciais
narrower: Sala de audiências

Sala de audiências
type: Concept
scope note: Num tribunal, local onde decorrem as sessões de julgamento. A sala de audiências é um espaço amplo, com capacidade para receber, em simultâneo e em áreas específicas, um número elevado de pessoas, como magistrados, intervenientes processuais (caso dos advogados, testemunhas, arguidos) ou público, entre outros.
in scheme: Tesauro SIPA
preferred label: Courtroom @en
preferred label: Salle d'audience @fr
preferred label: Sala del tribunale @it
broader: Compartimentos e espaços de reunião e assembleia (Compartimentos e espaços específicos judiciais)

Compartimentos e espaços militares
type: Concept
in scheme: Tesauro SIPA
preferred label: Military compartments and spaces @en
preferred label: Compartiments et espaces militaires @fr
preferred label: Compartimenti e spazi militari @it
broader: Compartimentos e espaços específicos
narrower: Compartimentos e espaços específicos da fortificação
narrower: Compartimentos e espaços genéricos da fortificação

Compartimentos e espaços específicos da fortificação
type: Concept
in scheme: Tesauro SIPA
preferred label: Specific fortification compartments and spaces @en
preferred label: Compartiments et espaces de fortification spécifiques @fr
preferred label: Compartimenti e spazi di fortificazioni specifiche @it
broader: Compartimentos e espaços militares
narrower: Compartimentos e espaços específicos da fortificação de transição e moderna
narrower: Compartimentos e espaços específicos da fortificação medieval e de transição
narrower: Compartimentos e espaços de circulação (Compartimentos e espaços específicos da fortificação medieval e de transição)
narrower: Compartimentos e espaços específicos da fortificação moderna
narrower: Compartimentos e espaços de circulação (Compartimentos e espaços específicos da fortificação moderna)

Compartimentos e espaços específicos da fortificação de transição e moderna
type: Concept
in scheme: Tesauro SIPA
preferred label: Specific compartments and spaces of transitional and modern fortifications @en
preferred label: Compartiments et espaces spécifiques de fortification de transition et moderne @fr
preferred label: Compartimenti e spazi di fortificazioni specifiche di transizione e moderne @it
broader: Compartimentos e espaços específicos da fortificação
narrower: Trânsito

Trânsito
type: Concept
scope note: Espaço de circulação construído à prova de bomba ou acasamatado, sob o terrapleno de uma fortificação moderna, fazendo a ligação entre a porta exterior e a interior. O trânsito pode ser reto ou, de preferência, curvo, para evitar risco de enfiamento de tiro. Era fechado nos dois extremos por grossas portas de madeira, chapeadas de ferro, com pequeno postigo para acesso da guarda. Para reforçar a sua defesa, integrava vários sistemas, podia também ser seccionado, mais ou menos a meio, por uma outra porta, antecedida por rastrilho e ainda possuir fojo.
in scheme: Tesauro SIPA
preferred label: Transit @en
preferred label: Transito @it
broader: Compartimentos e espaços específicos da fortificação de transição e moderna

Compartimentos e espaços específicos da fortificação medieval e de transição
type: Concept
in scheme: Tesauro SIPA
preferred label: Specific compartments and spaces of mediaeval and transitional fortifications @en
preferred label: Compartiments et espaces spécifiques des fortifications médiévales et de transition @fr
preferred label: Compartimenti e spazi di fortificazioni specifiche medievali e di transizione @it
broader: Compartimentos e espaços específicos da fortificação

Compartimentos e espaços de circulação (Compartimentos e espaços específicos da fortificação medieval e de transição)
type: Concept
in scheme: Tesauro SIPA
preferred label: Compartments and spaces for circulation (Specific compartments and spaces of mediaeval and transitional fortifications) @en
preferred label: Compartiments et espaces de circulation (Compartiments et espaces spécifiques des fortifications médiévales et de transitions) @fr
preferred label: Compartimenti e spazi per il traffico (Compartimenti e spazi di fortificazioni specifiche medievali e di transizione) @it
broader: Compartimentos e espaços específicos da fortificação
narrower: Liça

Liça
type: Concept
scope note: Espaço entre a muralha e a barbacã de uma fortificação medieval, aumentando a sua profundidade de defesa.
in scheme: Tesauro SIPA
preferred label: Palisade @en
preferred label: Palissade @fr
preferred label: Palizzata @it
broader: Compartimentos e espaços de circulação (Compartimentos e espaços específicos da fortificação medieval e de transição)
narrower: Compartimentos e espaços de defesa (Compartimentos e espaços específicos da fortificação medieval e de transição)

Compartimentos e espaços de defesa (Compartimentos e espaços específicos da fortificação medieval e de transição)
type: Concept
in scheme: Tesauro SIPA
preferred label: Defence compartments and spaces (Specific compartments and spaces of mediaeval and transitional fortifications) @en
preferred label: Compartiments et espaces de défense (Compartiments et espaces spécifiques des fortifications médiévales et de transitions) @fr
preferred label: Compartimenti e spazi di difesa (Compartimenti e spazi di fortificazioni specifiche medievali e di transizione) @it
broader: Liça
narrower: Adarve
narrower: Balcão (Compartimentos e espaços de defesa)
narrower: Cadafalso

Adarve
type: Concept
scope note: Caminho no topo da face interna da muralha de uma fortificação medieval, protegido por parapeito, onde os defensores circulavam para proceder à vigilância e à defesa da mesma.
in scheme: Tesauro SIPA
preferred label: Battlement; Roundpath; Allure; Chemin de ronde @en
preferred label: Chemin de rond @fr
preferred label: Camino di ronda @it
broader: Compartimentos e espaços de defesa (Compartimentos e espaços específicos da fortificação medieval e de transição)

Balcão (Compartimentos e espaços de defesa)
type: Concept
scope note: Varandim em cantaria, de pequenas dimensões, que surge nas fortificações medievais, composto por parapeito simples ou ameado, assente em mísulas de diferentes perfis e possuindo no pavimento aberturas redondas – os matacães - para lançamento vertical de pedras ou líquidos. Podem surgir nas muralhas, barbacãs, sobre as portas ou nas torres, a meio das faces e / ou nos cunhais.
in scheme: Tesauro SIPA
preferred label: Balcony; Bartizan; Brattice (Specific defence compartments and spaces) @en
broader: Compartimentos e espaços de defesa (Compartimentos e espaços específicos da fortificação medieval e de transição)
narrower: Balcão corrido
narrower: Balcão desenvolvido

Balcão corrido
type: Concept
scope note: Varandim corrido em cantaria, com ou sem matacães, assente em mísulas, ocupando toda a face de uma torre medieval ou, como era mais frequente, circundando-a, permitindo a vigilância e defesa em todas as direções. É característico do século XV, verificando-se, no entanto, a sua utilização ainda no início do século XVI.
in scheme: Tesauro SIPA
preferred label: Long balcony (Brattice) @en
alternative label: Machicoulis
broader: Balcão (Compartimentos e espaços de defesa)

Balcão desenvolvido
type: Concept
in scheme: Tesauro SIPA
preferred label: Long balcony (Bartizan) @en
broader: Balcão (Compartimentos e espaços de defesa)

Cadafalso
type: Concept
scope note: Estrutura de madeira construída provisoriamente nas torres e muralhas da fortificação medieval, em momentos de perigo, sobre vigas de suporte, formando um varandim saliente, coberto e protegido, que podia ser desmontado em tempo de paz. O cadafalso ou hurdício, introduzido sob a influência da Ordem do Templo, era apropriado em climas frios e chuvosos, visto proteger os defensores da fortificação. Podia ser curto ou corrido, possuindo na face exterior aberturas para o lançamento de setas ou virotões e no pavimento para o lançamento vertical de projéteis sobre a base da fortificação. Atualmente algumas estruturas conservam apenas os orifícios de encaixe das antigas vigas de suporte (Longroiva).
in scheme: Tesauro SIPA
preferred label: Scaffold @en
preferred label: Échafaud @fr
preferred label: Armatura @it
broader: Compartimentos e espaços de defesa (Compartimentos e espaços específicos da fortificação medieval e de transição)

Compartimentos e espaços específicos da fortificação moderna
type: Concept
in scheme: Tesauro SIPA
preferred label: Specific compartments and spaces in modern fortifications @en
preferred label: Compartiments et espaces spécifiques des fortifications modernes @fr
preferred label: Compartimenti e spazi specifici delle fortificazioni moderne @it
broader: Compartimentos e espaços específicos da fortificação
narrower: Compartimentos e espaços de acesso e transição (Compartimentos e espaços específicos da fortificação moderna)

Compartimentos e espaços de acesso e transição (Compartimentos e espaços específicos da fortificação moderna)
type: Concept
in scheme: Tesauro SIPA
preferred label: Access and transition compartments and spaces (Specific compartments and spaces in modern fortifications) @en
preferred label: Compartiments et espaces d'accès et de transition (Compartiments et espaces spécifiques des fortifications modernes) @fr
preferred label: Compartimenti e spazi di accesso e transizione (Compartimenti e spazi specifici delle fortificazioni moderne) @it
broader: Compartimentos e espaços específicos da fortificação moderna
narrower: Gola (Compartimentos e espaços de acesso e transição (Compartimentos e espaços específicos da fortificação moderna))

Gola (Compartimentos e espaços de acesso e transição (Compartimentos e espaços específicos da fortificação moderna))
type: Concept
scope note: Espaço de ligação entre o baluarte e a praça de uma fortificação abaluartada, correspondendo a uma linha imaginária que ligava os flancos de um baluarte às cortinas.
in scheme: Tesauro SIPA
preferred label: Ogee (Cornice) (Access and transition compartments and spaces (Specific compartments and spaces in modern fortifications)) @en
preferred label: Col (Compartiments et espaces d'accès et de transition (Compartiments et espaces spécifiques des fortifications modernes)) @fr
preferred label: Gola (Compartimenti e spazi di accesso e transizione (Compartimenti e spazi specifici delle fortificazioni moderne)) @it
broader: Compartimentos e espaços de acesso e transição (Compartimentos e espaços específicos da fortificação moderna)

Compartimentos e espaços de circulação (Compartimentos e espaços específicos da fortificação moderna)
type: Concept
in scheme: Tesauro SIPA
preferred label: Compartments and circulation spaces (Specific compartments and spaces in modern fortifications) @en
preferred label: Compartiments et espaces de circulation (Compartiments et espaces spécifiques des fortifications modernes) @fr
preferred label: Compartimenti e spazi di circolazione (Compartimenti e spazi specifici delle fortificazioni moderne) @it
broader: Compartimentos e espaços específicos da fortificação
narrower: Caminho coberto (Compartimentos e espaços de circulação (Compartimentos e espaços específicos da fortificação moderna))
narrower: Caminho de ronda
narrower: Estrada de armas
narrower: Praça de armas (Compartimentos e espaços de circulação (Compartimentos e espaços específicos da fortificação moderna))
narrower: Compartimentos e espaços de defesa (Compartimentos e espaços específicos da fortificação moderna)
narrower: Contramina
narrower: Plataforma (Compartimentos e espaços de defesa (Compartimentos e espaços específicos da fortificação moderna))
narrower: Praça alta
narrower: Praça baixa
narrower: Terrapleno

Caminho coberto (Compartimentos e espaços de circulação (Compartimentos e espaços específicos da fortificação moderna))
type: Concept
scope note: Espaço de circulação existente no alto da contraescarpa do fosso de uma fortificação moderna, destinado à movimentação dos seus defensores a coberto do tiro inimigo, por um parapeito de terra, ou de uma estacada de madeira. Normalmente era acedido por rampas e possuía banqueta corrida para tiro de mosquete. Nos seus ângulos reentrantes ou salientes localizavam-se as praças de armas, onde se procedia ao render das tropas.
in scheme: Tesauro SIPA
preferred label: Covered path (Compartments and circulation spaces (Specific compartments and spaces in modern fortifications) @en
preferred label: Chemin de ronde couvert (Compartiments et espaces de circulation (Compartiments et espaces spécifiques des fortifications modernes)) @fr
preferred label: Camino di ronda coperto (Compartimenti e spazi di circolazione (Compartimenti e spazi specifici delle fortificazioni moderne)) @it
broader: Compartimentos e espaços de circulação (Compartimentos e espaços específicos da fortificação moderna)

Caminho de ronda
type: Concept
scope note: Espaço de circulação existente numa fortificação moderna, ao longo das cortinas ou dos baluartes, sobre a escarpa e abaixo do parapeito do reparo com as canhoneiras, protegido pelo parapeito de rondas. Permitia aos defensores observar de cima grande parte do fosso e defender as muralhas, ainda que tivesse o inconveniente do parapeito de rondas puder ser facilmente destruído pela artilharia. Esta solução, semelhante ao adarve medieval.
in scheme: Tesauro SIPA
preferred label: Wall-walk (Chemin de ronde) @en
preferred label: Chemin de ronde @fr
preferred label: Cammino di ronda @it
broader: Compartimentos e espaços de circulação (Compartimentos e espaços específicos da fortificação moderna)

Estrada de armas
type: Concept
in scheme: Tesauro SIPA
preferred label: Covered way (Military road) @en
preferred label: Chemin couvert (Voie militaire) @fr
preferred label: Strada coperta (Via militare) @it
broader: Compartimentos e espaços de circulação (Compartimentos e espaços específicos da fortificação moderna)

Praça de armas (Compartimentos e espaços de circulação (Compartimentos e espaços específicos da fortificação moderna))
type: Concept
scope note: Espaço mais largo no caminho coberto de uma fortificação moderna onde se juntavam os defensores antes de saírem em sortidas. Era coberto ou defendido por traveses e acedido por escadas ou rampa para subir a cavalaria existente na praça.
in scheme: Tesauro SIPA
preferred label: Parade ground (Place of arms) ((Specific compartments and spaces in modern fortifications)) @en
preferred label: Place d’armes ((Compartiments et espaces de circulation (Compartiments et espaces spécifiques des fortifications modernes))) @fr
preferred label: Piazza d’armi (Camino di ronda coperto (Compartimenti e spazi di circolazione (Compartimenti e spazi specifici delle fortificazioni moderne))) @it
broader: Compartimentos e espaços de circulação (Compartimentos e espaços específicos da fortificação moderna)
narrower: Praça de armas reentrante
narrower: Praça de armas saliente

Praça de armas reentrante
type: Concept
scope note: Espaço mais largo no caminho coberto, existente num ângulo que não ultrapassa a linha do polígono interior da fortificação moderna, onde se reuniam os defensores para as sortidas.
in scheme: Tesauro SIPA
preferred label: Re-entrant place of arms @en
preferred label: Place d’armes rentrante @fr
preferred label: Piazza d’armi rientrante @it
broader: Praça de armas (Compartimentos e espaços de circulação (Compartimentos e espaços específicos da fortificação moderna))

Praça de armas saliente
type: Concept
scope note: Espaço mais largo no caminho coberto, onde se reuniam os defensores para as sortidas, disposto nos ângulos salientes e que ressaltam do polígono interior da fortificação moderna, destinado a proteger os ângulos reentrantes.
in scheme: Tesauro SIPA
preferred label: Salient place of arms @en
preferred label: Place d’armes saillante @fr
preferred label: Piazza d’armi saliente @it
broader: Praça de armas (Compartimentos e espaços de circulação (Compartimentos e espaços específicos da fortificação moderna))

Compartimentos e espaços de defesa (Compartimentos e espaços específicos da fortificação moderna)
type: Concept
in scheme: Tesauro SIPA
preferred label: Defence compartments and spaces (Specific compartments and spaces in modern fortifications) @en
preferred label: Compartiments et espaces de la défense (Compartiments et espaces spécifiques des fortifications modernes) @fr
preferred label: Compartimenti e spazi della difesa (Compartimenti e spazi specifici delle fortificazioni moderne) @it
broader: Compartimentos e espaços de circulação (Compartimentos e espaços específicos da fortificação moderna)
narrower: Bateria (Compartimentos e espaços de defesa (Compartimentos e espaços específicos da fortificação moderna))

Bateria (Compartimentos e espaços de defesa (Compartimentos e espaços específicos da fortificação moderna))
type: Concept
scope note: Plataforma na fortificação moderna onde são instaladas as peças de artilharia para bater o inimigo.
in scheme: Tesauro SIPA
preferred label: Battery @en
preferred label: Batterie @fr
preferred label: Batteria @it
broader: Compartimentos e espaços de defesa (Compartimentos e espaços específicos da fortificação moderna)
narrower: Bateria abobadada
narrower: Casamata

Bateria abobadada
type: Concept
scope note: Compartimento coberto por abóbada, construído no flanco do baluarte da fortificação moderna, onde se alojam armas de artilharia para bater o inimigo por meio de canhoneiras e, assim, defender a face do baluarte oposto.
in scheme: Tesauro SIPA
preferred label: Vaulted battery @en
preferred label: Batterie voûtée @fr
preferred label: Batteria voltata @it
broader: Bateria (Compartimentos e espaços de defesa (Compartimentos e espaços específicos da fortificação moderna))

Casamata
type: Concept
scope note: Espaço coberto de abóbada construído nos flancos do baluarte ou sob o caminho coberto, onde se alojam armas de artilharia para atirar sobre o inimigo por meio de canhoneiras.
in scheme: Tesauro SIPA
preferred label: Casemate @en
preferred label: Casamatta @it
broader: Bateria (Compartimentos e espaços de defesa (Compartimentos e espaços específicos da fortificação moderna))

Contramina
type: Concept
scope note: Corredor abobadado construído, antecipadamente ou em período de conflito militar, na espessura dos muros de uma fortificação medieval ou moderna, ao nível do plano do fosso, para poder espreitar e neutralizar as obras de minas do sitiante, impedindo-o de abrir brecha na mesma. Estas galerias tinham respiradouros quadrados ou redondos até ao alto do terrapleno do reparo. Quando se ouvia a mina do inimigo, o corredor ou galeria era entulhado. Também podia ser construída no fosso.
in scheme: Tesauro SIPA
preferred label: Countermine @en
preferred label: Contremine @fr
preferred label: Contromina @it
broader: Compartimentos e espaços de circulação (Compartimentos e espaços específicos da fortificação moderna)

Plataforma (Compartimentos e espaços de defesa (Compartimentos e espaços específicos da fortificação moderna))
type: Concept
scope note: Obra levantada sobre o reparo, a cortina ou o baluarte de uma fortificação moderna, podendo constituir uma simples plataforma para tiros a barbete (de morteiros) ou de um cavaleiro sobre o baluarte. Normalmente são revestidas a alvenaria e a sua forma acompanha a configuração dos baluartes.
in scheme: Tesauro SIPA
preferred label: Gun platform @en
preferred label: Plate-forme @fr
preferred label: Piattaforma @it
broader: Compartimentos e espaços de circulação (Compartimentos e espaços específicos da fortificação moderna)

Praça alta
type: Concept
scope note: Espaço descoberto no topo do baluarte ou da cortina de uma fortificação moderna em cujo terrapleno eram colocadas as bocas de fogo.
in scheme: Tesauro SIPA
preferred label: Upper parade @en
preferred label: Place haute @fr
preferred label: Piazza alta @it
broader: Compartimentos e espaços de circulação (Compartimentos e espaços específicos da fortificação moderna)

Praça baixa
type: Concept
scope note: Espaço descoberto num plano inferior do baluarte ou da cortina de uma fortificação moderna onde eram colocadas bocas de fogo.
in scheme: Tesauro SIPA
preferred label: Lower parade @en
preferred label: Place basse @fr
preferred label: Piazza bassa @it
broader: Compartimentos e espaços de circulação (Compartimentos e espaços específicos da fortificação moderna)

Terrapleno
type: Concept
scope note: Espaço interior do reparo de uma fortificação moderna desde a banqueta até à escarpa interior, sobre o qual se aloja a artilharia e de onde disparam os soldados.
in scheme: Tesauro SIPA
preferred label: Terreplein @en
preferred label: Terre-plein @fr
preferred label: Terrapieno @it
broader: Compartimentos e espaços de circulação (Compartimentos e espaços específicos da fortificação moderna)

Compartimentos e espaços genéricos da fortificação
type: Concept
in scheme: Tesauro SIPA
preferred label: Generic fortification compartments and spaces @en
preferred label: Compartiments et espaces de fortification génériques @fr
preferred label: Compartimenti e spazi generici di fortificazione @it
broader: Compartimentos e espaços militares
narrower: Compartimentos e espaços de armazenamento (Compartimentos e espaços genéricos da fortificação)
narrower: Compartimentos e espaços de circulação (Compartimentos e espaços genéricos da fortificação)
narrower: Compartimentos e espaços de defesa (Compartimentos e espaços genéricos da fortificação)

Compartimentos e espaços de armazenamento (Compartimentos e espaços genéricos da fortificação)
type: Concept
in scheme: Tesauro SIPA
preferred label: Storage compartments and spaces (Generic fortification compartments and spaces) @en
preferred label: Compartiments et espaces de stockage (Compartiments et espaces de fortification génériques) @fr
preferred label: Compartimenti e spazi di stoccaggio (Compartimenti e spazi generici di fortificazione) @it
broader: Compartimentos e espaços genéricos da fortificação
narrower: Paiol (Compartimentos e espaços de armazenamento (Compartimentos e espaços genéricos da fortificação))

Paiol (Compartimentos e espaços de armazenamento (Compartimentos e espaços genéricos da fortificação))
type: Concept
in scheme: Tesauro SIPA
preferred label: Powder house (Gunroom) @en
preferred label: Armurerie (Soute) @fr
preferred label: Poveriera (Armeria) @it
broader: Compartimentos e espaços de armazenamento (Compartimentos e espaços genéricos da fortificação)

Compartimentos e espaços de circulação (Compartimentos e espaços genéricos da fortificação)
type: Concept
in scheme: Tesauro SIPA
preferred label: Circulation compartments and spaces (Generic fortification compartments and spaces) @en
preferred label: Compartiments et espaces de circulation (Compartiments et espaces de fortification génériques) @fr
preferred label: Compartimenti e spazi di circolazione (Compartimenti e spazi generici di fortificazione) @it
broader: Compartimentos e espaços genéricos da fortificação
narrower: Galeria (Compartimentos e espaços de circulação (Compartimentos e espaços genéricos da fortificação))

Galeria (Compartimentos e espaços de circulação (Compartimentos e espaços genéricos da fortificação))
type: Concept
scope note: Passagem estreita, à prova de fogo de artilharia, e por isso enterrada, situada na escarpa ou contraescarpa de uma fortificação moderna, para facilitar a comunicação e aspetos da defesa.
in scheme: Tesauro SIPA
preferred label: Gallery (Generic fortification compartments and spaces) @en
preferred label: Galerie (Compartiments et espaces de fortification génériques) @fr
preferred label: Galleria @it
broader: Compartimentos e espaços de circulação (Compartimentos e espaços genéricos da fortificação)

Compartimentos e espaços de defesa (Compartimentos e espaços genéricos da fortificação)
type: Concept
scope note: Edifício construído para albergar os defensores da entrada de uma fortificação moderna. Por questões de segurança, as portas de acesso deveriam rasgar-se do rastrilho para o interior, ou na escarpa interior, e os vãos, inclusive os que davam para o interior da praça, deviam ser gradeados.
in scheme: Tesauro SIPA
preferred label: Defence compartments and spaces (Generic fortification compartments and spaces) @en
preferred label: Compartiments et espaces de la défense (Compartiments et espaces de fortification génériques) @fr
preferred label: Compartimenti e spazi della difesa (Compartimenti e spazi generici di fortificazione) @it
broader: Compartimentos e espaços genéricos da fortificação
narrower: Corpo da guarda

Corpo da guarda
type: Concept
in scheme: Tesauro SIPA
preferred label: Guardhouse @en
preferred label: Corps de garde @fr
preferred label: Corpo di guardia @it
broader: Compartimentos e espaços de defesa (Compartimentos e espaços genéricos da fortificação)

Compartimentos e espaços prisionais
type: Concept
in scheme: Tesauro SIPA
preferred label: Detention compartments and spaces @en
preferred label: Compartiments et espaces pénitentiaires @fr
preferred label: Compartimenti e spazi di detenzione @it
broader: Compartimentos e espaços específicos
narrower: Compartimentos e espaços de admissão (Compartimentos e espaços prisionais)
narrower: Compartimentos e espaços de detenção e punição (Compartimentos e espaços prisionais)
narrower: Compartimentos e espaços de estar e de convívio social (Compartimentos e espaços judiciais e prisionais)
narrower: Compartimentos e espaços de exercício físico e recreio (Compartimentos e espaços judiciais e prisionais)
narrower: Compartimentos e espaços de monitorização e de controlo (Compartimentos e espaços judiciais e prisionais)

Compartimentos e espaços de admissão (Compartimentos e espaços prisionais)
type: Concept
in scheme: Tesauro SIPA
preferred label: Compartments and spaces for admission (Detention compartments and spaces) @en
preferred label: Compartiments et espaces d'admission (Compartiments et espaces pénitentiaires) @fr
preferred label: Compartimenti e spazi di ammissione (Compartimenti e spazi di detenzione) @it
broader: Compartimentos e espaços prisionais
narrower: Cela de espera
narrower: Sala da apalpadeira
narrower: Sala de espera dos reclusos
narrower: Sala de inspeção e inquirição

Cela de espera
type: Concept
scope note: Nos antigos estabelecimentos prisionais dos séculos XIX e XX, local onde os reclusos eram encerrados logo após o seu ingresso na cadeia e onde aguardavam a observação médica e a entrevista com o diretor da prisão.
in scheme: Tesauro SIPA
preferred label: Waiting cell @en
preferred label: Cellule d'attente @fr
preferred label: Cella di attesa @it
broader: Compartimentos e espaços de admissão (Compartimentos e espaços prisionais)

Sala da apalpadeira
type: Concept
in scheme: Tesauro SIPA
preferred label: Feeler room @en
preferred label: Salle de palpation @fr
preferred label: Stanza del tastatore @it
broader: Compartimentos e espaços de admissão (Compartimentos e espaços prisionais)

Sala de espera dos reclusos
type: Concept
in scheme: Tesauro SIPA
preferred label: Prisoner's waiting room @en
preferred label: Salle d'attente des détenus @fr
preferred label: Sala d'attesa per i detenuti @it
broader: Compartimentos e espaços de admissão (Compartimentos e espaços prisionais)

Sala de inspeção e inquirição
type: Concept
in scheme: Tesauro SIPA
preferred label: Inspection and debriefing room @en
preferred label: Salle d'inspection et d'interrogatoire @fr
preferred label: Sala per ispezioni e interrogatori @it
broader: Compartimentos e espaços de admissão (Compartimentos e espaços prisionais)
narrower: Sala de despir e de vestir

Sala de despir e de vestir
type: Concept
in scheme: Tesauro SIPA
preferred label: Strip search room @en
preferred label: Salle de fouille (Vestiaire) @fr
preferred label: Sala per perquisizione (Spogliatoio) @it
broader: Sala de inspeção e inquirição

Compartimentos e espaços de detenção e punição (Compartimentos e espaços prisionais)
type: Concept
in scheme: Tesauro SIPA
preferred label: Compartments and spaces of detention and punishment (Detention compartments and spaces) @en
preferred label: Compartiments et espaces de détention et de punition (Compartiments et espaces pénitentiaires) @fr
preferred label: Compartimenti e spazi per la detenzione e la punizione (Compartimenti e spazi di detenzione) @it
alternative label: Compartimentos e espaços de encarceramento
alternative label: Compartimentos e espaços de punição
broader: Compartimentos e espaços prisionais
narrower: Adova
narrower: Ala prisional
narrower: Calabouço
narrower: Camarata (Compartimentos e espaços específicos de detenção e punição)
narrower: Cela (Compartimentos e espaços específicos de detenção e punição)
narrower: Enxovia
narrower: Espaços de punição
narrower: Masmorra
narrower: Quarto de contenção
narrower: Quarto de isolamento (Compartimentos e espaços específicos de detenção e punição)
narrower: Quarto de reflexão
narrower: Sala prisão

Adova
type: Concept
scope note: Sala anexa às cadeias antigas, onde os presos por pequenos delitos podiam passear, algemados ou agrilhoados.
in scheme: Tesauro SIPA
preferred label: Visitor room @en
preferred label: Chambre des visiteurs @fr
preferred label: Sala visitatori @it
broader: Compartimentos e espaços de detenção e punição (Compartimentos e espaços prisionais)

Ala prisional
type: Concept
scope note: Parte não autónoma de um edifício ou estrutura construída prisional, de planimetria predominantemente alongada e volume paralelepipédico, destinada a alojamento de reclusos. Uma ala prisional contém compartimentos, espaços e conjuntos de espaços destinados ao alojamento no âmbito da privação da liberdade – celas, instalações sanitárias, rouparias e copas – por regra dispostos em bateria simples (cadeia comarcã) ou dupla (estabelecimentos prisionais de grande dimensão) ao longo de galerias, em dois ou mais pisos. O seu funcionamento não é, pois, autonomizável, sendo complementado pela associação às restantes componentes funcionais do estabelecimento. No caso de estabelecimentos mistos (cadeia comarcã), os contingentes de reclusos de cada género distribuem-se por alas distintas; outro tanto pode suceder em estabelecimentos contendo diferentes tipos de reclusos (preventivos, doentes, isolados) ou de modos de alojamento (camaratas, quartos). A ala prisional, cuja vigência se mantém até ao momento presente, surge intimamente associada aos modelos modernos de estrutura carcerária – a cadeia penitenciária, por exemplo –, uma vez que se enquadra no conjunto de mecanismos destinados a garantir as condições de controle e vigilância, separação e salubridade, fundamentais ao funcionamento do sistema penitenciário.
in scheme: Tesauro SIPA
preferred label: Prison ward @en
preferred label: Quartier pénitentiaire @fr
preferred label: Reparto detentivo @it
broader: Compartimentos e espaços de detenção e punição (Compartimentos e espaços prisionais)

Calabouço
type: Concept
scope note: Local de prisão subterrâneo destinado a reclusos incomunicáveis. Espaço de punição característico das instalações prisionais do Antigo Regime, marcado pela ausência de iluminação e ventilação naturais e das mais elementares condições de higiene e salubridade. A sua eliminação forma parte do conjunto de medidas tendentes à introdução em Portugal de um sistema prisional moderno (penitenciário), desde a primeira metade do século XIX.
in scheme: Tesauro SIPA
preferred label: Dungeon @en
preferred label: Donjon @fr
preferred label: Prigione @it
broader: Compartimentos e espaços de detenção e punição (Compartimentos e espaços prisionais)

Camarata (Compartimentos e espaços específicos de detenção e punição)
type: Concept
scope note: Espaço basilar da arquitetura prisional, a par da cela, destinado ao alojamento de reclusos em grupo. Herdeiro da enxovia e amplamente utilizado nos estabelecimentos prisionais, de maiores dimensões, anteriores ao regime penitenciário celular, permitia a instalação de um grande número de reclusos em áreas relativamente limitadas; o seu preenchimento era independente de considerações sobre o tratamento penal especifico devido a reclusos com perfis e penas diferenciadas, mas ditado acima de tudo por contingências de espaço, pelo que o seu funcionamento era grandemente afetado nos aspetos da segurança, privacidade, salubridade e reabilitação dos reclusos. O regime celular e os estabelecimentos dele decorrentes vieram eliminar a camarata, em um primeiro momento (cadeia penitenciária), e reformular o seu papel, mais tarde: na cadeia comarcã de pequena dimensão, a camarata de reclusos pode ser montada na casa de trabalho, nos momentos em que seja atingida a capacidade máxima nas celas; na cadeia comarcã de grande dimensão, a camarata destina-se ao alojamento de reclusos ou detidos em grandes grupos (20 ou mais indivíduos), dotada de instalações sanitárias próprias; na cadeia central, a camarata é destinada principalmente a reclusos homens ou mulheres que convenha observar ou às quais o isolamento noturno seja prejudicial, pelo seu estado mental ou nervoso, bem como utilizada enquanto reserva, acolhendo aumentos pontuais da população prisional; no campo de trabalho, por último, é o único compartimento de alojamento dos reclusos / trabalhadores, dada a inexistência de celas. O recurso à camarata mantém-se, até hoje, essencial no funcionamento dos estabelecimentos prisionais, como modo de responder à sobrelotação da rede nacional.
in scheme: Tesauro SIPA
preferred label: Dormitory (Specific compartments and spaces for detention and punishment) @en
preferred label: Dortoir (Compartiments et espaces spécifiques pour la détention et la punition) @fr
preferred label: Camerata (Compartimenti e spazi specifici di detenzione e punizione) @it
broader: Compartimentos e espaços de detenção e punição (Compartimentos e espaços prisionais)

Cela (Compartimentos e espaços específicos de detenção e punição)
type: Concept
scope note: Num estabelecimento prisional, é o compartimento, individual ou coletivo, onde os detidos pernoitam e permanecem por períodos variáveis de tempo, ao longo do dia. Pode, ainda, indicar o espaço de um tribunal onde o detido aguarda a chamada à sala de audiências. O réu permanece nesta cela por curtos períodos de tempo e apenas nos dias em que tenha de estar presente às sessões de julgamento.
in scheme: Tesauro SIPA
preferred label: Cell (Specific compartments and spaces for detention and punishment) @en
preferred label: Cellule @fr
preferred label: Celia @it
alternative label: Cela individual
broader: Compartimentos e espaços de detenção e punição (Compartimentos e espaços prisionais)
narrower: Cela disciplinar

Cela disciplinar
type: Concept
scope note: Cela individual onde o recluso permanece durante um período de tempo limitado como castigo por atos cometidos no interior da cadeia. Nas penitenciárias portuguesas, onde o regime prisional se baseou até, 1913, no isolamento contínuo do preso, o carácter disciplinar desta cela era-lhe conferido através da reduzida luminosidade e pela ausência quase total de mobiliário.
in scheme: Tesauro SIPA
preferred label: Disciplinary cell @en
preferred label: Cellule disciplinaire @fr
preferred label: Cella disciplinare @it
alternative label: Cela de castigo
alternative label: Solitária
broader: Cela (Compartimentos e espaços específicos de detenção e punição)

Enxovia
type: Concept
scope note: Espaço carcerário coletivo, existente nas antigas prisões portuguesas, caracterizado pelas péssimas condições de habitabilidade que oferecia aos seus ocupantes. Este amplo salão, situado no pavimento térreo do edifício prisional, com parca luminosidade e onde se amontoavam, por vezes, mais de cem pessoas, destinava-se a indivíduos sem recursos, incapazes, portanto, de pagar a estada noutras áreas da cadeia. Em virtude do lento processo de substituição dos velhos presídios, a enxovia é ainda uma realidade em meados do século XX, continuando associada a presos pertencentes a camadas sociais mais desfavorecidas.
in scheme: Tesauro SIPA
preferred label: Dungeon; Shack @en
preferred label: Cachot @fr
preferred label: Segreta (Cella sotterranea) @it
broader: Compartimentos e espaços de detenção e punição (Compartimentos e espaços prisionais)

Espaços de punição
type: Concept
in scheme: Tesauro SIPA
preferred label: Punishment cells @en
preferred label: Espaces punitifs @fr
preferred label: Spazi di punizione @it
broader: Compartimentos e espaços de detenção e punição (Compartimentos e espaços prisionais)
narrower: Segredo

Segredo
type: Concept
scope note: Pequeno compartimento de cariz disciplinar existente nas antigas cadeias portuguesas, para onde eram transferidos, por um determinado período de tempo, os culpados de delitos (em alguns casos, pequenos delitos) cometidos no interior da prisão. O segredo era, regra geral, um espaço individual, por vezes coletivo, embora com capacidade para um número limitado de indivíduos, mas sempre com péssimas condições de salubridade. Esta área prisional, existente ainda nos finais do século XIX, destinava-se exclusivamente a reclusos pobres.
in scheme: Tesauro SIPA
preferred label: Disciplinary cell @en
preferred label: Secret @fr
preferred label: Segreta @it
broader: Espaços de punição

Masmorra
type: Concept
in scheme: Tesauro SIPA
preferred label: Dungeon @en
preferred label: Donjon @fr
preferred label: Prigione @it
broader: Compartimentos e espaços de detenção e punição (Compartimentos e espaços prisionais)

Quarto de contenção
type: Concept
in scheme: Tesauro SIPA
preferred label: Contention room @en
preferred label: Salle d'isolement @fr
preferred label: Stanza di confino @it
broader: Compartimentos e espaços de detenção e punição (Compartimentos e espaços prisionais)

Quarto de isolamento (Compartimentos e espaços específicos de detenção e punição)
type: Concept
in scheme: Tesauro SIPA
preferred label: Isolation room (Specific compartments and spaces for detention and punishment) @en
preferred label: Salle d'isolement (compartiments et espaces spécifiques pour la détention et la punition) @fr
preferred label: Sala di isolamento (compartimenti e spazi specifici per la detenzione e la punizione) @it
broader: Compartimentos e espaços de detenção e punição (Compartimentos e espaços prisionais)

Quarto de reflexão
type: Concept
in scheme: Tesauro SIPA
preferred label: Meditation room @en
preferred label: Chambre de réflexion @fr
preferred label: Sala di riflessione @it
broader: Compartimentos e espaços de detenção e punição (Compartimentos e espaços prisionais)

Sala prisão
type: Concept
in scheme: Tesauro SIPA
preferred label: Prison room @en
preferred label: Salle de prison @fr
preferred label: Stanza della prigione @it
broader: Compartimentos e espaços de detenção e punição (Compartimentos e espaços prisionais)

Compartimentos e espaços de estar e de convívio social (Compartimentos e espaços judiciais e prisionais)
type: Concept
in scheme: Tesauro SIPA
preferred label: Living and socialisation compartments and spaces (Judicial and prison compartments and spaces) @en
preferred label: Compartiments et espaces sociaux et de vie (Compartiments et espaces judiciaires et pénitentiaires) @fr
preferred label: Compartimenti e spazi sociali e abitativi (Compartimenti e spazi giudiziari e carcerari) @it
broader: Compartimentos e espaços prisionais
narrower: Sala de família

Sala de família
type: Concept
in scheme: Tesauro SIPA
preferred label: Family room @en
preferred label: Salle familiale @fr
preferred label: Camera di famiglia @it
broader: Compartimentos e espaços de estar e de convívio social (Compartimentos e espaços judiciais e prisionais)

Compartimentos e espaços de exercício físico e recreio (Compartimentos e espaços judiciais e prisionais)
type: Concept
in scheme: Tesauro SIPA
preferred label: Physical exercise and recreation compartments and spaces (Judicial and prison rooms and spaces) @en
preferred label: Compartiments et espaces pour l'exercice physique et la récréation (Compartiments et espaces judiciaires et pénitentiair @fr
preferred label: Compartimenti e spazi per l'esercizio fisico e la ricreazione (Compartimenti e spazi giudiziari e penitenziari) @it
broader: Compartimentos e espaços prisionais
narrower: Passeio dos presos

Passeio dos presos
type: Concept
scope note: Espaço ou conjunto de espaços exteriores descobertos destinados ao exercício físico e recreio dos reclusos de uma cadeia penitenciária. A sua forma mais característica, em planta, é a de um conjunto de segmentos de círculo (“gomos”), cuja subdivisão é feita pelos muros que encerram totalmente cada segmento e são dispostos radialmente a partir de um ponto de observação privilegiado, no centro do círculo. Tal configuração traduz diretamente os imperativos funcionais em causa: no âmbito do regime penitenciário e para cumprimento de penas de prisão maior celular, cujos condenados estavam sujeitos a total e absoluta incomunicabilidade e a vigilância constante, o espaço de recreio e exercício nos moldes descritos foi a forma encontrada pelo sistema prisional para permitir o cumprimento daquelas funções fisiológicas essenciais aos reclusos; em tais espaços estes podiam permanecer um limitado período de tempo, individualmente, sem risco de contacto com outros reclusos, e sob vigilância permanente.
in scheme: Tesauro SIPA
preferred label: Prisoners stroll (Inmates walk) @en
preferred label: Tournée des prisonniers @fr
preferred label: Giro dei prigionieri @it
broader: Compartimentos e espaços de exercício físico e recreio (Compartimentos e espaços judiciais e prisionais)

Compartimentos e espaços de monitorização e de controlo (Compartimentos e espaços judiciais e prisionais)
type: Concept
in scheme: Tesauro SIPA
preferred label: Compartments and spaces for monitoring and control (Judicial and prison compartments and spaces) @en
preferred label: Compartiments et espaces de surveillance et de contrôle ( Compartiments et espaces judiciaires et pénitentiaires) @fr
preferred label: Compartimenti e spazi di monitoraggio e controllo (Compartimenti e spazi giudiziari e penitenziari) @it
broader: Compartimentos e espaços prisionais
narrower: Galeria de vigilância dos presos

Galeria de vigilância dos presos
type: Concept
scope note: Espaço de monitorização e controlo da atividade de reclusos nos seus momentos de atividade quotidiana em coletivo, caraterístico dos espaços oficinais, de refeições e de estar, previstos em estabelecimentos prisionais de grande dimensão (Cadeia Central, Colónia Penal). Surgida da necessidade de vigiar grandes contingentes de reclusos de modo pouco intrusivo e discreto, não denunciando a real dimensão do efetivo de pessoal dedicado a tal tarefa, a galeria de vigilância é implantada em plano superior àquele em que se encontram os indivíduos vigiados, atravessando longitudinalmente uma sucessão de espaços funcionalmente semelhantes (por exemplo, oficinas). A sua existência é dissimulada por parede opaca, perfurada pontualmente por frestas horizontais, desenhadas de tal forma a que a sua abertura e fecho não são percetíveis pelos vigiados.
in scheme: Tesauro SIPA
preferred label: Surveillance hall @en
preferred label: Galerie de surveillance @fr
preferred label: Galleria di sorveglianza @it
broader: Compartimentos e espaços de monitorização e de controlo (Compartimentos e espaços judiciais e prisionais)

Compartimentos e espaços religiosos
type: Concept
in scheme: Tesauro SIPA
preferred label: Religious compartments and spaces @en
preferred label: Compartiments et espaces religieux @fr
preferred label: Compartimenti e spazi religiosi @it
broader: Compartimentos e espaços específicos
narrower: Compartimentos e espaços religiosos genéricos
narrower: Compartimentos e espaços religiosos específicos

Compartimentos e espaços religiosos genéricos
type: Concept
in scheme: Tesauro SIPA
preferred label: Generic religious rooms and spaces @en
preferred label: Compartiments et espaces religieux génériques @fr
preferred label: Compartimenti e spazi religiosi generici @it
broader: Compartimentos e espaços religiosos
narrower: Compartimentos e espaços de circulação (Compartimentos e espaços religiosos genéricos)
narrower: Compartimentos e espaços litúrgicos (Compartimentos e espaços religiosos genéricos)

Compartimentos e espaços de circulação (Compartimentos e espaços religiosos genéricos)
type: Concept
in scheme: Tesauro SIPA
preferred label: Circulation compartments and spaces (Generic religious compartments and spaces) @en
preferred label: Compartiments et espaces de circulation (Compartiments et espaces religieux génériques) @fr
preferred label: Compartimenti e spazi di circolazione (Compartimenti e spazi religiosi generici) @it
broader: Compartimentos e espaços religiosos genéricos
narrower: Galilé

Galilé
type: Concept
scope note: Galeria adossada à porta de uma igreja, capela ou sinagoga, de largura variável, podendo prolongar-se por toda a fachada ou, no caso dos edifícios cristãos, pelas fachadas laterais. Em alguns destes edifícios, serviu, durante a Idade Média, de local de sepultura a altos dignatários. No caso da sinagoga é mais alta que o templo constituindo um corpo saliente, ao contrário do que acontece no universo cristão, onde se apresenta mais baixo que o templo propriamente dito. Em ambos os casos, tem como função, servir de proteção aos fiéis antes de se introduzirem no interior dos edifícios, estabelecendo uma divisão entre o espaço terreno e o sagrado.
in scheme: Tesauro SIPA
preferred label: Galilee @en
preferred label: Galilea @it
broader: Compartimentos e espaços de circulação (Compartimentos e espaços religiosos genéricos)

Compartimentos e espaços litúrgicos (Compartimentos e espaços religiosos genéricos)
type: Concept
in scheme: Tesauro SIPA
preferred label: Liturgical compartments and spaces (Generic religious compartments and spaces) @en
preferred label: Compartiments et espaces liturgiques (Compartiments et espaces religieux génériques) @fr
preferred label: Compartimenti e spazi liturgici (Compartimenti e spazi religiosi generici) @it
broader: Compartimentos e espaços religiosos genéricos
narrower: Sala ecuménica

Sala ecuménica
type: Concept
scope note: Espaço localizado num cemitério destinado à realização de cerimónias fúnebres antes do funeral. Este local está geralmente preparado para acolher rituais funerários de todas as religiões, possuindo paramentos e outros tipos de adereços necessários a cada uma das celebrações.
in scheme: Tesauro SIPA
preferred label: Ecumenical room @en
preferred label: Salle œcuménique @fr
preferred label: Sala ecumenica @it
broader: Compartimentos e espaços litúrgicos (Compartimentos e espaços religiosos genéricos)

Compartimentos e espaços religiosos específicos
type: Concept
in scheme: Tesauro SIPA
preferred label: Specific religious compartments and spaces @en
preferred label: Salles et espaces religieux spécifiques @fr
preferred label: Compartimenti e spazi religiosi specifici @it
broader: Compartimentos e espaços religiosos
narrower: Compartimentos e espaços religiosos específicos segundo o culto

Compartimentos e espaços religiosos específicos segundo o culto
type: Concept
in scheme: Tesauro SIPA
preferred label: Specific religious compartments and spaces according to worship @en
preferred label: Compartiments et espaces religieux spécifiques selon le culte @fr
preferred label: Compartimenti e spazi religiosi specifici in base al culto @it
broader: Compartimentos e espaços religiosos específicos
narrower: Culto clássico
narrower: Culto cristão
narrower: Culto islâmico
narrower: Culto judaico

Culto clássico
type: Concept
in scheme: Tesauro SIPA
preferred label: Classic worship @en
preferred label: Culte classique @fr
preferred label: Culto classico @it
broader: Compartimentos e espaços religiosos específicos segundo o culto
narrower: Compartimentos e espaços de acesso, circulação, distribuição e transição (Culto clássico)
narrower: Compartimentos e espaços de culto e devoção (Culto clássico)

Compartimentos e espaços de acesso, circulação, distribuição e transição (Culto clássico)
type: Concept
in scheme: Tesauro SIPA
preferred label: Compartments and spaces for access, circulation, distribution and transition (Classical worship) @en
preferred label: Compartiments et espaces d'accès, de circulation, de distribution et de transition (Culte classique) @fr
preferred label: Compartimenti e spazi per l'accesso, la circolazione, la distribuzione e la transizione (Culto classico) @it
broader: Culto clássico
narrower: Pronau

Pronau
type: Concept
scope note: Espaço localizado no acesso de um templo clássico e que liga à cella.
in scheme: Tesauro SIPA
preferred label: Pronaos @en
preferred label: Pronao @it
broader: Compartimentos e espaços de acesso, circulação, distribuição e transição (Culto clássico)

Compartimentos e espaços de culto e devoção (Culto clássico)
type: Concept
in scheme: Tesauro SIPA
preferred label: Compartments and places of worship and devotion (Classical worship) @en
preferred label: Compartiments et lieux de culte et de dévotion (Culte classique) @fr
preferred label: Compartimenti e spazi di culto e devozione (Culto classico) @it
broader: Culto clássico
narrower: Ábato
narrower: Antecella
narrower: Cella

Ábato
type: Concept
scope note: Espaço de um templo clássico apenas acessível aos sacerdotes.
in scheme: Tesauro SIPA
preferred label: Abaton (Adytum) @en
preferred label: Adyton @fr
alternative label: Adito
broader: Compartimentos e espaços de culto e devoção (Culto clássico)

Antecella
type: Concept
scope note: Espaço que acede à cella, num templo clássico.
in scheme: Tesauro SIPA
broader: Compartimentos e espaços de culto e devoção (Culto clássico)

Cella
type: Concept
scope note: Local onde se coloca a divindade num tempo clássico, situado no local menos acessível do edifício e a que tem acesso apenas o sacerdote.
in scheme: Tesauro SIPA
broader: Compartimentos e espaços de culto e devoção (Culto clássico)

Culto cristão
type: Concept
in scheme: Tesauro SIPA
preferred label: Christian worship @en
preferred label: Culte chrétien @fr
preferred label: Culto cristiano @it
broader: Compartimentos e espaços religiosos específicos segundo o culto
narrower: Compartimentos e espaços de armazenamento (Culto cristão)
narrower: Compartimentos e espaços de acesso, circulação, distribuição e transição (Culto cristão)
narrower: Compartimentos e espaços de assistência (Culto cristão)
narrower: Compartimentos e espaços de comunicação e de difusão de dados e registo (Culto cristão)
narrower: Compartimentos e espaços de culto e devoção (Culto cristão)
narrower: Compartimentos e espaços de educação (Culto cristão)
narrower: Compartimentos e espaços de estar e de convívio social (Culto cristão)
narrower: Compartimentos e espaços de exposição (Culto católico)
narrower: Compartimentos e espaços de purificação, de banho e de vestir (Culto católico)
narrower: Compartimentos e espaços de receção (Culto católico)
narrower: Compartimentos e espaços de reunião e assembleia (Culto católico)
narrower: Compartimentos e espaços litúrgicos (Culto católico)

Compartimentos e espaços de armazenamento (Culto cristão)
type: Concept
in scheme: Tesauro SIPA
preferred label: Storage compartments and spaces (Christian Worship) @en
preferred label: Compartiments et espaces de stockage (Culte chrétien) @fr
preferred label: Compartimenti e spazi di deposito (Culto cristiano) @it
broader: Culto cristão
narrower: Depósito de valores mobiliários (Compartimentos e espaços específicos de armazenamento)

Depósito de valores mobiliários (Compartimentos e espaços específicos de armazenamento)
type: Concept
in scheme: Tesauro SIPA
preferred label: Securities depository (Specific storage compartments and spaces) @en
preferred label: Dépôt de titres (Compartiments et espaces de stockage spécifiques) @fr
preferred label: Deposito titoli (Compartimenti e spazi specifici per il deposito) @it
broader: Compartimentos e espaços de armazenamento (Culto cristão)
narrower: Sacristia

Sacristia
type: Concept
scope note: Espaço existente num templo católico, destinado ao revestimento do religioso antes de uma cerimónia litúrgica. Simultaneamente, é o local onde se arrecadam as peças de ourivesaria e paramentaria destinadas ao culto, sendo frequente a existência de vários tipos de mobiliário. No local, existe um ponto de água perene ou com recipiente, destinado àsa abluções dos religiosos antes dos atos litúrgicos, mesas de apoio e, frequentemente, um arcaz. Podem ainda existir cofres para arrecadar bens mais preciosos. Nas sacristias são expostas algumas imagens retiradas de um local de culto, por razões de segurança ou pelo facto do culto se ter extinguido.
in scheme: Tesauro SIPA
preferred label: Sacristy @en
preferred label: Sacristie @fr
preferred label: Sacrestia @it
broader: Depósito de valores mobiliários (Compartimentos e espaços específicos de armazenamento)
narrower: Diacónico

Diacónico
type: Concept
scope note: Espaço existente nas basílicas paleocristãs e bizantinas, destinadas à arrecadação dos óleos e alfaias destinadas ao culto. Situava-se, normalmente, no lado do Evangelho, adossado à abside e constitui o antecessor da sacristia.
in scheme: Tesauro SIPA
preferred label: Diaconicon @en
preferred label: Diaconie @fr
preferred label: Diaconio/ Diaconico @it
broader: Sacristia

Compartimentos e espaços de acesso, circulação, distribuição e transição (Culto cristão)
type: Concept
in scheme: Tesauro SIPA
preferred label: Compartments and spaces for access, circulation, distribution and transition (Christian worship) @en
preferred label: Compartiments et espaces d'accès, de circulation, de distribution et de transition (Culte chrétien) @fr
preferred label: Compartimenti e spazi per l'accesso, la circolazione, la distribuzione e la transizione (Culto cristiano) @it
broader: Culto cristão
narrower: Adro (Compartimentos e espaços de acesso, circulação, distribuição e transição)
narrower: Adússia
narrower: Antecoro
narrower: Antessacristia
narrower: Claustro
narrower: Deambulatório
narrower: Nártex
narrower: Terreiro

Adro (Compartimentos e espaços de acesso, circulação, distribuição e transição)
type: Concept
scope note: Espaço que envolve um edifício religioso, normalmente protegido por um muro ou murete, com um ou vários acessos. O adro serviu, até ao século XIX, como espaço de enterramentos, passando, a partir dessa data, a funcionar como local de reunião após os serviços religiosos. Terá tido a sua origem nos átrios das primeiras basílicas paleocristãs. Pode ser ajardinado, sendo frequente a presença de peças de água ou canteiros.
in scheme: Tesauro SIPA
preferred label: Churchyard (Compartments and spaces for access, circulation, distribution and transition (Christian worship)) @en
preferred label: Parvis (Compartiments et espaces d'accès, de circulation, de distribution et de transition (Culte chrétien)) @fr
preferred label: Atrio (Compartimenti e spazi per l'accesso, la circolazione, la distribuzione e la transizione (Culto cristiano)) @it
broader: Compartimentos e espaços de acesso, circulação, distribuição e transição (Culto cristão)

Adússia
type: Concept
scope note: Termo antigo para designar o espaço compreendido pelo arco triunfal, entre as naves e a capela-mor.
in scheme: Tesauro SIPA
preferred label: Adussia; Adisya @en
broader: Compartimentos e espaços de acesso, circulação, distribuição e transição (Culto cristão)

Antecoro
type: Concept
scope note: Espaço existente nos edifícios monacais, que antecede o acesso ao coro-alto, situado, indiferentemente, no lado do Evangelho ou no lado da Epístola, dependendo da zona em que se desenvolve o espaço regral. Pode ser completamente despojado ou apresentar uma decoração exuberante, visível particularmente nos mosteiros femininos, podendo possuir um oratório, altar ou mesmo capela, bem como uma pia de água benta junto à porta de acesso ao coro-alto.
in scheme: Tesauro SIPA
preferred label: Antechoir @en
broader: Compartimentos e espaços de acesso, circulação, distribuição e transição (Culto cristão)

Antessacristia
type: Concept
scope note: Espaço que antecede a sacristia, existente nos edifícios monásticos, episcopais ou basilicais, sendo mais raros nas igrejas ou capelas, onde o acesso é feito diretamente entre a capela-mor e a sacristia. É um espaço de dimensões variáveis, que pode apresentar ou não decoração, normalmente composta por tábuas ou telas pintadas com temática religiosa.
in scheme: Tesauro SIPA
preferred label: Antesacristy @en
broader: Compartimentos e espaços de acesso, circulação, distribuição e transição (Culto cristão)
narrower: Via Sacra (Antessacristia)

Via Sacra (Antessacristia)
type: Concept
in scheme: Tesauro SIPA
preferred label: Way of the cross (Antesacristy) @en
preferred label: Chemin de la croix @fr
preferred label: Via crucis @it
broader: Antessacristia

Claustro
type: Concept
scope note: Espaço aberto no interior de um edifício monástico-conventual ou num colégio de teor religioso, rodeado de galerias, as alas, com a zona central constituindo uma quadra ajardinada. É o centro do cenóbio, em torno do qual se organiza a vida material, intelectual e espiritual da comunidade. A estrutura deriva do peristilo das villa romanas, sendo os primeiros de madeira, evoluindo, rapidamente, para estruturas mais duradouras, em cantaria. Divide-se, normalmente, em dois pisos, situando-se, no inferior, a portaria, parlatório, a Sala do Capítulo, o refeitório, cozinha e zonas de armazenamento, aparecendo, no segundo, os dormitórios, enfermaria e, por vezes, a hospedaria. A quadra possuía árvores e plantas medicinais ou ornamentais, no centro da qual se implantava um chafariz, destinado a abluções ou, simplesmente, a reservatório das águas pluviais, integrando o sistema hidráulico do complexo conventual.
in scheme: Tesauro SIPA
preferred label: Claustrum (Cloister) @en
preferred label: Cloître (Hourd) @fr
preferred label: Chiostro @it
broader: Compartimentos e espaços de acesso, circulação, distribuição e transição (Culto cristão)

Deambulatório
type: Concept
scope note: Espaço que envolve a abside de um templo, normalmente de planta semicircular. Nasceu nos edifícios de peregrinação, onde era necessário facilitar a circulação das pessoas em torno de um espaço onde estavam situadas as relíquias de um santo ou de um mártir, tendo sido adotado em alguns edifícios episcopais e monásticos, durante a Idade Média.
in scheme: Tesauro SIPA
preferred label: Deambulatory @en
alternative label: Charola
broader: Compartimentos e espaços de acesso, circulação, distribuição e transição (Culto cristão)

Nártex
type: Concept
in scheme: Tesauro SIPA
preferred label: Nartex @en
preferred label: Narthex @fr
preferred label: Nartece @it
alternative label: Paraíso
broader: Compartimentos e espaços de acesso, circulação, distribuição e transição (Culto cristão)
narrower: Endonártex
narrower: Exonártex

Endonártex
type: Concept
in scheme: Tesauro SIPA
preferred label: Endonartex @en
broader: Nártex

Exonártex
type: Concept
in scheme: Tesauro SIPA
preferred label: Exonartex @en
broader: Nártex

Terreiro
type: Concept
scope note: Espaço aberto em terra compactada, geralmente junto a um edifício, designando as áreas de acesso a uma casa monástico-conventual, podendo ser aberto ou fechado.
in scheme: Tesauro SIPA
preferred label: Yard (Public square) @en
preferred label: Cour (Place) @fr
preferred label: Piazza (Spiazzo) @it
broader: Compartimentos e espaços de acesso, circulação, distribuição e transição (Culto cristão)

Compartimentos e espaços de assistência (Culto cristão)
type: Concept
in scheme: Tesauro SIPA
preferred label: Service compartments and spaces (Christian Worship) @en
preferred label: Compartiments et espaces de service (Culte chrétien) @fr
preferred label: Compartimenti e spazi di servizio (Culto cristiano) @it
broader: Culto cristão
narrower: Trifório

Trifório
type: Concept
scope note: Espaço semelhante a uma tribuna, mas estreito, permitindo apenas a passagem a uma pessoa, sendo normal que cada vão se abre numa trífora.
in scheme: Tesauro SIPA
preferred label: Triforium @en
preferred label: Triforio @it
broader: Compartimentos e espaços de assistência (Culto cristão)

Compartimentos e espaços de comunicação e de difusão de dados e registo (Culto cristão)
type: Concept
in scheme: Tesauro SIPA
preferred label: Compartments and spaces for communication and data dissemination and registration (Christian worship) @en
preferred label: Compartiments et espaces de communication, de diffusion et d'enregistrement des données (Culte chrétien) @fr
preferred label: Compartimenti e spazi per la comunicazione e la diffusione e registrazione dei dati (Culto cristiano) @it
broader: Culto cristão
narrower: Scriptorium

Scriptorium
type: Concept
in scheme: Tesauro SIPA
broader: Compartimentos e espaços de comunicação e de difusão de dados e registo (Culto cristão)

Compartimentos e espaços de culto e devoção (Culto cristão)
type: Concept
in scheme: Tesauro SIPA
preferred label: Compartments and places of worship and devotion (Christian Worship) @en
preferred label: Compartiments et lieux de culte et de dévotion (Culte chrétien) @fr
preferred label: Compartimenti e luoghi di culto e devozione (Culto cristiano) @it
broader: Culto cristão
narrower: Cabeceira
narrower: Transepto
narrower: Varanda de benedictione

Cabeceira
type: Concept
scope note: Espaço principal do templo, onde se situa o altar-mor, podendo assumir várias formas e podendo ser simples, com uma capela única, ou composta por vários corpos. Até ao século XVI, a cabeceira estava, obrigatoriamente, virada a oriente.
in scheme: Tesauro SIPA
preferred label: Apse (Apsis) @en
preferred label: Abside @fr
broader: Compartimentos e espaços de culto e devoção (Culto cristão)
narrower: Pastofório
narrower: Cabeceira segundo a forma
narrower: Cabeceira segundo o número de capelas

Pastofório
type: Concept
scope note: Dois espaços anexos à capela-mor, nas igrejas paleocristãs e bizantinas, com funções distintas, compondo o diacónico e o protesis.
in scheme: Tesauro SIPA
preferred label: Pastophorium @en
preferred label: Pastophorias @fr
broader: Cabeceira

Cabeceira segundo a forma
type: Concept
in scheme: Tesauro SIPA
preferred label: Apse according to shape @en
broader: Cabeceira
narrower: Cabeceira escalonada
narrower: Cabeceira radiante

Cabeceira escalonada
type: Concept
scope note: Tipo de cabeceira de igreja composta por várias capelas, com as capelas laterais a abrir diretamente para as naves ou transepto e de altura mais baixa do que a capela principal.
in scheme: Tesauro SIPA
preferred label: Tiered apse @en
broader: Cabeceira segundo a forma

Cabeceira radiante
type: Concept
scope note: Tipo de cabeceira de uma igreja com planta radial, em que a capela-mor se inscreve no centro da abside e é rodeada por várias capelas, dispostas ao longo da parede delimitadora do semicírculo, abrindo para um espaço de circulação, o deambulatório.
in scheme: Tesauro SIPA
preferred label: Radiating apse @en
broader: Cabeceira segundo a forma

Cabeceira segundo o número de capelas
type: Concept
in scheme: Tesauro SIPA
preferred label: Apse according to chapel number @en
broader: Cabeceira
narrower: Cabeceira simples
narrower: Cabeceira composta

Cabeceira simples
type: Concept
scope note: Tipo de cabeceira de uma igreja ou capela que apresenta apenas um espaço, a capela-mor.
in scheme: Tesauro SIPA
preferred label: Simple apse @en
broader: Cabeceira segundo o número de capelas

Cabeceira composta
type: Concept
scope note: Cabeceira de uma igreja que apresenta mais do que um espaço de culto.
in scheme: Tesauro SIPA
preferred label: Compound apse @en
broader: Cabeceira segundo o número de capelas
narrower: Cabeceira com duas capelas
narrower: Cabeceira tripartida
narrower: Cabeceira com cinco capelas

Cabeceira com duas capelas
type: Concept
scope note: Tipo de cabeceira de igreja composta por uma capela, a mor, ladeada por uma capela de Irmandade ou Confraria.
in scheme: Tesauro SIPA
preferred label: Double chapel apse @en
broader: Cabeceira composta

Cabeceira tripartida
type: Concept
scope note: Tipo de cabeceira de igreja composta por uma capela, a mor, flanqueada por duas capelas, que podem ser mais baixas e estreitas.
in scheme: Tesauro SIPA
preferred label: Triple apse @en
broader: Cabeceira composta

Cabeceira com cinco capelas
type: Concept
scope note: Tipo de cabeceira de igreja composta por uma capela central, a mor, flanqueada por quatro capelas colaterais, normalmente mais baixas e estreitas.
in scheme: Tesauro SIPA
preferred label: Five chapel apse @en
broader: Cabeceira composta

Transepto
type: Concept
scope note: Espaço disposto perpendicularmente às naves de um templo, na igreja católica ou mesquita, sendo, no caso do primeiro, subdividido em duas zonas, o cruzeiro do transepto, a zona central, com as mesmas dimensões da nave, e os braços laterais. Este espaço era, normalmente, destinado ao clero secular, servindo de zona coral ou de apoio às atividades litúrgicas. Com o Concílio Vaticano II e as normas de aproximação ao fiel durante as cerimónias litúrgicas, tornou-se uma zona aberta aos fiéis, sendo usual a colocação do altar-mor no cruzeiro do transepto. O transepto das mesquitas constitui uma nave, transversal à construção, mais elevada, sendo visível volumetricamente, recebendo, por isso, o nome de transepto, sendo frequentes nos séculos VIII e IX.
in scheme: Tesauro SIPA
preferred label: Transept @en
preferred label: Transetto @it
broader: Compartimentos e espaços de culto e devoção (Culto cristão)
narrower: Componentes do transepto
narrower: Transepto segundo a forma

Componentes do transepto
type: Concept
in scheme: Tesauro SIPA
preferred label: Transept components @en
preferred label: Composants du transept @fr
preferred label: Componenti del transetto @it
broader: Transepto
narrower: Braço do transepto
narrower: Cruzeiro do transepto

Braço do transepto
type: Concept
scope note: Cada um dos corpos salientes do transepto de um templo católico. Com a abertura deste espaço aos fiéis, tornou-se um local privilegiado para a instalação de capelas, normalmente particulares, pertencentes a uma Irmandade ou Confraria.
in scheme: Tesauro SIPA
preferred label: Transept arm @en
preferred label: Bras du transept @fr
preferred label: Braccio del transetto @it
broader: Componentes do transepto

Cruzeiro do transepto
type: Concept
scope note: Espaço situado na zona onde se intercepta o cruzeiro do transepto com a nave e a capela-mor e onde, por vezes, se situa o altar-mor.
in scheme: Tesauro SIPA
preferred label: Transept crossing @en
preferred label: Croisée du transept @fr
preferred label: Crociera del transetto @it
broader: Componentes do transepto

Transepto segundo a forma
type: Concept
in scheme: Tesauro SIPA
preferred label: Transept according to shape @en
preferred label: Transept selon la forme @fr
preferred label: Transetto secondo la forma @it
broader: Transepto
narrower: Transepto duplo
narrower: Transepto falso
narrower: Transepto inscrito
narrower: Transepto saliente

Transepto duplo
type: Concept
scope note: Existência de dois espaços perpendiculares à nave de um templo cristão e paralelos entre si, solução rara na arquitetura portuguesa, mas recorrente na arquitetura medieval europeia.
in scheme: Tesauro SIPA
preferred label: Double transept @en
broader: Transepto segundo a forma

Transepto falso
type: Concept
in scheme: Tesauro SIPA
preferred label: Fake transept @en
broader: Transepto segundo a forma

Transepto inscrito
type: Concept
scope note: Espaço perpendicular à nave de um templo cristão, apenas marcado por elementos arquitetónicos, não se destacando em altura nem em largura
in scheme: Tesauro SIPA
preferred label: Enrolled transept @en
broader: Transepto segundo a forma

Transepto saliente
type: Concept
scope note: Espaço perpendicular às naves de um templo cristão, com os braços salientes, dando origem a uma planta em cruz latina.
in scheme: Tesauro SIPA
preferred label: Projecting transept @en
broader: Transepto segundo a forma

Varanda de benedictione
type: Concept
in scheme: Tesauro SIPA
preferred label: Benediction balcony @en
preferred label: Balcon de bénédiction @fr
preferred label: Balcone della benedictione @it
broader: Compartimentos e espaços de culto e devoção (Culto cristão)

Compartimentos e espaços de educação (Culto cristão)
type: Concept
in scheme: Tesauro SIPA
preferred label: Educational compartments and spaces (Christian worship) @en
preferred label: Compartiments et espaces éducatifs (Culte chrétien) @fr
preferred label: Compartimenti e spazi educativi (Culto cristiano) @it
broader: Culto cristão
narrower: Noviciado (Compartimentos e espaços de educação)
narrower: Sala de catequese

Noviciado (Compartimentos e espaços de educação)
type: Concept
scope note: Espaço conventual, situado em locais variáveis, consoante a ordem ou a estrutura do edifício, destinado aos noviços (masculinos ou femininos), ou seja aqueles que pretendiam estudar e tornarem-se professos, jurando os preceitos da ordem religiosa respetiva. Era subdividido em vários espaços, como zonas de aula, espaços de dormida e espaços de oração, tendo, normalmente, uma pequena capela doméstica.
in scheme: Tesauro SIPA
preferred label: Novitiate (Specific educational compartments and spaces) @en
preferred label: Noviciat (Compartiments et espaces éducatifs spécifiques) @fr
preferred label: Noviziato (Compartimenti e spazi educativi specifici) @it
broader: Compartimentos e espaços de educação (Culto cristão)

Sala de catequese
type: Concept
scope note: Espaço destinado ao ensino dos preceitos religiosos aos laicos, estando situados, normalmente, no centro paroquial ou num anexo à igreja.
in scheme: Tesauro SIPA
preferred label: Catechism room @en
preferred label: Salle de catéchèse @fr
preferred label: Sala catechistica @it
broader: Compartimentos e espaços de educação (Culto cristão)

Compartimentos e espaços de estar e de convívio social (Culto cristão)
type: Concept
in scheme: Tesauro SIPA
preferred label: Culto cristão) (Living and socialising compartments and spaces (Christian worship) @en
preferred label: Compartiments et espaces de vie et de socialisation @fr
preferred label: Compartimenti e spazi per la vita e la socializzazione @it
broader: Culto cristão
narrower: Calefatório
narrower: Salão paroquial (Compartimentos e espaços específicos de estar e de convívio social)

Calefatório
type: Concept
scope note: Espaço comunitário num cenóbio, situado no primeiro ou segundo piso do claustro, possuindo uma lareira, que permitia produzir calor e aquecer os frades nos meses mais rigorosos do Inverno, sendo rodeado por bancos corridos, em cantaria ou de madeira.
in scheme: Tesauro SIPA
preferred label: Calefactory @en
preferred label: Salle de chauffage @fr
preferred label: Sala per il riscaldamento @it
alternative label: Casa do fogo
broader: Compartimentos e espaços de estar e de convívio social (Culto cristão)

Salão paroquial (Compartimentos e espaços específicos de estar e de convívio social)
type: Concept
in scheme: Tesauro SIPA
preferred label: Parish hall (Specific compartments and spaces for living and socialising) @en
preferred label: Salle paroissiale (compartiments et espaces spécifiques pour la vie et la convivialité) @fr
preferred label: Sala parrocchiale (Compartimenti e spazi specifici per la vita e la socializzazione) @it
broader: Compartimentos e espaços de estar e de convívio social (Culto cristão)

Compartimentos e espaços de exposição (Culto católico)
type: Concept
in scheme: Tesauro SIPA
preferred label: Exhibition compartments and spaces (Catholic worship) @en
preferred label: Compartiments et espaces d'exposition (culte catholique) @fr
preferred label: Compartimenti e spazi espositivi (Culto cattolico) @it
broader: Culto cristão
narrower: Sala dos ex-votos

Sala dos ex-votos
type: Concept
in scheme: Tesauro SIPA
preferred label: Ex-voto room (chapel) @en
preferred label: Salle d'ex-voto @fr
preferred label: Sala ex-voto @it
broader: Compartimentos e espaços de exposição (Culto católico)

Compartimentos e espaços de purificação, de banho e de vestir (Culto católico)
type: Concept
in scheme: Tesauro SIPA
preferred label: Compartments and rooms for purification, bathing and dressing) @en
preferred label: Compartiments et espaces pour la purification, le bain et l'habillement @fr
preferred label: Vani e spazi per la purificazione, il bagno e la vestizione @it
broader: Culto cristão
narrower: Casa do lavabo

Casa do lavabo
type: Concept
in scheme: Tesauro SIPA
preferred label: Washroom (Ablutions room) @en
preferred label: Salle de bain (Maison des ablutions @fr
preferred label: Bagno (Casa delle abluzioni) @it
alternative label: Casa de abluções
broader: Compartimentos e espaços de purificação, de banho e de vestir (Culto católico)

Compartimentos e espaços de receção (Culto católico)
type: Concept
in scheme: Tesauro SIPA
preferred label: Reception compartments and spaces @en
preferred label: Compartiments et espaces de réception @fr
preferred label: Compartimnti e spazi di accoglienza @it
hidden label: Compartimentos e espaços de recepção (Culto católico)
broader: Culto cristão
narrower: Casa da grade regral
narrower: Casa da roda (Compartimentos e espaços de receção)

Casa da grade regral
type: Concept
in scheme: Tesauro SIPA
preferred label: Regral grid house @en
broader: Compartimentos e espaços de receção (Culto católico)

Casa da roda (Compartimentos e espaços de receção)
type: Concept
in scheme: Tesauro SIPA
preferred label: Wheel house (Reception rooms and spaces) @en
hidden label: Casa da roda (Compartimentos e espaços de recepção)
broader: Compartimentos e espaços de receção (Culto católico)

Compartimentos e espaços de reunião e assembleia (Culto católico)
type: Concept
in scheme: Tesauro SIPA
preferred label: Meeting and assembly rooms and spaces @en
preferred label: Compartimenti et espaces de réunion et d'assemblée @fr
preferred label: Compartimenti e spazi per riunioni e assemblee @it
broader: Culto cristão
narrower: Casa do capítulo
narrower: De profundis

Casa do capítulo
type: Concept
in scheme: Tesauro SIPA
preferred label: Chapter house @en
preferred label: Maison du chapitre @fr
preferred label: Camera capitolare @it
alternative label: Sala do capítulo
broader: Compartimentos e espaços de reunião e assembleia (Culto católico)

De profundis
type: Concept
in scheme: Tesauro SIPA
broader: Compartimentos e espaços de reunião e assembleia (Culto católico)

Compartimentos e espaços litúrgicos (Culto católico)
type: Concept
in scheme: Tesauro SIPA
preferred label: Liturgical chambers and rooms @en
preferred label: Compartiments et salles liturgiques @fr
preferred label: Compartimenti e stanze liturgiche @it
broader: Culto cristão
narrower: Assembleia (Compartimentos e espaços específicos litúrgicos)
narrower: Batistério (Compartimentos e espaços específicos litúrgicos)
narrower: Capela (Compartimentos e espaços específicos litúrgicos)
narrower: Comungatório
narrower: Coro
narrower: Presbitério (Compartimentos e espaços específicos litúrgicos)
narrower: Protesis
narrower: Sala de benedictione
narrower: Salão (Compartimentos e espaços específicos litúrgicos)

Assembleia (Compartimentos e espaços específicos litúrgicos)
type: Concept
in scheme: Tesauro SIPA
preferred label: Assembly (Specific liturgical compartments and spaces) @en
preferred label: Assemblée (Compartiments et espaces liturgiques spécifiques) @fr
preferred label: Assemblea (Compartimenti e spazi liturgici specifici) @it
broader: Compartimentos e espaços litúrgicos (Culto católico)

Batistério (Compartimentos e espaços específicos litúrgicos)
type: Concept
in scheme: Tesauro SIPA
preferred label: Baptistery (Specific liturgical compartments and spaces) @en
preferred label: Baptistère (Compartiments et espaces liturgiques spécifiques) @fr
preferred label: Battistero (Compartimenti e spazi liturgici specifici) @it
hidden label: Baptistério (Compartimentos e espaços específicos litúrgicos)
broader: Compartimentos e espaços litúrgicos (Culto católico)

Capela (Compartimentos e espaços específicos litúrgicos)
type: Concept
in scheme: Tesauro SIPA
preferred label: Chapel (Specific liturgical compartments and spaces) @en
preferred label: Chapelle (Compartiments et espaces liturgiques spécifiques) @fr
preferred label: Capella (Compartimenti e spazi liturgici specifici) @it
broader: Compartimentos e espaços litúrgicos (Culto católico)
narrower: Capela colateral
narrower: Capela doméstica
narrower: Capela lateral
narrower: Capela-mor
narrower: Capela radiante

Capela colateral
type: Concept
in scheme: Tesauro SIPA
preferred label: Side chapel @en
alternative label: Coro lateral
broader: Capela (Compartimentos e espaços específicos litúrgicos)
narrower: Absidíolo

Absidíolo
type: Concept
in scheme: Tesauro SIPA
preferred label: Apse chapel @en
preferred label: Absidiole (Chapelle absidiale) @fr
preferred label: Capella radiale @it
broader: Capela colateral

Capela doméstica
type: Concept
in scheme: Tesauro SIPA
preferred label: Domestic chapel @en
broader: Capela (Compartimentos e espaços específicos litúrgicos)

Capela lateral
type: Concept
in scheme: Tesauro SIPA
preferred label: Side chapel @en
broader: Capela (Compartimentos e espaços específicos litúrgicos)

Capela-mor
type: Concept
in scheme: Tesauro SIPA
preferred label: Sanctuary @en
alternative label: Adussia
alternative label: Agnistério
alternative label: Ousia
alternative label: Presbitério (Capela)
alternative label: Santuário (Capela)
broader: Capela (Compartimentos e espaços específicos litúrgicos)
narrower: Ábside; Abside

Ábside; Abside
type: Concept
in scheme: Tesauro SIPA
preferred label: Abside @it
preferred label: Apse; Apsis @en
preferred label: Abside; Chevet @fr
alternative label: Apside
broader: Capela-mor

Capela radiante
type: Concept
in scheme: Tesauro SIPA
preferred label: Capella radiale @it
preferred label: Apsidal chapel @en
preferred label: Chapelle absidiale @fr
broader: Capela (Compartimentos e espaços específicos litúrgicos)

Comungatório
type: Concept
in scheme: Tesauro SIPA
preferred label: Communion rail @en
preferred label: Sainte table @fr
broader: Compartimentos e espaços litúrgicos (Culto católico)

Coro
type: Concept
in scheme: Tesauro SIPA
preferred label: Choir @en
preferred label: Choeur d'église @fr
preferred label: Coretto @it
broader: Compartimentos e espaços litúrgicos (Culto católico)
narrower: Coro-alto
narrower: Coro-baixo
narrower: Retrocoro

Coro-alto
type: Concept
in scheme: Tesauro SIPA
preferred label: High choir @en
broader: Coro

Coro-baixo
type: Concept
in scheme: Tesauro SIPA
preferred label: Low choir @en
broader: Coro

Retrocoro
type: Concept
in scheme: Tesauro SIPA
preferred label: Retrochoir @en
broader: Coro

Presbitério (Compartimentos e espaços específicos litúrgicos)
type: Concept
in scheme: Tesauro SIPA
preferred label: Presbitery (Specific liturgical compartments and spaces) @en
preferred label: Presbytère (Compartiments et espaces liturgiques spécifiques) @fr
preferred label: Presbiterio (Compartimenti e spazi liturgici specifici) @it
broader: Compartimentos e espaços litúrgicos (Culto católico)

Protesis
type: Concept
in scheme: Tesauro SIPA
preferred label: Prothesis @en
broader: Compartimentos e espaços litúrgicos (Culto católico)

Sala de benedictione
type: Concept
in scheme: Tesauro SIPA
preferred label: Benediction room @en
preferred label: Salle de bénédiction @fr
preferred label: Sala della benedictione @it
broader: Compartimentos e espaços litúrgicos (Culto católico)

Salão (Compartimentos e espaços específicos litúrgicos)
type: Concept
in scheme: Tesauro SIPA
preferred label: Hall (Specific liturgical compartments and spaces) @en
preferred label: Salle (Compartiments et espaces liturgiques spécifiques) @fr
preferred label: Salone (Compartimenti e spazi liturgici specifici) @it
broader: Compartimentos e espaços litúrgicos (Culto católico)

Culto islâmico
type: Concept
in scheme: Tesauro SIPA
preferred label: Islamic worship @en
preferred label: Culte islamique @fr
preferred label: Culto islamico @it
broader: Compartimentos e espaços religiosos específicos segundo o culto
narrower: Compartimentos e espaços de acesso, circulação, distribuição e transição (Culto islâmico)
narrower: Compartimentos e espaços de educação (Culto islâmico)

Compartimentos e espaços de acesso, circulação, distribuição e transição (Culto islâmico)
type: Concept
in scheme: Tesauro SIPA
preferred label: Compartments and spaces for access, circulation, distribution and transition (Islamic worship) @en
preferred label: Compartiments et espaces d'accès, de circulation, de distribution et de transition (Culte islamique) @fr
preferred label: Compartimenti e spazi per l'accesso, la circolazione, la distribuzione e la transizione (Culto islamico) @it
broader: Culto islâmico
narrower: Iwan
narrower: Sahn

Iwan
type: Concept
in scheme: Tesauro SIPA
broader: Compartimentos e espaços de acesso, circulação, distribuição e transição (Culto islâmico)

Sahn
type: Concept
scope note: Espaço descoberto total ou parcialmente, formando o pátio de uma mesquita.
in scheme: Tesauro SIPA
broader: Compartimentos e espaços de acesso, circulação, distribuição e transição (Culto islâmico)

Compartimentos e espaços de educação (Culto islâmico)
type: Concept
in scheme: Tesauro SIPA
preferred label: Educational compartments and spaces (Islamic cult) @en
preferred label: Compartiments et espaces destinés à l'enseignement (culte islamique) @fr
preferred label: Compartimenti e spazi per l'educazione (culto islamico) @it
broader: Culto islâmico
narrower: Madraça

Madraça
type: Concept
scope note: Espaço de uma mesquita destinado ao ensino.
in scheme: Tesauro SIPA
preferred label: Madrasa @en
preferred label: Madrasa; Madrassah @fr
broader: Compartimentos e espaços de educação (Culto islâmico)

Culto judaico
type: Concept
in scheme: Tesauro SIPA
preferred label: Jewish worship @en
preferred label: Culte juif @fr
preferred label: Culto ebraico @it
broader: Compartimentos e espaços religiosos específicos segundo o culto
narrower: Compartimentos e espaços de culto e devoção (Culto judaico)
narrower: Compartimentos e espaços de purifucação (Culto judaico)

Compartimentos e espaços de culto e devoção (Culto judaico)
type: Concept
in scheme: Tesauro SIPA
preferred label: Compartments and spaces for worship and devotion (Jewish worship) @en
preferred label: Compartiments et espaces pour le culte et la dévotion (culte juif) @fr
preferred label: Compartimenti e spazi per il culto e la devozione (Culto ebraico) @it
broader: Culto judaico
narrower: Compartimentos e espaços litúrgicos (Culto judaico)

Compartimentos e espaços litúrgicos (Culto judaico)
type: Concept
in scheme: Tesauro SIPA
preferred label: Liturgical compartments and spaces (Jewish worship) @en
preferred label: Compartiments et espaces liturgiques (culte juif) @fr
preferred label: Compartimenti e spazi liturgici (Culto ebraico) @it
broader: Compartimentos e espaços de culto e devoção (Culto judaico)
narrower: Teba

Teba
type: Concept
scope note: Espaço elevado no interior de uma sinagoga, onde é feita a leitura dos livros sagrados.
in scheme: Tesauro SIPA
preferred label: Theba @fr
broader: Compartimentos e espaços litúrgicos (Culto judaico)

Compartimentos e espaços de purifucação (Culto judaico)
type: Concept
in scheme: Tesauro SIPA
preferred label: Compartments and spaces of purification (Jewish cult) @en
preferred label: Compartiments et espaces pour la purification (culte juif) @fr
preferred label: Compartimenti e spazi per la purificazione (Servizio ebraico) @it
broader: Culto judaico
narrower: Mikvé

Mikvé
type: Concept
scope note: Espaço onde se encontra instalada uma piscina cheia com água natural, utilizada para a imersão ritual de acordo com as leis judaicas, constituindo um ato de purificação.
in scheme: Tesauro SIPA
preferred label: Mikveh; Mikvah @en
broader: Compartimentos e espaços de purifucação (Culto judaico)

Compartimentos e espaços residenciais
type: Concept
in scheme: Tesauro SIPA
preferred label: Residential compartments and spaces @en
preferred label: Compartiments et espaces de résidence @fr
preferred label: Compartimenti e spazi abitativi @it
broader: Compartimentos e espaços específicos
narrower: Câmara (Compartimentos e espaços residenciais)
narrower: Compartimentos e espaços de acesso, circulação, distribuição e transição (Compartimentos e espaços residenciais)
narrower: Compartimentos e espaços de armazenamento (Compartimentos e espaços residenciais)
narrower: Compartimentos e espaços de estar e de convívio social (Compartimentos e espaços residenciais)
narrower: Compartimentos e espaços de receção (Compartimentos e espaços residenciais)
narrower: Compartimentos e espaços de refeição e bebida (Compartimentos e espaços residenciais)

Câmara (Compartimentos e espaços residenciais)
type: Concept
scope note: Quarto ou gabinete numa casa de habitação.
in scheme: Tesauro SIPA
preferred label: Chamber (Residential compartments and spaces) @en
preferred label: Chambre (Compartiments et espaces résidentiels) @fr
preferred label: Camera (Compartimenti e spazi residenziali) @it
broader: Compartimentos e espaços residenciais

Compartimentos e espaços de acesso, circulação, distribuição e transição (Compartimentos e espaços residenciais)
type: Concept
in scheme: Tesauro SIPA
preferred label: Compartments and spaces for access, circulation, distribution and transition (Residential compartments and spaces) @en
preferred label: Compartiments et espaces d'accès, de circulation, de distribution et de transition (Compartiments et espaces résidentiels) @fr
preferred label: Compartimenti e spazi di accesso, circolazione, distribuzione e transizione (Compartimenti e spazi residenziali) @it
broader: Compartimentos e espaços residenciais
narrower: Antecâmara
narrower: Antessala
narrower: Pátio de honra
narrower: Trascâmara

Antecâmara
type: Concept
scope note: Divisória contígua a um quarto ou a uma sala, antecedendo-o, servindo de local de espera.
in scheme: Tesauro SIPA
preferred label: Antechamber @en
preferred label: Antichambre @fr
preferred label: Anticamera @it
broader: Compartimentos e espaços de acesso, circulação, distribuição e transição (Compartimentos e espaços residenciais)

Antessala
type: Concept
in scheme: Tesauro SIPA
preferred label: Antichambre @fr
preferred label: Anticamera @it
preferred label: Anteroom (Waiting room) @en
broader: Compartimentos e espaços de acesso, circulação, distribuição e transição (Compartimentos e espaços residenciais)

Pátio de honra
type: Concept
in scheme: Tesauro SIPA
preferred label: Forecourt (Cour d’ honneur) @en
broader: Compartimentos e espaços de acesso, circulação, distribuição e transição (Compartimentos e espaços residenciais)

Trascâmara
type: Concept
in scheme: Tesauro SIPA
preferred label: Transchamber @en
broader: Compartimentos e espaços de acesso, circulação, distribuição e transição (Compartimentos e espaços residenciais)

Compartimentos e espaços de armazenamento (Compartimentos e espaços residenciais)
type: Concept
in scheme: Tesauro SIPA
preferred label: Storage compartments and spaces (Residential compartments and spaces) @en
preferred label: Compartiments et espaces de stockage (Compartiments et espaces résidentiels) @fr
preferred label: Compartimenti e spazi di stoccaggio (Compartimenti e spazi residenziali) @it
broader: Compartimentos e espaços residenciais
narrower: Tablino
narrower: Depósito de valores mobiliários (Compartimentos e espaços específicos de armazanemanto)

Tablino
type: Concept
in scheme: Tesauro SIPA
preferred label: Tablinum (Tabulinum) @en
preferred label: Tablinum @fr
broader: Compartimentos e espaços de armazenamento (Compartimentos e espaços residenciais)

Depósito de valores mobiliários (Compartimentos e espaços específicos de armazanemanto)
type: Concept
in scheme: Tesauro SIPA
preferred label: Dépôt de titres (Compartiments et espaces de stockage spécifiques) @fr
preferred label: Securities deposit (Specific storage compartments and spaces) @en
preferred label: Deposito titoli (Comparti e spazi specifici per il deposito) @it
broader: Compartimentos e espaços de armazenamento (Compartimentos e espaços residenciais)
narrower: Mantearia

Mantearia
type: Concept
scope note: Divisória onde se guardavam todos os utensílios destinados à mesa real.
in scheme: Tesauro SIPA
preferred label: Tapestries deposit @en
preferred label: Salle de stockage des tapisseries @fr
preferred label: Deposito degli arazzi @it
broader: Depósito de valores mobiliários (Compartimentos e espaços específicos de armazanemanto)

Compartimentos e espaços de estar e de convívio social (Compartimentos e espaços residenciais)
type: Concept
in scheme: Tesauro SIPA
preferred label: Living and socialising compartments and spaces (Residential compartments and spaces) @en
preferred label: Compartiments et espaces de vie et de socialisation (Compartiments et espaces résidentiels) @fr
preferred label: Compartimenti e spazi per la vita e la socializzazione (Compratimenti e spazi residenziali) @it
broader: Compartimentos e espaços residenciais
narrower: Açoteia
narrower: Jardim de inverno
narrower: Sala de fumo (Compartimentos e espaços de estar e de convívio social (Compartimentos e espaços residenciais)

Açoteia
type: Concept
scope note: Terraço na cobertura de uma casa, com acesso por escada, muito utilizado na arquitetura do sul de Portugal.
in scheme: Tesauro SIPA
preferred label: Terrasse @fr
preferred label: Hatcherie (Terrace roof) @en
preferred label: Terrazza (Altana) @it
broader: Compartimentos e espaços de estar e de convívio social (Compartimentos e espaços residenciais)

Jardim de inverno
type: Concept
in scheme: Tesauro SIPA
preferred label: Wintergarden @en
preferred label: Jardin d'hiver @fr
preferred label: Giardino d'inverno @it
broader: Compartimentos e espaços de estar e de convívio social (Compartimentos e espaços residenciais)

Sala de fumo (Compartimentos e espaços de estar e de convívio social (Compartimentos e espaços residenciais)
type: Concept
in scheme: Tesauro SIPA
preferred label: Smoking room (Living and socialising compartments and spaces (Residential compartments and spaces)) @en
preferred label: Fumoir (Compartiments et espaces de vie et de socialisation (Compartiments et espaces résidentiels)) @fr
preferred label: Sala fumatori (Compartimenti e spazi per la vita e la socializzazione (Compratimenti e spazi residenziali)) @it
broader: Compartimentos e espaços de estar e de convívio social (Compartimentos e espaços residenciais)

Compartimentos e espaços de receção (Compartimentos e espaços residenciais)
type: Concept
in scheme: Tesauro SIPA
preferred label: Compartiments et espaces de vie et de socialisation (Compartiments et espaces résidentiels) @fr
preferred label: Reception compartments and spaces (Residential compartments and spaces) @en
preferred label: Compartimenti e spazi di accoglienza (Compartimenti e spazi residenziali) @it
hidden label: Compartimentos e espaços de recepção (Compartimentos e espaços residenciais)
broader: Compartimentos e espaços residenciais
narrower: Sala de fora

Sala de fora
type: Concept
in scheme: Tesauro SIPA
preferred label: Out room; Outside hall; Outside room @en
preferred label: Salle extérieure @fr
preferred label: Camera esterna @it
broader: Compartimentos e espaços de receção (Compartimentos e espaços residenciais)

Compartimentos e espaços de refeição e bebida (Compartimentos e espaços residenciais)
type: Concept
in scheme: Tesauro SIPA
preferred label: Meal and beverage compartments and spaces (Residential compartments and spaces) @en
preferred label: Compartiments et espaces de restauration (Compartiments et espaces résidentiels) @fr
preferred label: Compartimenti e spazi per alimenti e bevande (Compartimenti e spazi residenziali) @it
broader: Compartimentos e espaços residenciais
narrower: Compartimentos e espaços de consumo (Compartimentos e espaços de refeição e bebida)

Compartimentos e espaços de consumo (Compartimentos e espaços de refeição e bebida)
type: Concept
in scheme: Tesauro SIPA
preferred label: Consumption compartments and spaces (Meal and beverage compartments and spaces) @en
preferred label: Compartiments et espaces de consommation (Compartiments et espaces de restauration) @fr
preferred label: Compartimenti e spazi per il consumo (Compartimenti e spazi per la ristorazione) @it
broader: Compartimentos e espaços de refeição e bebida (Compartimentos e espaços residenciais)
narrower: Triclínio

Triclínio
type: Concept
scope note: Espaço de refeição numa casa romana, dotada de três lectus triclinaris, dispostos em torno de uma mesa.
in scheme: Tesauro SIPA
preferred label: Triclinium @en
preferred label: Triclinio @it
broader: Compartimentos e espaços de consumo (Compartimentos e espaços de refeição e bebida)

Compartimentos e espaços genéricos
type: Concept
in scheme: Tesauro SIPA
preferred label: Generic compartments and spaces @en
preferred label: Compartiments et espaces génériques @fr
preferred label: Compartimenti e spazi generici @it
broader: Compartimentos e espaços
narrower: Ala
narrower: Fogo
narrower: Fração
narrower: Talhão
narrower: Tramo
narrower: Compartimentos e espaços genéricos segundo a função

Ala
type: Concept
scope note: Compartimento de circulação, que acompanha todo o corpo principal de um edifício ou estrutura.
in scheme: Tesauro SIPA
preferred label: Ward @en
preferred label: Aile @fr
broader: Compartimentos e espaços genéricos

Fogo
type: Concept
scope note: Unidade habitacional num edifício ou casa multifamiliar.
in scheme: Tesauro SIPA
preferred label: Home; Homesteads @en
preferred label: Logement @fr
preferred label: Abitazione @it
broader: Compartimentos e espaços genéricos

Fração
type: Concept
in scheme: Tesauro SIPA
preferred label: Fraction @en
hidden label: Fracção
broader: Compartimentos e espaços genéricos

Talhão
type: Concept
in scheme: Tesauro SIPA
preferred label: Plot (Patch) @en
preferred label: Parcelle @fr
preferred label: Particella @it
broader: Compartimentos e espaços genéricos

Tramo
type: Concept
scope note: Unidade arquitetónica em que se subdivide uma nave, ou uma abóbada, delimitada por arcos torais, formeiros e respetivos suportes.
in scheme: Tesauro SIPA
preferred label: Span @en
broader: Compartimentos e espaços genéricos

Compartimentos e espaços genéricos segundo a função
type: Concept
in scheme: Tesauro SIPA
preferred label: Generic compartments and spaces by function @en
preferred label: Compartiments et espaces génériques selon la fonction @fr
preferred label: Compartimenti e spazi generici secondo la funzione @it
broader: Compartimentos e espaços genéricos
narrower: Compartimentos e espaços genéricos de acesso, circulação, distribuição e transição
narrower: Compartimentos e espaços genéricos de apoio infraestrutural
narrower: Compartimentos e espaços genéricos de armazenamento (Compartimento e espaços genéricos)
narrower: Compartimentos e espaços genéricos de assistência
narrower: Compartimentos e espaços genéricos de atendimento e receção
narrower: Compartimentos e espaços genéricos de atuação
narrower: Compartimentos e espaços genéricos de banho, de vestir e sanitários
narrower: Compartimento e espaços genéricos de comunicação e de difusão de dados e registos (Compartimentos e espaços culturais e recreativos)
narrower: Compartimentos e espaços genéricos de criação e exploração animal e vegetal
narrower: Compartimentos e espaços genéricos de detenção e punição
narrower: Compartimentos e espaços genéricos de direção e de coordenação
narrower: Compartimentos e espaços genéricos de dormida e de repouso
narrower: Compartimentos e espaços genéricos de educação
narrower: Compartimentos e espaços genéricos de ensaio artístico
narrower: Compartimentos e espaços genéricos de entretenimento
narrower: Compartimentos e espaços genéricos de estar e de convívio social
narrower: Compartimentos e espaços genéricos de exercício físico, recreio e de prática desportiva
narrower: Compartimentos e espaços genéricos de exposição
narrower: Compartimentos e espaços genéricos de higienização, de desinfeção e desinfestação
narrower: Compartimentos e espaços genéricos de monitorização e de controlo
narrower: Compartimentos e espaços genéricos de observação e análise, de experiência e diagnóstico técnico e científico
narrower: Compartimentos e espaços genéricos de prevenção, de tratamento clínico e intervenção cirúrgica
narrower: Compartimentos e espaços genéricos de processamento e de transformação de materiais e produtos
narrower: Compartimentos e espaços genéricos de recolha, de produção e de processamento de dados e registos
narrower: Compartimentos e espaços genéricos de refeição e bebida
narrower: Compartimentos e espaços genéricos de reunião e assembleia
narrower: Compartimentos e espaços genéricos de transação comercial de bens e serviços
narrower: Compartimentos e espaços genéricos multiusos

Compartimentos e espaços genéricos de acesso, circulação, distribuição e transição
type: Concept
in scheme: Tesauro SIPA
preferred label: Compartments and spaces for access, circulation, distribution and transition (Generic compartments and spaces) @en
preferred label: Compartiments et espaces d'accès, de circulation, de distribution et de transition (compartiments et espaces génériques) @fr
preferred label: Compartimenti e spazi di accesso, circolazione, distribuzione e transizione (Compartimenti e spazi generici) @it
broader: Compartimentos e espaços genéricos segundo a função
narrower: Alpendre
narrower: Átrio
narrower: Corredor
narrower: Coxia
narrower: Gabinete de revista
narrower: Galeria (Compartimentos e espaços genéricos de acesso, circulação, distribuição e transição)
narrower: Logradouro
narrower: Loggia
narrower: Nave
narrower: Pátio
narrower: Passadiço
narrower: Peristilo
narrower: Próstilo
narrower: Quintal
narrower: Saguão
narrower: Terraço (Compartimentos e espaços genéricos de acesso, circulação, distribuição e transição)
narrower: Terreiro (Compartimentos e espaços genéricos de acesso, circulação, distribuição e transição)
narrower: Túnel de acesso (Compartimentos e espaços genéricos de acesso, circulação, distribuição e transição)
narrower: Vestíbulo

Alpendre
type: Concept
in scheme: Tesauro SIPA
preferred label: Porch @en
preferred label: Porche @fr
preferred label: Loggia @it
broader: Compartimentos e espaços genéricos de acesso, circulação, distribuição e transição

Átrio
type: Concept
scope note: Pátio central da antiga casa romana, com área coberta a uma água, permitindo a descarga das águas pluviais para um tanque central, o compluvium.
in scheme: Tesauro SIPA
preferred label: Atrium
preferred label: Atrium (Parvis) @fr
preferred label: Atrio @it
broader: Compartimentos e espaços genéricos de acesso, circulação, distribuição e transição

Corredor
type: Concept
scope note: Espaço rasgado num maciço (parede ou muro) ou situado entre duas paredes ou dois muros, para permitir o acesso a um edifício ou estrutura ou a um compartimento ou espaço.
in scheme: Tesauro SIPA
preferred label: Hallway @en
preferred label: Couloir @fr
preferred label: Corridoio @it
broader: Compartimentos e espaços genéricos de acesso, circulação, distribuição e transição

Coxia
type: Concept
scope note: Espaço lateral sem obstáculos, numa área de assistência, seja numa casa de espetáculo ou num templo. No caso da área formar um declive, pode assumir a forma de rampa ou ter alguns degraus para vencer o desnível.
in scheme: Tesauro SIPA
preferred label: Couloir @fr
preferred label: Aisle @en
preferred label: Corsia (Ballatoio) @it
broader: Compartimentos e espaços genéricos de acesso, circulação, distribuição e transição

Gabinete de revista
type: Concept
in scheme: Tesauro SIPA
preferred label: Magazine office @en
broader: Compartimentos e espaços genéricos de acesso, circulação, distribuição e transição

Galeria (Compartimentos e espaços genéricos de acesso, circulação, distribuição e transição)
type: Concept
in scheme: Tesauro SIPA
preferred label: Gallery (Compartments and spaces for access, circulation, distribution and transition) @en
preferred label: Galerie (Compartiments et espaces d'accès, de circulation, de distribution et de transition) @fr
preferred label: Galleria (Compartimenti e spazi di accesso, circolazione, distribuzione e transizione) @it
broader: Compartimentos e espaços genéricos de acesso, circulação, distribuição e transição

Logradouro
type: Concept
scope note: Espaço de recreio de pequenas dimensões, geralmente associado a um edifício residencial.
in scheme: Tesauro SIPA
preferred label: Uncultivated field (Adjacent ground) @en
broader: Compartimentos e espaços genéricos de acesso, circulação, distribuição e transição

Loggia
type: Concept
in scheme: Tesauro SIPA
broader: Compartimentos e espaços genéricos de acesso, circulação, distribuição e transição

Nave
type: Concept
scope note: Espaço longitudinal de uma igreja, oratório, mesquita ou sinagoga, destinado aos fiéis, que se inicia no portal de acesso e termina no transepto, na parede testeira ou no arco triunfal, conforme o âmbito religioso do templo. O número de naves é variável, atingindo o máximo de amplitude nas mesquitas. Pode designar espaços semelhantes existentes numa fábrica ou numa estação ferroviária.
in scheme: Tesauro SIPA
preferred label: Aisle @en
preferred label: Nef @fr
preferred label: Navata @it
broader: Compartimentos e espaços genéricos de acesso, circulação, distribuição e transição
narrower: Nave central
narrower: Nave lateral

Nave central
type: Concept
scope note: Nave principal de um templo, normalmente de maiores dimensões, mais larga e/ou mais alta.
in scheme: Tesauro SIPA
preferred label: Central aisle @en
broader: Nave

Nave lateral
type: Concept
scope note: Cada uma das naves que flanqueiam a nave central, em número de duas ou quatro, nas igrejas católicas. Pode, ainda surgir, uma única nave lateral, normalmente no lado do Evangelho.
in scheme: Tesauro SIPA
preferred label: Side aisle @en
alternative label: Nave colateral
broader: Nave

Pátio
type: Concept
scope note: Espaço murado, pavimentado e descoberto, integrado num edifício ou num conjunto de edifícios, podendo estar totalmente rodeado por construções ou parcialmente rodeado por muros altos. Os pátios têm em comum o objetivo de guardar um espaço aberto de privacidade e uma referência espacial de intimidade, associado ao facto de, como espaço exterior, permitir a iluminação e a ventilação. Independentemente da sua tipologia, a principal característica é constituir um espaço aberto com carácter de interioridade, afirmando-se como o centro da vivência da casa ou do conjunto edificado que o encerra. No Ocidente a casa com pátio afirma-se fundamentalmente com as culturas Grega e Romana. O conceito do pátio clássico encontra a sua origem na Grécia Antiga, quando no interior das habitações começa por surgir um espaço designado por attrium, onde se fazia o fogo. Com a especificação funcional da casa, o fogo passou para local próprio tendo o átrio ficado com a função de distribuidor dos diversos espaços da habitação. A evolução da casa urbana e a intensificação da vida social, promoveram o átrio a espaço nobre da habitação, recebendo um tratamento estético mais cuidado, alcançando o seu auge na casa romana de Roma e Pompeya. A cultura islâmica preconiza em larga escala a utilização de pátios, quer na habitação quer na mesquita e os conventos católicos recorrem à intimidade do pátio, desenvolvendo o claustro como espaço de reflexão. Nas casas rurais com pátio, este está rodeado pela habitação e pelas construções que contêm as diversas funções relacionadas com a vivência do dia a dia. Este pátio em terra ou pavimentado garante de uma forma funcional a ligação entre os vários edifícios, mantendo a privacidade do conjunto. Por vezes estes pátios estão delimitados em três lados por construções e o quarto lado é um muro alto com portão de acesso à rua. As conceções modernas e pós-modernas de casa adotaram o pátio, sob o traço de alguns dos grandes nomes da arquitetura do séc. XX, que adq…
in scheme: Tesauro SIPA
preferred label: Patio (Courtyard) @en
preferred label: Patio (Cour pavee) @fr
preferred label: Corte (Cortile) @it
broader: Compartimentos e espaços genéricos de acesso, circulação, distribuição e transição
narrower: Eido
narrower: Pátio dos cavalos
narrower: Pátio dos porcos

Eido
type: Concept
scope note: Terreno próximo a uma casa, podendo constituir um pátio, quintal ou pequena horta cercada, alguns cordões de vinha ou oliveiras e o poço.
in scheme: Tesauro SIPA
preferred label: Backyard @en
broader: Pátio

Pátio dos cavalos
type: Concept
in scheme: Tesauro SIPA
preferred label: Horse yard @en
preferred label: Parc à chevaux @fr
preferred label: Cortile per cavalli @it
broader: Pátio

Pátio dos porcos
type: Concept
in scheme: Tesauro SIPA
preferred label: Pig yard @en
preferred label: Parc à porcs @fr
preferred label: Cortile dei maiali @it
broader: Pátio

Passadiço
type: Concept
scope note: Galeria ou corredor suspenso que une dois espaços da mesma estrutura ou edifício. Pode ser coberto ou aberto.
in scheme: Tesauro SIPA
preferred label: Walkway @en
broader: Compartimentos e espaços genéricos de acesso, circulação, distribuição e transição

Peristilo
type: Concept
in scheme: Tesauro SIPA
preferred label: Peristile @en
preferred label: Péristyle @fr
preferred label: Peristilio @it
broader: Compartimentos e espaços genéricos de acesso, circulação, distribuição e transição

Próstilo
type: Concept
in scheme: Tesauro SIPA
preferred label: Prostyle @en
preferred label: Prostile @fr
broader: Compartimentos e espaços genéricos de acesso, circulação, distribuição e transição

Quintal
type: Concept
scope note: Terreno anexo à casa, geralmente para cultivo de horta ou jardim e apoio a outras atividades domésticas. Espaço comum no meio rural, que sobreviveu durante séculos nas cidades, ocupado por construções, à medida que a pressão demográfica aumentou, sobretudo a partir do século XX. Tem um papel preponderante na agricultura de subsistência em meio rural. No meio urbano os quintais que permaneceram sem construção foram tendencialmente transformados em jardins. O quintal tem um carácter doméstico e funcional, que o distingue do jardim vocacionado para o lazer. De pequena ou média dimensão localiza-se lateralmente ou nas traseiras da casa ou dos prédios e é fechado com um muro alto quando tem frente de rua. No último caso é comum existir porta de acesso ao exterior.
in scheme: Tesauro SIPA
preferred label: Backyard @en
preferred label: Potager @fr
preferred label: Cortile @it
broader: Compartimentos e espaços genéricos de acesso, circulação, distribuição e transição

Saguão
type: Concept
scope note: Espaço descoberto no interior de um edifício, delimitado pelo menos por três paredes exteriores. Conceito urbano relacionado com a densificação crescente do espaço edificado e com a necessidade de garantir boas condições de habitabilidade em lotes estreitos e profundos. É durante o século XIX e início do século XX, que o saguão começa a ser utilizado em larga escala, evoluindo a sua localização e tamanho em função da dimensão do lote. Em 1903 o Regulamento de Salubridade das Edificações Urbanas restringia a utilização de saguões para iluminar e arejar cozinhas, vestíbulos, antecâmaras ou escadas e determinava dimensões mínimas em função da altura do prédio. Em 1930 outro regulamento, o R.G.C.U., reforça as condicionantes à existência de saguão ou pátio interior, prevendo a obrigatoriedade da existência de logradouros ou quintais. No R.E.G.E.U. de 1950 desaparecem as referências à existência de saguões ou pátios interiores e dedica-se um artigo aos logradouros. Assim ao longo do século XX os regulamentos tendem a anular a existência do saguão. Atualmente em Portugal já não se recorre à utilização deste dispositivo, no entanto há países europeus, como por exemplo a Espanha, que ainda preveem a abertura de saguões na ocupação de lotes muito profundos. Criado com o objetivo de proporcionar iluminação e ventilação a divisões interiores, o saguão pressupõe um espaço livre de pequenas dimensões, idêntico a um pequeno pátio.
in scheme: Tesauro SIPA
preferred label: Atrio @it
preferred label: Lobby @en
preferred label: Arrière-cour; Courette @fr
broader: Compartimentos e espaços genéricos de acesso, circulação, distribuição e transição

Terraço (Compartimentos e espaços genéricos de acesso, circulação, distribuição e transição)
type: Concept
scope note: Área descoberta, situada no topo, ao nível do pavimento ou contíguo a um edifício, servindo de espaço de estar ou de circulação.
in scheme: Tesauro SIPA
preferred label: Terrace (Compartments and spaces for access, circulation, distribution and transition) @en
preferred label: Terrasse (Compartiments et espaces d'accès, de circulation, de distribution et de transition) @fr
preferred label: Terrazza (Compartimenti e spazi di accesso, circolazione, distribuzione e transizione) @it
alternative label: Eirado
broader: Compartimentos e espaços genéricos de acesso, circulação, distribuição e transição

Terreiro (Compartimentos e espaços genéricos de acesso, circulação, distribuição e transição)
type: Concept
scope note: Espaço aberto em terra compactada, geralmente junto a um edifício, designando as áreas de acesso a uma casa monástico-conventual, podendo ser aberto ou fechado.
in scheme: Tesauro SIPA
preferred label: Yard (Compartments and spaces for access, circulation, distribution and transition) @en
broader: Compartimentos e espaços genéricos de acesso, circulação, distribuição e transição
narrower: Terreiro das aves

Terreiro das aves
type: Concept
in scheme: Tesauro SIPA
preferred label: Animal farmyard @en
preferred label: Parc à volailles @fr
preferred label: Allevamento di pollame @it
broader: Terreiro (Compartimentos e espaços genéricos de acesso, circulação, distribuição e transição)

Túnel de acesso (Compartimentos e espaços genéricos de acesso, circulação, distribuição e transição)
type: Concept
in scheme: Tesauro SIPA
preferred label: Access tunnel (Compartments and spaces for access, circulation, distribution and transition) @en
preferred label: Tunnel d'accès (Compartiments et espaces d'accès, de circulation, de distribution et de transition) @fr
preferred label: Tunnel di accesso (Compartimenti e spazi di accesso, circolazione, distribuzione e transizione) @it
broader: Compartimentos e espaços genéricos de acesso, circulação, distribuição e transição

Vestíbulo
type: Concept
in scheme: Tesauro SIPA
preferred label: Vestibule @en
preferred label: Vestibolo @it
broader: Compartimentos e espaços genéricos de acesso, circulação, distribuição e transição

Compartimentos e espaços genéricos de apoio infraestrutural
type: Concept
in scheme: Tesauro SIPA
preferred label: Compartments and spaces for infrastructural support (Compartments and generic spaces) @en
preferred label: Compartiments et espaces d'appui à l'infrastructure (compartiments et espaces génériques) @fr
preferred label: Compartimenti e spazi di supporto infrastrutturale (Compartimenti e spazi generici) @it
broader: Compartimentos e espaços genéricos segundo a função
narrower: Casa das bombas
narrower: Casa das caldeiras
narrower: Casa das máquinas

Casa das bombas
type: Concept
in scheme: Tesauro SIPA
preferred label: Pump room @en
broader: Compartimentos e espaços genéricos de apoio infraestrutural

Casa das caldeiras
type: Concept
in scheme: Tesauro SIPA
preferred label: Boiler room @en
preferred label: Chaufferie @fr
preferred label: Sala caldaie @it
alternative label: Sala das caldeiras
broader: Compartimentos e espaços genéricos de apoio infraestrutural

Casa das máquinas
type: Concept
in scheme: Tesauro SIPA
preferred label: Engine room @en
preferred label: Salle des machines @fr
preferred label: Sala macchine @it
broader: Compartimentos e espaços genéricos de apoio infraestrutural

Compartimentos e espaços genéricos de armazenamento (Compartimento e espaços genéricos)
type: Concept
in scheme: Tesauro SIPA
preferred label: Compartments and storage spaces (Compartments and generic spaces) @en
preferred label: Compartiments et espaces de rangement (Compartiments et espaces génériques) @fr
preferred label: Compartimenti e vani portaoggetti (Compartimenti e vani generici) @it
broader: Compartimentos e espaços genéricos segundo a função
narrower: Abegoaria
narrower: Armazém (Compartimentos e espaços genéricos de armazenamento)
narrower: Arrecadação
narrower: Bengaleiro (Compartimentos e espaços genéricos de armazenamento)
narrower: Câmara frigorífica (Compartimentos e espaços genéricos de armazenamento)
narrower: Carvoaria (Compartimentos e espaços genéricos de armazenamento)
narrower: Casa dos arreios
narrower: Copa
narrower: Depósito (Compartimentos e espaços genéricos de armazenamento)
narrower: Recolha de veículos

Abegoaria
type: Concept
scope note: Espaço onde se recolhem as alfaias agrícolas e, por vezes, os animais utilizados nas atividades de cultivo.
in scheme: Tesauro SIPA
preferred label: Fattoria @it
preferred label: Stable @en
preferred label: Bouverie @fr
broader: Compartimentos e espaços genéricos de armazenamento (Compartimento e espaços genéricos)

Armazém (Compartimentos e espaços genéricos de armazenamento)
type: Concept
scope note: Espaço ou compartimento que serve para arrecadar determinado produto ou objeto.
in scheme: Tesauro SIPA
preferred label: Warehouse (Compartments and storage spaces) @en
preferred label: Magasin (Entrepôt) (Compartiments et espaces de rangement ) @fr
preferred label: Magazzino (Compartimenti e vani portaoggetti (Compartimenti e vani generici)) @it
broader: Compartimentos e espaços genéricos de armazenamento (Compartimento e espaços genéricos)

Arrecadação
type: Concept
scope note: Espaço ou compartimento onde se guarda algo.
in scheme: Tesauro SIPA
preferred label: Storeroom @en
preferred label: Débarras (Grenier) @fr
preferred label: Ripostiglio @it
broader: Compartimentos e espaços genéricos de armazenamento (Compartimento e espaços genéricos)

Bengaleiro (Compartimentos e espaços genéricos de armazenamento)
type: Concept
scope note: Compartimento onde se arrecadam, de forma temporária, os agasalhos durante um espetáculo cultural ou enquanto se procede a um determinado estudo numa biblioteca ou num arquivo.
in scheme: Tesauro SIPA
preferred label: Cloakroom (Compartments and generic storage spaces) @en
preferred label: Vestiaire (Compartiments et espaces de stockage génériques) @fr
preferred label: Guardaroba (Compartimenti e spazi di stoccaggio generici) @it
broader: Compartimentos e espaços genéricos de armazenamento (Compartimento e espaços genéricos)

Câmara frigorífica (Compartimentos e espaços genéricos de armazenamento)
type: Concept
in scheme: Tesauro SIPA
preferred label: Cold storage room (Compartments and generic storage spaces) @en
preferred label: Chambre froide (Compartiments et espaces de stockage génériques) @fr
preferred label: Camera refrigerata (Compartimenti e spazi di stoccaggio generici) @it
broader: Compartimentos e espaços genéricos de armazenamento (Compartimento e espaços genéricos)

Carvoaria (Compartimentos e espaços genéricos de armazenamento)
type: Concept
in scheme: Tesauro SIPA
preferred label: Coal bin (Compartments and generic storage spaces) @en
preferred label: Armoire à charbon (Compartiments et espaces de stockage génériques) @fr
preferred label: Deposito carbone (Compartimenti e spazi di stoccaggio generici) @it
broader: Compartimentos e espaços genéricos de armazenamento (Compartimento e espaços genéricos)

Casa dos arreios
type: Concept
scope note: Compartimento ou compartimentos onde se arrecadam os arreios destinados à atividade de equitação.
in scheme: Tesauro SIPA
preferred label: Harness house @en
preferred label: Maison des harnais @fr
preferred label: Casa delle briglie @it
broader: Compartimentos e espaços genéricos de armazenamento (Compartimento e espaços genéricos)

Copa
type: Concept
scope note: Dependência de uma casa, junto ao espaço de refeição, onde geralmente se dispõe o serviço da mesa.
in scheme: Tesauro SIPA
preferred label: Pantry @en
preferred label: Cellier @fr
preferred label: Ripostiglio (Dispensa) @it
broader: Compartimentos e espaços genéricos de armazenamento (Compartimento e espaços genéricos)

Depósito (Compartimentos e espaços genéricos de armazenamento)
type: Concept
scope note: Local onde se arrecadam produtos ou objetos.
in scheme: Tesauro SIPA
preferred label: Depot; storehouse (Compartments and generic storage spaces) @en
preferred label: Entrepôt (Compartiments et espaces de stockage génériques) @fr
preferred label: Magazzino (Compartimenti e spazi di stoccaggio generici) @it
broader: Compartimentos e espaços genéricos de armazenamento (Compartimento e espaços genéricos)
narrower: Casa da cera
narrower: Depósito de armas e munições
narrower: Depósito de bens de secretaria
narrower: Depósito de documentação (Depósito (Compartimentos e espaços genéricos de armazenamento))
narrower: Depósito de produtos alimentares
narrower: Depósito de produtos químicos e farmacêuticos
narrower: Depósito de valores mobiliários
narrower: Depósito de roupa

Casa da cera
type: Concept
in scheme: Tesauro SIPA
preferred label: Wax house @en
preferred label: Salle de cire @fr
preferred label: Camera della cera @it
broader: Depósito (Compartimentos e espaços genéricos de armazenamento)

Depósito de armas e munições
type: Concept
in scheme: Tesauro SIPA
preferred label: Arms and ammunition depot @en
preferred label: Dépôt d'armes et de munitions @fr
preferred label: Deposito di armamenti e munizioni @it
broader: Depósito (Compartimentos e espaços genéricos de armazenamento)
narrower: Armaria

Armaria
type: Concept
in scheme: Tesauro SIPA
preferred label: Armory @en
preferred label: Armurerie @fr
preferred label: Armeria @it
broader: Depósito de armas e munições

Depósito de bens de secretaria
type: Concept
in scheme: Tesauro SIPA
preferred label: Secretarial assets warehouse @en
preferred label: Dépôt d'articles de secrétariat @fr
preferred label: Deposito per beni di segreteria @it
broader: Depósito (Compartimentos e espaços genéricos de armazenamento)
narrower: Economato

Economato
type: Concept
in scheme: Tesauro SIPA
preferred label: Steward office @en
preferred label: Économat @fr
broader: Depósito de bens de secretaria

Depósito de documentação (Depósito (Compartimentos e espaços genéricos de armazenamento))
type: Concept
in scheme: Tesauro SIPA
preferred label: Documentation depot (Depot (Compartments and generic storage spaces)) @en
preferred label: Dépôt de documentation (Entrepôt (Compartiments et espaces de stockage génériques)) @fr
preferred label: Magazzino documentazione (Magazzino (Compartimenti e spazi di stoccaggio generici)) @it
broader: Depósito (Compartimentos e espaços genéricos de armazenamento)
narrower: Arquivo (Depósito de documentação)
narrower: Biblioteca (Depósito de documentação)
narrower: Depósito de arquivo
narrower: Depósito de biblioteca
narrower: Livraria (Depósito de documentação)

Arquivo (Depósito de documentação)
type: Concept
scope note: Espaço, compartimento ou conjunto de compartimentos onde se arrecada a documentação produzida pelo utente do edifício.
in scheme: Tesauro SIPA
preferred label: Archive (Documentation depot) @en
preferred label: Archives (Entrepôt) @fr
preferred label: Archivio (Magazzino documentazione) @it
broader: Depósito de documentação (Depósito (Compartimentos e espaços genéricos de armazenamento))

Biblioteca (Depósito de documentação)
type: Concept
scope note: Compartimento destinado a arrumar segundo regras definidas os livros de uma entidade, pública ou privada. Pode constituir o local onde estes são consultados.
in scheme: Tesauro SIPA
preferred label: Library (Documentation depot) @en
preferred label: Bibliothèque (Entrepôt) @fr
preferred label: Biblioteca (Magazzino documentazione) @it
broader: Depósito de documentação (Depósito (Compartimentos e espaços genéricos de armazenamento))

Depósito de arquivo
type: Concept
in scheme: Tesauro SIPA
preferred label: Archive storage @en
preferred label: Dépôt d'archives @fr
preferred label: Deposito d'archivio @it
broader: Depósito de documentação (Depósito (Compartimentos e espaços genéricos de armazenamento))

Depósito de biblioteca
type: Concept
in scheme: Tesauro SIPA
preferred label: Library deposit @en
preferred label: Dépôt de la bibliothèque @fr
preferred label: Deposito biblioteca @it
broader: Depósito de documentação (Depósito (Compartimentos e espaços genéricos de armazenamento))

Livraria (Depósito de documentação)
type: Concept
scope note: Espaço de dimensões variáveis, normalmente bastante iluminado, composto por estantes de madeira, decoradas ou não, dispostas ao longo das paredes, no interior de um convento ou mosteiro, onde se arrecadavam os livros pertencentes à comunidade. As livrarias estiveram sempre presentes nas construções cenobíticas, inicialmente denominadas como armarium, designando o móvel onde se reuniam os livros relacionados com aspetos religiosos (vidas de santos, parenética, tratados, crónicas) ou, por vezes, profanos. Situavam-se no segundo piso dos edifícios monásticos, com acesso pelo claustro, podendo possuir, no interior, um pequeno altar ou oratório. O mobiliário era composto, para além das estantes, que variavam segundo o número de livros que a comunidade possuía, numeradas, por mesas e cadeiras. A porta da livraria encontrava-se sempre encerrada, para preservar o tesouro que encerrava no seu interior, sendo zelada por um dos monges mais importantes da comunidade, desencorajando-se a saída dos livros para outras zonas do edifício, exceto para o templo. Quando as celas dos monges possuíam armários para livros, estas recebiam, igualmente, a denominação de "livrarias".
in scheme: Tesauro SIPA
preferred label: Library (Documentation deposit) @en
preferred label: Librairie (Dépôt de documentation) @fr
preferred label: Libreria (Deposito di documentazione) @it
broader: Depósito de documentação (Depósito (Compartimentos e espaços genéricos de armazenamento))

Depósito de produtos alimentares
type: Concept
in scheme: Tesauro SIPA
preferred label: Deposit of food products @en
preferred label: Entrepôt de produits alimentaires @fr
preferred label: Magazzino di prodotti alimentari @it
broader: Depósito (Compartimentos e espaços genéricos de armazenamento)
narrower: Adega (Depósito de produtos alimentares)
narrower: Câmara de congelação
narrower: Celeiro (Depósito de produtos alimentares)
narrower: Despensa
narrower: Garrafeira
narrower: Tulha (Depósito de produtos alimentares)

Adega (Depósito de produtos alimentares)
type: Concept
scope note: Local fresco e húmido onde se guardam os vinhos e outras bebidas alcoólicas.
in scheme: Tesauro SIPA
preferred label: Wine cellar (Deposit of food products) @en
preferred label: Cave a vin (Celier) (Entrepôt de produits alimentaires) @fr
preferred label: Bottega (Cantina) (Magazzino di prodotti alimentari) @it
broader: Depósito de produtos alimentares

Câmara de congelação
type: Concept
in scheme: Tesauro SIPA
preferred label: Freezing chamber @en
preferred label: Chambre de congélation @fr
preferred label: Camera di congelamento @it
broader: Depósito de produtos alimentares

Celeiro (Depósito de produtos alimentares)
type: Concept
in scheme: Tesauro SIPA
preferred label: Granary (Deposit of food products) @en
preferred label: Grange (dépôt de produits alimentaires) @fr
preferred label: Fienile (conservazione degli alimenti) @it
broader: Depósito de produtos alimentares

Despensa
type: Concept
in scheme: Tesauro SIPA
preferred label: Pantry @en
preferred label: Garde-manger @fr
preferred label: Dispensa @it
broader: Depósito de produtos alimentares

Garrafeira
type: Concept
scope note: Espaço existente em algumas casas ou quintas, especialmente as de produção vitivinícola, onde se guardam os vinhos engarrafados destinados ao consumo corrente, ou os mais finos, destinados a ocasiões especiais.
in scheme: Tesauro SIPA
preferred label: Wine cellar @en
preferred label: Cave (Bouteiller) @fr
preferred label: Cantina (Bottiglieria) @it
broader: Depósito de produtos alimentares
narrower: Frasqueira

Frasqueira
type: Concept
scope note: Regionalismo que designa a garrafeira na Região Demarcada do Douro, localizada na zona baixa da casa, normalmente interligada à mesma, preferencialmente voltada a norte, devido à necessidade de temperatura e humidade constante. É um espaço simples, sem grande cuidado arquitetónico ou decoração, com as paredes interiores forradas por suportes para as garrafas, que podem ser estantes de madeira ou outro material, cubículos individuais de tijolo ou cimento. Destaca-se a frasqueira da Quinta de Santa Júlia do Loureiro, em que as paredes são forradas a lousa.
in scheme: Tesauro SIPA
preferred label: Bottle-case @en
preferred label: Bouteiller @fr
preferred label: Bottiglieria @it
broader: Garrafeira

Tulha (Depósito de produtos alimentares)
type: Concept
in scheme: Tesauro SIPA
preferred label: Corn loft (Deposit of food products) @en
preferred label: Grenier (Dépôt de produits alimentaires) @fr
preferred label: Granaio (Magazzino alimentare) @it
broader: Depósito de produtos alimentares

Depósito de produtos químicos e farmacêuticos
type: Concept
in scheme: Tesauro SIPA
preferred label: Chemical and pharmaceutical products warehouse @en
preferred label: Entrepôt de produits chimiques et pharmaceutiques @fr
preferred label: Magazzino prodotti chimici e farmaceutici @it
broader: Depósito (Compartimentos e espaços genéricos de armazenamento)
narrower: Botica (Depósito de produtos químicos e farmacêuticos)
narrower: Farmácia (Depósito de produtos químicos e farmacêuticos)

Botica (Depósito de produtos químicos e farmacêuticos)
type: Concept
scope note: Espaço bastante simples, de dimensões variáveis, onde se preparavam e arrecadavam os medicamentos a ministrar aos frades enfermos, dentro de um edifício religioso. Integrava um núcleo de maiores dimensões, composto pela enfermaria, situado, normalmente, na sua zona mais recôndita. Dentro de um mosteiro, surgia ao nível do segundo piso, com acesso pelo claustro, podendo, na época medieval, surgir no piso inferior. Em alguns casos, a enfermaria não se encontrava no espaço conventual, mas em edifício independente, articulado com o principal.
in scheme: Tesauro SIPA
preferred label: Dispensary (Chemical and pharmaceutical products warehouse) @en
preferred label: Boutique (Entrepôt de produits chimiques et pharmaceutiques) @fr
preferred label: Bottega (Magazzino di prodotti chimici e farmaceutici) @it
broader: Depósito de produtos químicos e farmacêuticos

Farmácia (Depósito de produtos químicos e farmacêuticos)
type: Concept
in scheme: Tesauro SIPA
preferred label: Pharmacy (Chemical and pharmaceutical products warehouse) @en
preferred label: Pharmacie (Entrepôt de produits chimiques et pharmaceutiques) @fr
preferred label: Farmacia (Magazzino di prodotti chimici e farmaceutici) @it
broader: Depósito de produtos químicos e farmacêuticos

Depósito de valores mobiliários
type: Concept
in scheme: Tesauro SIPA
preferred label: Security deposit @en
preferred label: Dépositaire de titres @fr
preferred label: Deposito titoli @it
broader: Depósito (Compartimentos e espaços genéricos de armazenamento)
narrower: Casa-forte
narrower: Sala do tesouro

Casa-forte
type: Concept
in scheme: Tesauro SIPA
preferred label: Vault @en
preferred label: Chambre forte @fr
preferred label: Cassaforte @it
broader: Depósito de valores mobiliários

Sala do tesouro
type: Concept
scope note: Espaço num edifício religioso, normalmente numa catedral, santuário ou mosteiro, onde se arrecadam os objetos mais valiosos ou históricos, por vezes transformado em núcleos museológicos. O conceito dos conteúdos de uma Sala do Tesouro diferia consoante a comunidade que ocupava um edifício. Enquanto o tesouro de uma catedral são as alfaias litúrgicas, livros, paramentaria, imaginária e pintura, para uma comunidade religiosa o tesouro pode ser constituído pelo número de relíquias possuídas e autenticadas, como era o caso do Mosteiro da Madre de Deus.
in scheme: Tesauro SIPA
preferred label: Treasure room @en
preferred label: Chambre du trésor @fr
preferred label: Camera del tesoro @it
alternative label: Casa do tesouro
broader: Depósito de valores mobiliários

Depósito de roupa
type: Concept
in scheme: Tesauro SIPA
preferred label: Wardrobe @en
preferred label: Entrepôt de vêtements @fr
preferred label: Deposito abiti @it
broader: Depósito (Compartimentos e espaços genéricos de armazenamento)
narrower: Rouparia

Rouparia
type: Concept
scope note: Compartimento ou conjunto de compartimentos destinados ao tratamento e armazenamento de vestuário e roupa de casa de um contingente alargado de indivíduos, por regra adjacente e diretamente comunicante com a lavandaria. Em estabelecimentos prisionais, por exemplo, é o compartimento existente em cada piso de uma ala prisional, destinado ao armazenamento de roupa limpa.
in scheme: Tesauro SIPA
preferred label: Wardrobe @en
preferred label: Laverie @fr
preferred label: Lavanderia @it
broader: Depósito de roupa

Recolha de veículos
type: Concept
in scheme: Tesauro SIPA
preferred label: Vehicle depot @en
preferred label: Stockage de véhicules @fr
preferred label: Deposito veicoli @it
broader: Compartimentos e espaços genéricos de armazenamento (Compartimento e espaços genéricos)
narrower: Cocheira (Recolha de veículos)
narrower: Garagem (Recolha de veículos)

Cocheira (Recolha de veículos)
type: Concept
in scheme: Tesauro SIPA
preferred label: Coach house (Vehicle depot) @en
preferred label: Écurie (Stockage de véhicules) @fr
preferred label: Scuderie (deposito veicoli) @it
broader: Recolha de veículos

Garagem (Recolha de veículos)
type: Concept
in scheme: Tesauro SIPA
preferred label: Garage @en
broader: Recolha de veículos

Compartimentos e espaços genéricos de assistência
type: Concept
in scheme: Tesauro SIPA
preferred label: Compartments and care spaces (Compartments and generic spaces) @en
preferred label: Enceintes et espaces de service (Enceintes et espaces génériques) @fr
preferred label: Compartimenti e spazi di assistenza (Compartimenti e spazi generici) @it
broader: Compartimentos e espaços genéricos segundo a função
narrower: Balcão (Compartimentos e espaços genéricos de assistência)
narrower: Bancada (Compartimentos e espaços genéricos de assistência)
narrower: Camarote
narrower: Cávea
narrower: Frisa
narrower: Geral (Compartimentos e espaços genéricos de assistência)
narrower: Orchestra
narrower: Peão
narrower: Plateia
narrower: Tribuna (Compartimentos e espaços genéricos de assistência)

Balcão (Compartimentos e espaços genéricos de assistência)
type: Concept
scope note: Espaço com lugares sentados para assistência, situado sobre a plateia, podendo ser duplo.
in scheme: Tesauro SIPA
preferred label: Counter (Compartments and generic service spaces) @en
preferred label: Comptoir (Enceintes et espaces de service génériques) @fr
preferred label: Sportello (Compartimenti e spazi di assistenza generici) @it
broader: Compartimentos e espaços genéricos de assistência

Bancada (Compartimentos e espaços genéricos de assistência)
type: Concept
scope note: Espaço de assistência num estádio desportivo ou numa praça de touros, destinado, respetivamente, aos adeptos ou aos aficionados.
in scheme: Tesauro SIPA
preferred label: Sportello (Compartimenti e spazi di assistenza generici) @it
preferred label: Bench (Compartments and generic service spaces) @en
preferred label: Comptoir (Enceintes génériques et espaces d'assistance) @fr
broader: Compartimentos e espaços genéricos de assistência
narrower: Barreira
narrower: Contrabarreira
narrower: Galeria (Bancada)

Barreira
type: Concept
in scheme: Tesauro SIPA
preferred label: Barrier @en
preferred label: Barrière @fr
preferred label: Barriera @it
broader: Bancada (Compartimentos e espaços genéricos de assistência)

Contrabarreira
type: Concept
in scheme: Tesauro SIPA
preferred label: Counterbarrier @en
preferred label: Contre-barrière @fr
preferred label: Controbarriera @it
broader: Bancada (Compartimentos e espaços genéricos de assistência)

Galeria (Bancada)
type: Concept
scope note: Zona de assistência, com lugares de pé, no topo dos edifícios desportivos ou de espetáculo.
in scheme: Tesauro SIPA
preferred label: Gallery (Grandstand) @en
preferred label: Galerie (Comptoir) @fr
preferred label: Galleria (Sportello) @it
alternative label: Galinheiro (Bancada)
alternative label: Torrinha
alternative label: Varanda (Bancada)
broader: Bancada (Compartimentos e espaços genéricos de assistência)
narrower: Galeria de acesso às bancadas
narrower: Galeria inferior
narrower: Galeria superior

Galeria de acesso às bancadas
type: Concept
in scheme: Tesauro SIPA
preferred label: Access gallery @en
preferred label: Galerie d'accès @fr
preferred label: Galleria di accesso @it
broader: Galeria (Bancada)

Galeria inferior
type: Concept
in scheme: Tesauro SIPA
preferred label: Bottom gallery @en
preferred label: Galerie inférieure @fr
preferred label: Galleria inferiore @it
broader: Galeria (Bancada)

Galeria superior
type: Concept
in scheme: Tesauro SIPA
preferred label: Upper gallery @en
preferred label: Galerie supérieure @fr
preferred label: Galleria superiore @it
broader: Galeria (Bancada)
narrower: Galeria sol e sombra
narrower: Galeria sombra
narrower: Palanque

Galeria sol e sombra
type: Concept
in scheme: Tesauro SIPA
preferred label: Sun and shade gallery @en
preferred label: Galerie soleil et ombre @fr
preferred label: Galleria sole e ombra @it
broader: Galeria superior

Galeria sombra
type: Concept
in scheme: Tesauro SIPA
preferred label: Shade gallery @en
preferred label: Galerie d'ombrage @fr
preferred label: Galleria dell'ombra @it
broader: Galeria superior

Palanque
type: Concept
in scheme: Tesauro SIPA
preferred label: Hoarding @en
preferred label: Gradin @fr
preferred label: Impalcatura (Steccato) @it
broader: Galeria superior

Camarote
type: Concept
in scheme: Tesauro SIPA
preferred label: Box @en
preferred label: Loge @fr
preferred label: Palco @it
broader: Compartimentos e espaços genéricos de assistência
narrower: Camarote de boca
narrower: Camarote presidencial
narrower: Camarote real

Camarote de boca
type: Concept
in scheme: Tesauro SIPA
preferred label: Front box @en
preferred label: Loge d'avant-scène @fr
preferred label: Barcaccia @it
broader: Camarote

Camarote presidencial
type: Concept
in scheme: Tesauro SIPA
preferred label: Presidential box @en
preferred label: Loge presindentiel @fr
preferred label: Palco presidenziale @it
broader: Camarote

Camarote real
type: Concept
in scheme: Tesauro SIPA
preferred label: Royal box @en
preferred label: Loge royale @fr
broader: Camarote

Cávea
type: Concept
scope note: Arquibancada do teatro, anfiteatro ou circo romano.
in scheme: Tesauro SIPA
preferred label: Cage @en
preferred label: Cavea @fr
broader: Compartimentos e espaços genéricos de assistência

Frisa
type: Concept
scope note: Nível inferior dos camarotes, quase ao nível da plateia.
in scheme: Tesauro SIPA
preferred label: Frise @fr
preferred label: Box @en
preferred label: Celetto (Palco di platea) @it
broader: Compartimentos e espaços genéricos de assistência
narrower: Frisa de boca

Frisa de boca
type: Concept
in scheme: Tesauro SIPA
preferred label: Frontal box @en
broader: Frisa

Geral (Compartimentos e espaços genéricos de assistência)
type: Concept
in scheme: Tesauro SIPA
preferred label: General (Compartments and generic service spaces) @en
preferred label: Général (Enceintes génériques et espaces d'assistance) @fr
preferred label: Generale (Compartimenti e spazi di assistenza generici) @it
broader: Compartimentos e espaços genéricos de assistência

Orchestra
type: Concept
in scheme: Tesauro SIPA
preferred label: Orchestre @fr
broader: Compartimentos e espaços genéricos de assistência

Peão
type: Concept
in scheme: Tesauro SIPA
preferred label: Pawn @en
preferred label: Piéton @fr
preferred label: Pedone @it
broader: Compartimentos e espaços genéricos de assistência

Plateia
type: Concept
in scheme: Tesauro SIPA
preferred label: Main level (Stalls) @en
preferred label: Parterre @fr
preferred label: Platea @it
broader: Compartimentos e espaços genéricos de assistência

Tribuna (Compartimentos e espaços genéricos de assistência)
type: Concept
scope note: Espaço onde se assiste a um espetáculo a uma cerimónia litúrgica. Neste último caso, trata-se de um espaço alto e largo que se desenvolve sobre as naves laterais de um templo cristão, que se abre para a nave central através de arcadas, permitindo a assistência aos atos litúrgicos. Durante a Idade Média, estes espaços eram destinados às mulheres. Nos edifícios da Companhia de Jesus, eram imprescindíveis, sendo o local onde os alunos assistiam aos atos litúrgicos, surgindo, neste caso, desenvolvida sobre as capelas laterais. Pode constituir um pequeno espaço, situado na nave ou na capela-mor, elevado ou não, onde uma Confraria ou uma Irmandade assistia aos cerimoniais, denominado tribuna dos Mesários.
in scheme: Tesauro SIPA
preferred label: Tribune (Balcony) (Compartments and generic service spaces) @en
preferred label: Tribune (Enceintes génériques et espaces d'assistance) @fr
preferred label: Tribuna (Compartimenti e spazi di assistenza generici) @it
alternative label: Galeria (Compartimentos e espaços específicos de culto e devoção)
alternative label: Matroneu
broader: Compartimentos e espaços genéricos de assistência
narrower: Tribuna de honra
narrower: Tribuna presidencial
narrower: Tribuna real

Tribuna de honra
type: Concept
in scheme: Tesauro SIPA
preferred label: Honourary tribune @en
preferred label: Tribune d'honneur @fr
preferred label: Tribuna presidenziale @it
broader: Tribuna (Compartimentos e espaços genéricos de assistência)

Tribuna presidencial
type: Concept
in scheme: Tesauro SIPA
preferred label: Tribuna presidenziale @it
preferred label: Presidential balcony @en
preferred label: Tribune présidentielle @fr
broader: Tribuna (Compartimentos e espaços genéricos de assistência)

Tribuna real
type: Concept
in scheme: Tesauro SIPA
preferred label: Royal balcony @en
preferred label: Tribune royale @fr
preferred label: Tribuna reale @it
broader: Tribuna (Compartimentos e espaços genéricos de assistência)

Compartimentos e espaços genéricos de atendimento e receção
type: Concept
in scheme: Tesauro SIPA
preferred label: Compartments and reception spaces (Compartments and generic spaces) @en
preferred label: Compartiments et espaces d'accueil (Compartiments et espaces génériques) @fr
preferred label: Compartimenti e spazi di accoglienza (Compartimenti e spazi generici) @it
hidden label: Compartimentos e espaços genéricos de atendimento e recepção
broader: Compartimentos e espaços genéricos segundo a função
narrower: Anteportaria
narrower: Gabinete do utente
narrower: Portaria
narrower: Posto de informações
narrower: Receção
narrower: Sala de atendimento ao público
narrower: Sala de espera
narrower: Sala VIP

Anteportaria
type: Concept
scope note: Compartimento ou simples espaço alpendrado que antecede a portaria de uma casa monástico-conventual.
in scheme: Tesauro SIPA
preferred label: Porch @en
preferred label: Porche @fr
preferred label: Portico (Porticato) @it
broader: Compartimentos e espaços genéricos de atendimento e receção

Gabinete do utente
type: Concept
in scheme: Tesauro SIPA
preferred label: Consulting room @en
preferred label: Bureau de l'utilisateur @fr
preferred label: Ufficio utenti @it
broader: Compartimentos e espaços genéricos de atendimento e receção

Portaria
type: Concept
in scheme: Tesauro SIPA
preferred label: Atrio @it
preferred label: Front door (Reception desk) @en
preferred label: Conciergerie @fr
broader: Compartimentos e espaços genéricos de atendimento e receção

Posto de informações
type: Concept
in scheme: Tesauro SIPA
preferred label: Information desk @en
preferred label: Bureau d'information @fr
preferred label: Banco informazioni @it
broader: Compartimentos e espaços genéricos de atendimento e receção

Receção
type: Concept
in scheme: Tesauro SIPA
preferred label: Reception @en
preferred label: Réception @fr
preferred label: Ricezione @it
hidden label: Recepção
broader: Compartimentos e espaços genéricos de atendimento e receção

Sala de atendimento ao público
type: Concept
in scheme: Tesauro SIPA
preferred label: Waiting room @en
preferred label: Salle de service à la clientèle @fr
preferred label: Sala di accoglienza pubblica @it
broader: Compartimentos e espaços genéricos de atendimento e receção

Sala de espera
type: Concept
in scheme: Tesauro SIPA
preferred label: Waiting room @en
preferred label: Salle d'attente @fr
preferred label: Sala d'attesa @it
broader: Compartimentos e espaços genéricos de atendimento e receção

Sala VIP
type: Concept
in scheme: Tesauro SIPA
preferred label: VIP room @en
preferred label: Salle VIP @fr
broader: Compartimentos e espaços genéricos de atendimento e receção

Compartimentos e espaços genéricos de atuação
type: Concept
in scheme: Tesauro SIPA
preferred label: Compartments and performance spaces (Generic compartments and spaces) @en
preferred label: Compartiments et espaces de performance (compartiments et espaces génériques) @fr
preferred label: Compartimenti e spazi per le prestazioni (Compartimenti e spazi generici) @it
alternative label: Espaços cénicos
hidden label: Compartimentos e espaços genéricos de actuação
broader: Compartimentos e espaços genéricos segundo a função
narrower: Arena
narrower: Avant-scène
narrower: Caixa de palco
narrower: Fosso de orquestra
narrower: Palco

Arena
type: Concept
scope note: Espaço descoberto, pavimentado com areia, de planta circular ou oval, rodeado por bancadas, onde decorrem jogos público ou atividades artísticas.
in scheme: Tesauro SIPA
preferred label: Arène @fr
broader: Compartimentos e espaços genéricos de atuação

Avant-scène
type: Concept
scope note: Espaço mais avançado do palco, normalmente aproveitando a parte aberta do fosso da orquestra, com a colocação das plataformas de fosso.
in scheme: Tesauro SIPA
alternative label: Palco avançado
broader: Compartimentos e espaços genéricos de atuação

Caixa de palco
type: Concept
in scheme: Tesauro SIPA
preferred label: Stage box @en
preferred label: Boîtes de scène @fr
preferred label: Palcoscenico @it
broader: Compartimentos e espaços genéricos de atuação
narrower: Subpalco
narrower: Coxia de palco
narrower: Urdimento

Subpalco
type: Concept
scope note: Espaço por baixo do palco, para poder fazer surgir em cena elementos cénicos ou artistas, quando o pavimento do palco é dotado de alçapão de palco.
in scheme: Tesauro SIPA
preferred label: Substage @en
preferred label: Sous-palier @fr
preferred label: Sottopalco @it
alternative label: Subterrâneo
alternative label: Porão
broader: Caixa de palco
narrower: Alçapão (Caixa de palco)

Alçapão (Caixa de palco)
type: Concept
scope note: Espaço onde se encontra o vão rasgado num palco teatral, para fazer passar facilmente o equipamento que se encontra arrecado sob este ou para manobras cénicas, permitindo a materialização de cenários, adereços ou artistas.
in scheme: Tesauro SIPA
preferred label: Trapdoor (Stage house) @en
preferred label: Trappe (Cage de scène) @fr
preferred label: Trapolla scenica (Torre scenica) @it
broader: Subpalco

Coxia de palco
type: Concept
scope note: Espaço do palco à volta da área de cena, onde se procedem a manobras técnicas e onde circulam os artistas envolvidos no espetáculo.
in scheme: Tesauro SIPA
preferred label: Backstage (Green room) @en
preferred label: Allée de la scène @fr
preferred label: Corridoio del palcoscenico @it
alternative label: Asa
broader: Caixa de palco

Urdimento
type: Concept
in scheme: Tesauro SIPA
preferred label: Attrezzatura @it
preferred label: Warping @en
preferred label: Gréage @fr
broader: Caixa de palco
narrower: Varanda (Urdimento)
narrower: Teia (Urdimento)

Varanda (Urdimento)
type: Concept
in scheme: Tesauro SIPA
preferred label: Balcony (Warping) @en
preferred label: Balcon (Gréage) @fr
preferred label: Balcone (Attrezzatura) @it
broader: Urdimento

Teia (Urdimento)
type: Concept
in scheme: Tesauro SIPA
preferred label: Fly system (Rigging system) @en
preferred label: Toile (Gréage) @fr
preferred label: Rete (Attrezzatura) @it
broader: Urdimento

Fosso de orquestra
type: Concept
scope note: Espaço entre a plateia e o palco onde se instala a orquestra para espetáculos de ópera ou outros que tenham o apoio de música ao vivo.
in scheme: Tesauro SIPA
preferred label: Orchestra pit @en
preferred label: Fosse d'orchestre @fr
preferred label: Fossa orchestrale @it
broader: Compartimentos e espaços genéricos de atuação

Palco
type: Concept
in scheme: Tesauro SIPA
preferred label: Palcoscenico @it
preferred label: Stage @en
preferred label: Scène @fr
alternative label: Cena
broader: Compartimentos e espaços genéricos de atuação
narrower: Componentes do palco
narrower: Palco segundo a relação com o público

Componentes do palco
type: Concept
in scheme: Tesauro SIPA
preferred label: Stage components @en
preferred label: Composants de la scène @fr
preferred label: Componenti del palco @it
broader: Palco
narrower: Área de cena
narrower: Proscénio

Área de cena
type: Concept
in scheme: Tesauro SIPA
preferred label: Staging area @en
preferred label: Espace scénique @fr
preferred label: Area del palcoscenico @it
broader: Componentes do palco

Proscénio
type: Concept
scope note: Espaço existente entre o avant scène e a boca de cena, permitindo ampliar o espaço de atuação.
in scheme: Tesauro SIPA
preferred label: Proscenium @en
preferred label: Proscenio @it
broader: Componentes do palco

Palco segundo a relação com o público
type: Concept
in scheme: Tesauro SIPA
preferred label: Stage according to relation with the public @en
preferred label: La scène par rapport au public @fr
preferred label: Palco in relazione al pubblico @it
broader: Palco
narrower: Cena configurável
narrower: Cena contraposta

Cena configurável
type: Concept
in scheme: Tesauro SIPA
preferred label: Configurable stage @en
preferred label: Scène configurable @fr
preferred label: Palco configurabile @it
broader: Palco segundo a relação com o público

Cena contraposta
type: Concept
in scheme: Tesauro SIPA
preferred label: Counterpoint scene @en
preferred label: Arrière-scène @fr
preferred label: Retroscena @it
broader: Palco segundo a relação com o público

Compartimentos e espaços genéricos de banho, de vestir e sanitários
type: Concept
in scheme: Tesauro SIPA
preferred label: Compartments and bathroom, dressing and toilet spaces (Compartments and general spaces) @en
preferred label: Compartiments et espaces de bain, d'habillage et sanitaires (compartiments et espaces génériques) @fr
preferred label: Compartimenti e spazi per bagni, spogliatoi e servizi igienici (Compartimenti e spazi generici) @it
broader: Compartimentos e espaços genéricos segundo a função
narrower: Balneário (Compartimentos e espaços genéricos de banho, de vestir e sanitários)
narrower: Barbearia (Compartimentos e espaços genéricos de banho, de vestir e sanitários)
narrower: Camarim
narrower: Instalações sanitárias (Compartimentos e espaços genéricos de banho, de vestir e sanitários)
narrower: Quarto de vestir
narrower: Vestiário

Balneário (Compartimentos e espaços genéricos de banho, de vestir e sanitários)
type: Concept
in scheme: Tesauro SIPA
preferred label: Bathhouse (Compartments and general spaces for bathing, dressing and toilets) @en
preferred label: Vestiaires (compartiments et espaces génériques pour le bain, l'habillage et les sanitaires) @fr
preferred label: Spogliatoio (Vani bagno, spogliatoi e servizi igienici e spazi generali) @it
broader: Compartimentos e espaços genéricos de banho, de vestir e sanitários

Barbearia (Compartimentos e espaços genéricos de banho, de vestir e sanitários)
type: Concept
in scheme: Tesauro SIPA
preferred label: Barbershop (Compartments and general spaces for bathing, dressing and toilets) @en
preferred label: Salon de coiffure (compartiments et espaces généraux pour le bain, l'habillage et les toilettes) @fr
preferred label: Barbieria (Vani bagno, spogliatoi e servizi igienici e spazi generali) @it
broader: Compartimentos e espaços genéricos de banho, de vestir e sanitários

Camarim
type: Concept
scope note: Câmara onde se vestem os atores antes de entrarem em palco ou filmarem uma cena.
in scheme: Tesauro SIPA
preferred label: Dressing room @en
preferred label: Salle d'habillage (Chambrettte) @fr
preferred label: Camerino @it
broader: Compartimentos e espaços genéricos de banho, de vestir e sanitários

Instalações sanitárias (Compartimentos e espaços genéricos de banho, de vestir e sanitários)
type: Concept
in scheme: Tesauro SIPA
preferred label: Sanitary facilitiers (Compartments and general spaces for bathing, dressing and toilets) @en
preferred label: Installations sanitaires (cabines de bain, cabines d'habillage, cabines sanitaires et espaces généraux) @fr
preferred label: Impianti sanitari (vani per il bagno, la vestizione e i servizi igienici e spazi generali) @it
alternative label: Casinha
alternative label: Necessárias
alternative label: Privada
alternative label: Quarto de banho
alternative label: Sala de banho
alternative label: Toilete
broader: Compartimentos e espaços genéricos de banho, de vestir e sanitários
narrower: Latrina (Compartimentos e espaços genéricos de banho, de vestir e sanitários)

Latrina (Compartimentos e espaços genéricos de banho, de vestir e sanitários)
type: Concept
scope note: Edifício ou espaço coberto, de uso privado ou comunitário, destinado a satisfazer as necessidades fisiológicas. Nas fortificações, as latrinas foram inicialmente construídas em madeira, destacadas das cortinas e avançado sobre o fosso ou o mar, no trânsito ou nas casamatas, nesses dois últimos casos, localizando-se o mais próximo possível da escarpa, por causa dos esgotos, que eram conduzidos para o fosso. Posteriormente, algumas latrinas foram construídas em materiais duráveis e com maior conforto. As latrinas começam a ser representadas na cartografia das fortificações portuguesas a partir do final do século XVIII
in scheme: Tesauro SIPA
preferred label: Latrine (Compartments and general spaces for bathing, dressing and toilets) @en
preferred label: Latrines (compartiments et espaces génériques pour le bain, l'habillage et les sanitaires) @fr
preferred label: Latrina (vani e spazi generici per il bagno, la vestizione e i servizi igienici) @it
alternative label: Secreta
broader: Instalações sanitárias (Compartimentos e espaços genéricos de banho, de vestir e sanitários)

Quarto de vestir
type: Concept
in scheme: Tesauro SIPA
preferred label: Dressing room (Walking closet) @en
preferred label: Salle d'habillage @fr
preferred label: Spogliatoio @it
broader: Compartimentos e espaços genéricos de banho, de vestir e sanitários

Vestiário
type: Concept
in scheme: Tesauro SIPA
preferred label: Changing room (Locker room) @en
preferred label: Vestiaire @fr
preferred label: Guardaroba @it
broader: Compartimentos e espaços genéricos de banho, de vestir e sanitários

Compartimento e espaços genéricos de comunicação e de difusão de dados e registos (Compartimentos e espaços culturais e recreativos)
type: Concept
in scheme: Tesauro SIPA
preferred label: Communication and data dissemination compartments and spaces (Cultural and recreational compartments and spaces) @en
preferred label: Compartiments et espaces de communication et de diffusion de données (Compartiments et espaces culturels et récréatifs) @fr
preferred label: Compartimenti e spazi per la comunicazione e la diffusione dei dati (Comparti e spazi culturali e ricreativi) @it
broader: Compartimentos e espaços genéricos segundo a função
narrower: Cabina de projeção
narrower: Cabina de rebobinagem

Cabina de projeção
type: Concept
scope note: Espaço destinado ao projetor de cinema ou video, colocada no balcão ou parede fundeira da plateia, confinando com o auditório através de várias janelas por onde se faz a projeção.
in scheme: Tesauro SIPA
preferred label: Projection booth @en
preferred label: Cabine de projection @fr
preferred label: Cabine di proiezione @it
hidden label: Cabina de projecção
broader: Compartimento e espaços genéricos de comunicação e de difusão de dados e registos (Compartimentos e espaços culturais e recreativos)

Cabina de rebobinagem
type: Concept
in scheme: Tesauro SIPA
preferred label: Rewind booth @en
preferred label: Cabine de rembobinage @fr
preferred label: Cabina di riavvolgimento @it
broader: Compartimento e espaços genéricos de comunicação e de difusão de dados e registos (Compartimentos e espaços culturais e recreativos)

Compartimentos e espaços genéricos de criação e exploração animal e vegetal
type: Concept
in scheme: Tesauro SIPA
preferred label: Compartments and spaces for animal and plant breeding and farming (Compartments and generic spaces) @en
preferred label: Compartiments et espaces pour l'élevage et la culture d'animaux et de plantes (compartiments et espaces génériques) @fr
preferred label: Compartimenti e spazi per l'allevamento e la coltivazione di animali e piante (Comparti e spazi generici) @it
broader: Compartimentos e espaços genéricos segundo a função
narrower: Cavalariça (Compartimentos e espaços genéricos de criação e exploração animal e vegetal)
narrower: Curro
narrower: Touril (Compartimentos e espaços genéricos de acesso, circulação, distribuição e transição)

Cavalariça (Compartimentos e espaços genéricos de criação e exploração animal e vegetal)
type: Concept
in scheme: Tesauro SIPA
preferred label: Horse stable (Compartments and spaces for animal and plant breeding and farming ) @en
preferred label: Écurie (Compartiments et espaces pour l'élevage et la culture d'animaux et de plantes) @fr
preferred label: Stalla (Scuderia) (Compartimenti e spazi per l'allevamento e la coltivazione di animali e piante) @it
broader: Compartimentos e espaços genéricos de criação e exploração animal e vegetal

Curro
type: Concept
scope note: Compartimento onde se alojam os touros numa praça de touros.
in scheme: Tesauro SIPA
preferred label: Pen for bulls @en
broader: Compartimentos e espaços genéricos de criação e exploração animal e vegetal

Touril (Compartimentos e espaços genéricos de acesso, circulação, distribuição e transição)
type: Concept
in scheme: Tesauro SIPA
preferred label: Stall (Generic compartments and spaces for access, circulation, distribution and transition) @en
broader: Compartimentos e espaços genéricos de criação e exploração animal e vegetal

Compartimentos e espaços genéricos de detenção e punição
type: Concept
in scheme: Tesauro SIPA
preferred label: Compartments and spaces for detention and punishment (Compartments and generic spaces) @en
preferred label: Compartiments et espaces de détention et de punition (Compartiments et espaces génériques) @fr
preferred label: Compartimenti e spazi per la detenzione e la punizione (Compartimenti e spazi generici) @it
broader: Compartimentos e espaços genéricos segundo a função
narrower: Cárcere

Cárcere
type: Concept
in scheme: Tesauro SIPA
preferred label: Prison (Compartments and spaces for detention and punishment) @en
preferred label: Geôle (Compartiments et espaces de détention et de punition) @fr
preferred label: Carcere (Compartimenti e spazi per la detenzione e la punizione) @it
broader: Compartimentos e espaços genéricos de detenção e punição

Compartimentos e espaços genéricos de direção e de coordenação
type: Concept
in scheme: Tesauro SIPA
preferred label: Management and coordination compartments and spaces (Compartments and generic spaces) @en
preferred label: Compartiments et espaces de gestion et de coordination (compartiments et espaces génériques) @fr
preferred label: Comparti e spazi di gestione e coordinamento (Comparti e spazi generici) @it
hidden label: Compartimentos e espaços genéricos de direcção e de coordenação
broader: Compartimentos e espaços genéricos segundo a função
narrower: Gabinete de direção
narrower: Gabinete de coordenação
narrower: Gabinete do coordenador
narrower: Gabinete do diretor
narrower: Gabinete do governador
narrower: Gabinete do presidente
narrower: Gabinete do sub-diretor
narrower: Gabinete do vice-presidente
narrower: Gabinete do vogal

Gabinete de direção
type: Concept
in scheme: Tesauro SIPA
preferred label: Management office @en
preferred label: Bureau du directeur @fr
preferred label: Ufficio del direttore @it
hidden label: Gabinete de direcção
broader: Compartimentos e espaços genéricos de direção e de coordenação

Gabinete de coordenação
type: Concept
in scheme: Tesauro SIPA
preferred label: Coordination office @en
preferred label: Bureau de coordination @fr
preferred label: Ufficio di coordinamento @it
broader: Compartimentos e espaços genéricos de direção e de coordenação

Gabinete do coordenador
type: Concept
in scheme: Tesauro SIPA
preferred label: Coordinator’s office @en
preferred label: Bureau du coordinateur @fr
preferred label: Ufficio del coordinatore @it
broader: Compartimentos e espaços genéricos de direção e de coordenação

Gabinete do diretor
type: Concept
in scheme: Tesauro SIPA
preferred label: Bureau du directeur @fr
preferred label: Ufficio del direttore @it
preferred label: Principal’s office @en
hidden label: Gabinete do diretor
broader: Compartimentos e espaços genéricos de direção e de coordenação

Gabinete do governador
type: Concept
in scheme: Tesauro SIPA
preferred label: Governor’s office @en
preferred label: Bureau du gouverneur @fr
preferred label: Ufficio del governatore @it
broader: Compartimentos e espaços genéricos de direção e de coordenação

Gabinete do presidente
type: Concept
in scheme: Tesauro SIPA
preferred label: President’s office @en
preferred label: Bureau du président @fr
preferred label: Ufficio del presidente @it
broader: Compartimentos e espaços genéricos de direção e de coordenação

Gabinete do sub-diretor
type: Concept
in scheme: Tesauro SIPA
preferred label: Sub-director’s office @en
preferred label: Bureau du directeur adjoint @fr
preferred label: Ufficio del vicedirettore @it
hidden label: Gabinete do sub-director
broader: Compartimentos e espaços genéricos de direção e de coordenação

Gabinete do vice-presidente
type: Concept
in scheme: Tesauro SIPA
preferred label: Vice-president’s office @en
preferred label: Bureau du vice-président @fr
preferred label: Ufficio del vicepresidente @it
broader: Compartimentos e espaços genéricos de direção e de coordenação

Gabinete do vogal
type: Concept
in scheme: Tesauro SIPA
preferred label: Board member office @en
preferred label: Bureau du membre @fr
preferred label: Ufficio del membro @it
broader: Compartimentos e espaços genéricos de direção e de coordenação

Compartimentos e espaços genéricos de dormida e de repouso
type: Concept
in scheme: Tesauro SIPA
preferred label: Sleeping and rest compartments and spaces (Compartments and generic spaces) @en
preferred label: Compartiments et espaces de couchage et de sommeil (compartiments et espaces génériques) @fr
preferred label: Compartimenti e spazi per dormire e dormire (Compartimenti e spazi generici) @it
broader: Compartimentos e espaços genéricos segundo a função
narrower: Berçário (Compartimentos e espaços genéricos de dormida e de repouso)
narrower: Camarata (Compartimentos e espaços genéricos de dormida e de repouso)
narrower: Cela (Compartimentos e espaços genéricos de dormida e de repouso)
narrower: Dormitório
narrower: Hospedaria (Compartimentos e espaços genéricos de dormida e de repouso)
narrower: Quarto
narrower: Sala de repouso
narrower: Suite

Berçário (Compartimentos e espaços genéricos de dormida e de repouso)
type: Concept
scope note: Compartimento num edifício residencial ou num edifício educativo que serve de espaço de dormida aos bebés de tenra idade.
in scheme: Tesauro SIPA
preferred label: Nursery (Generic sleeping and rest compartments and spaces) @en
preferred label: Nourricerie; Pouponnière (Compartiments et espaces généraux de sommeil et de repos) @fr
preferred label: Vivaio; Asilo nido (Compartimenti e spazi generali per il sonno e il riposo) @it
broader: Compartimentos e espaços genéricos de dormida e de repouso

Camarata (Compartimentos e espaços genéricos de dormida e de repouso)
type: Concept
in scheme: Tesauro SIPA
preferred label: Dormitory (Generic sleeping and rest compartments and spaces) @en
preferred label: Cabine (Compartiments et espaces généraux de sommeil et de repos) @fr
preferred label: Dormitorio (Compartimenti e spazi generali per il sonno e il riposo) @it
broader: Compartimentos e espaços genéricos de dormida e de repouso

Cela (Compartimentos e espaços genéricos de dormida e de repouso)
type: Concept
scope note: Espaço de meditação e de dormida destinada a um religioso num mosteiro ou convento, situado na zona dos dormitórios, com acesso por largos corredores. Tem origem nas casas dos eremitas orientais, que se refugiavam no deserto, muito simples e de pequenas dimensões, tendo o essencial para satisfazer a vida ascética. O mobiliário deste espaço era variável consoante a ordem religiosa, tendo, normalmente, os muros nus, sem qualquer decoração, podendo ter uma ou três imagens; nalgumas, surge um oratório e uma cadeira, tendo um leito, sendo iluminadas por uma candeia. Eram iluminadas por uma janela, estando viradas para o exterior ou para o claustro.
in scheme: Tesauro SIPA
preferred label: Cell (Specific sleeping and resting compartments and spaces) @en
preferred label: Cellule (Compartiments et espaces spécifiques pour le sommeil et le repos) @fr
preferred label: Cella (Compartimenti e spazi specifici per il sonno e il riposo) @it
broader: Compartimentos e espaços genéricos de dormida e de repouso
narrower: Cubículo

Cubículo
type: Concept
scope note: Nome dado a uma cela numa casa de padres da Companhia de Jesus.
in scheme: Tesauro SIPA
preferred label: Cubicle @en
preferred label: Cubicule @fr
preferred label: Cubicolo @it
broader: Cela (Compartimentos e espaços genéricos de dormida e de repouso)

Dormitório
type: Concept
scope note: Espaço de alojamento noturno destinado a um contingente alargado de indivíduos, dotado de mobiliário de repouso (camas) simples ou duplo (beliche) cuja repetição determina a capacidade total do dormitório. O universo de utilização do compartimento dormitório é muito amplo: os programas educativos e assistenciais, hospitalares, religiosos e prisionais, entre outros que exijam o alojamento de grande número de indivíduos, empregaram ao longo do tempo o termo dormitório para designar um conjunto de realidades por vezes distintas, dotadas de configurações e condições físicas muito variáveis.
in scheme: Tesauro SIPA
preferred label: Dormitory (Bedroom) @en
preferred label: Dortoir @fr
preferred label: Dormitorio @it
broader: Compartimentos e espaços genéricos de dormida e de repouso

Hospedaria (Compartimentos e espaços genéricos de dormida e de repouso)
type: Concept
scope note: Espaço mais ou menos amplo, consoante a dimensão do cenóbio, destinado a albergar monges ou frades de outras congregações ou de outras ordens religiosas. Situado no primeiro ou segundo piso do claustro, nas imediações da portaria, podia ser amplo ou dividido em pequenas celas individuais. No caso de uma Casa Capitular, esta este espaço tinha que ser de maiores dimensões, permitindo albergar todos os religiosos que se deslocavam para as reuniões periódicas.
in scheme: Tesauro SIPA
preferred label: Guesthouse (Specific sleeping and resting compartments and spaces) @en
broader: Compartimentos e espaços genéricos de dormida e de repouso

Quarto
type: Concept
in scheme: Tesauro SIPA
preferred label: Room @en
preferred label: Chambre @fr
preferred label: Camera @it
broader: Compartimentos e espaços genéricos de dormida e de repouso

Sala de repouso
type: Concept
in scheme: Tesauro SIPA
preferred label: Rest room @en
preferred label: Salle de repos @fr
preferred label: Sala riposo @it
broader: Compartimentos e espaços genéricos de dormida e de repouso

Suite
type: Concept
in scheme: Tesauro SIPA
broader: Compartimentos e espaços genéricos de dormida e de repouso
narrower: Suite nupcial
narrower: Suite presidencial
narrower: Suite real

Suite nupcial
type: Concept
in scheme: Tesauro SIPA
preferred label: Nuptial suite @en
preferred label: Suite nuptiale @fr
preferred label: Suite nuziale @it
broader: Suite

Suite presidencial
type: Concept
in scheme: Tesauro SIPA
preferred label: Presidential suite @en
preferred label: Suite présidentielle @fr
preferred label: Suite presidenziale @it
broader: Suite

Suite real
type: Concept
in scheme: Tesauro SIPA
preferred label: Royal suite @en
preferred label: Suite royale @fr
preferred label: Suite reale @it
broader: Suite

Compartimentos e espaços genéricos de educação
type: Concept
in scheme: Tesauro SIPA
preferred label: Educational compartments and spaces (Generic compartments and spaces) @en
preferred label: Salles et espaces d'éducation (Salles et espaces génériques) @fr
preferred label: Sale e spazi didattici (Sale e spazi generici) @it
broader: Compartimentos e espaços genéricos segundo a função
narrower: Gabinete de leitura
narrower: Sala de aula
narrower: Sala de estudo
narrower: Sala de formação
narrower: Sala do conto

Gabinete de leitura
type: Concept
in scheme: Tesauro SIPA
preferred label: Reading room @en
preferred label: Salle de lecture @fr
preferred label: Sala di lettura @it
broader: Compartimentos e espaços genéricos de educação

Sala de aula
type: Concept
scope note: Num estabelecimento de ensino, espaço destinado à formação de alunos onde são ministradas disciplinas sem exigências especiais de equipamento ou mobiliário, desenvolvendo-se neste local quase todas as atividades curriculares diárias, geralmente sob a orientação de um professor.
in scheme: Tesauro SIPA
preferred label: Classroom @en
preferred label: Salle de classe @fr
preferred label: Aula didattica @it
broader: Compartimentos e espaços genéricos de educação

Sala de estudo
type: Concept
scope note: Num estabelecimento de ensino básico ou secundário, espaço destinado ao acompanhamento de estudantes por parte de professores, que ensinam a estudar, apoiam a elaboração de trabalhos escolares e fazem a orientação de comportamentos e atitudes de alunos. Este local está geralmente equipado com livros, meios audiovisuais e informáticos para leitura, consulta e estudo.
in scheme: Tesauro SIPA
preferred label: Study room @en
preferred label: Salle d'étude @fr
preferred label: Sala studio @it
broader: Compartimentos e espaços genéricos de educação

Sala de formação
type: Concept
scope note: Espaço de uma instituição pública ou privada, destinado a desenvolver ações de formação aos trabalhadores da instituição, ou abertas ao público em geral.
in scheme: Tesauro SIPA
preferred label: Training room @en
preferred label: Salle de formation @fr
preferred label: Sala formazione @it
broader: Compartimentos e espaços genéricos de educação

Sala do conto
type: Concept
scope note: Numa biblioteca pública, espaço infantil concebido para atividades em grupo, de animação, de leitura, de apresentação de pequenos espetáculos ou outro tipo de ações educativas.
in scheme: Tesauro SIPA
preferred label: Story room @en
preferred label: Salle d'histoire @fr
preferred label: Sala del racconto @it
broader: Compartimentos e espaços genéricos de educação

Compartimentos e espaços genéricos de ensaio artístico
type: Concept
in scheme: Tesauro SIPA
preferred label: Rehearsal compartments and spaces (Generic compartments and spaces) @en
preferred label: Compartiments et locaux d’essai artistique (Compartiments et espaces génériques) @fr
preferred label: Compartimenti e spazi di prova artistica (Compartimenti e spazi generici) @it
broader: Compartimentos e espaços genéricos segundo a função
narrower: Sala de ensaios (Compartimentos e espaços genéricos de ensaio artístico)

Sala de ensaios (Compartimentos e espaços genéricos de ensaio artístico)
type: Concept
in scheme: Tesauro SIPA
preferred label: Rehearsal room (Rehearsal generic compartments and spaces) @en
preferred label: Salle de répétition (Compartiments et espaces de répétition génériques) @fr
preferred label: Sala prove (Compartimenti e spazi generici per le prove) @it
broader: Compartimentos e espaços genéricos de ensaio artístico

Compartimentos e espaços genéricos de entretenimento
type: Concept
in scheme: Tesauro SIPA
preferred label: Entertainment compartments and spaces (Compartments and generic spaces) @en
preferred label: Espaces de divertissement (Compartiments et espaces génériques) @fr
preferred label: Compartimenti e spazi di intrattenimento (Compartimenti e spazi generici) @it
broader: Compartimentos e espaços genéricos segundo a função
narrower: Sala de baile
narrower: Sala de jogos
narrower: Salão de festas
narrower: Salão de jogos (Compartimentos e espaços genéricos de entretenimento)
narrower: Sala dos brinquedos

Sala de baile
type: Concept
in scheme: Tesauro SIPA
preferred label: Ballroom @en
preferred label: Salle de bal @fr
preferred label: Sala da ballo @it
broader: Compartimentos e espaços genéricos de entretenimento

Sala de jogos
type: Concept
in scheme: Tesauro SIPA
preferred label: Games room @en
preferred label: Salle de jeux @fr
preferred label: Sala giochi @it
broader: Compartimentos e espaços genéricos de entretenimento

Salão de festas
type: Concept
in scheme: Tesauro SIPA
preferred label: Party room @en
preferred label: Salle de fêtes @fr
preferred label: Sala delle feste @it
broader: Compartimentos e espaços genéricos de entretenimento

Salão de jogos (Compartimentos e espaços genéricos de entretenimento)
type: Concept
in scheme: Tesauro SIPA
preferred label: Games room @en
preferred label: Salle de jeux @fr
preferred label: Sala giochi @it
broader: Compartimentos e espaços genéricos de entretenimento
narrower: Sala de bilhar

Sala de bilhar
type: Concept
in scheme: Tesauro SIPA
preferred label: Billiard room; Snooker room @en
preferred label: Salle de billard @fr
preferred label: Sala da biliardo @it
broader: Salão de jogos (Compartimentos e espaços genéricos de entretenimento)

Sala dos brinquedos
type: Concept
in scheme: Tesauro SIPA
preferred label: Sala giochi @it
preferred label: Playroom @en
preferred label: Salle des jouets @fr
broader: Compartimentos e espaços genéricos de entretenimento

Compartimentos e espaços genéricos de estar e de convívio social
type: Concept
in scheme: Tesauro SIPA
preferred label: Living and socialising compartments and spaces (Generic compartments and spaces) @en
preferred label: Compartiments et espaces génériques de vie et convivialité sociale @fr
preferred label: Compartimenti e spazi generici per la vita e la socializzazione @it
broader: Compartimentos e espaços genéricos segundo a função
narrower: Esplanada (Compartimentos e espaços genéricos de estar e de convívio social)
narrower: Foyer
narrower: Locutório
narrower: Mirante (Compartimentos e espaços genéricos de estar e de convívio social)
narrower: Parlatório
narrower: Sala
narrower: Salão (Compartimentos e espaços genéricos de estar e de convívio social)
narrower: Saleta

Esplanada (Compartimentos e espaços genéricos de estar e de convívio social)
type: Concept
in scheme: Tesauro SIPA
preferred label: Terrace (Living and socialising compartments and spaces) @en
preferred label: Esplanade (Compartiments et espaces génériques de vie et convivialité sociale ) @fr
preferred label: Esplanade (Compartimenti e spazi generici per la vita e la socializzazione) @it
broader: Compartimentos e espaços genéricos de estar e de convívio social

Foyer
type: Concept
in scheme: Tesauro SIPA
preferred label: Foyer; Hall @en
broader: Compartimentos e espaços genéricos de estar e de convívio social

Locutório
type: Concept
in scheme: Tesauro SIPA
preferred label: Locutory @en
preferred label: Parloir @fr
preferred label: Parlatoio @it
broader: Compartimentos e espaços genéricos de estar e de convívio social

Mirante (Compartimentos e espaços genéricos de estar e de convívio social)
type: Concept
in scheme: Tesauro SIPA
preferred label: Viewpoint; Belvedere (Living and socialising reneric compartments and spaces) @en
preferred label: Belvédère (Compartiments et espaces génériques de vie et de socialisation) @fr
preferred label: Belvedere (Compartimenti e spazi generici per la vita e la socializzazione) @it
broader: Compartimentos e espaços genéricos de estar e de convívio social

Parlatório
type: Concept
scope note: Espaço ou conjunto de espaços destinado ao contacto dos residentes (reclusos dos edifícios prisionais ou religiosos das casas monástico-conventuais) com as suas visitas, tanto de ordem pessoal quanto, no caso dos primeiros, no âmbito da assistência jurídica, social ou outra. No caso das casas monástico-conventuais o parlatório pode estar integrado numa área da portaria.
in scheme: Tesauro SIPA
preferred label: Parloir @fr
preferred label: Parlatory @en
preferred label: Parlatorio @it
broader: Compartimentos e espaços genéricos de estar e de convívio social

Sala
type: Concept
in scheme: Tesauro SIPA
preferred label: Room @en
preferred label: Salle @fr
broader: Compartimentos e espaços genéricos de estar e de convívio social
narrower: Sala de convívio
narrower: Sala de estar
narrower: Sala de fumo (Compartimentos e espaços genéricos de estar e de convívio social - Espaços de entretenimento)
narrower: Sala de recreio
narrower: Sala de visitas

Sala de convívio
type: Concept
in scheme: Tesauro SIPA
preferred label: Common room @en
preferred label: Salon @fr
preferred label: Soggiorno @it
broader: Sala

Sala de estar
type: Concept
in scheme: Tesauro SIPA
preferred label: Soggiorno @it
preferred label: Living room @en
preferred label: Salle de séjour @fr
broader: Sala

Sala de fumo (Compartimentos e espaços genéricos de estar e de convívio social - Espaços de entretenimento)
type: Concept
in scheme: Tesauro SIPA
preferred label: Smoking room (Entertainment compartments and spaces) @en
preferred label: Salle pour fumeurs (Compartiments et espaces génériques de vie et de socialisation) @fr
preferred label: Sala fumatori (Compartimenti e spazi generici per la vita e la socializzazione) @it
broader: Sala

Sala de recreio
type: Concept
in scheme: Tesauro SIPA
preferred label: Recreation room @en
preferred label: Salle de loisirs @fr
preferred label: Sala ricreativa @it
broader: Sala

Sala de visitas
type: Concept
scope note: Num estabelecimento prisional, é o local onde os detidos recebem os seus visitantes sem quaisquer barreiras de segurança, apenas sob a vigilância dos guardas prisionais.
in scheme: Tesauro SIPA
preferred label: Drawing room @en
preferred label: Salle de visite @fr
preferred label: Sala visite @it
broader: Sala

Salão (Compartimentos e espaços genéricos de estar e de convívio social)
type: Concept
in scheme: Tesauro SIPA
preferred label: Lounge (Living and socialising reneric compartments and spaces) @en
preferred label: Salon (Compartiments et espaces génériques de vie et convivialité sociale) @fr
preferred label: Salone (Compartimenti e spazi generici per la vita e la socializzazione) @it
broader: Compartimentos e espaços genéricos de estar e de convívio social

Saleta
type: Concept
in scheme: Tesauro SIPA
preferred label: Small parlour @en
preferred label: Petite salle @fr
preferred label: Saletta @it
broader: Compartimentos e espaços genéricos de estar e de convívio social

Compartimentos e espaços genéricos de exercício físico, recreio e de prática desportiva
type: Concept
in scheme: Tesauro SIPA
preferred label: Compartments and spaces for exercise, recreation and sports (Compartments and general spaces) @en
preferred label: Enceintes et espaces pour l'exercice physique, la récréation et la pratique du sport (Compartments et espaces génériques) @fr
preferred label: Recinti e spazi per l'esercizio fisico, la ricreazione e la pratica sportiva (Compartimenti e spazi generici) @it
broader: Compartimentos e espaços genéricos segundo a função
narrower: Ginásio (Compartimentos e espaços genéricos de exercício físico, recreio e de prática desportiva)
narrower: Pátio de recreio
narrower: Piscina (Compartimentos e espaços genéricos de exercício físico, recreio e de prática desportiva)
narrower: Recreio

Ginásio (Compartimentos e espaços genéricos de exercício físico, recreio e de prática desportiva)
type: Concept
scope note: Num estabelecimento de ensino básico com o 1.º ciclo, espaço vocacionado para o desenvolvimento e treino de capacidades físicas, como a coordenação motora, a flexibilidade ou a elasticidade, não se destinando à prática de desportos coletivos. Este local está geralmente equipado com colchões, espaldares, trampolins, banco sueco, etc. Pode também ser utilizado para outros tipos de atividades de movimento, como a expressão dramática.
in scheme: Tesauro SIPA
preferred label: Gymnasium (Compartments and generic spaces for exercise, recreation and sports) @en
preferred label: Gymnase (Compartiments et espaces génériques pour l'exercice physique, la récréation et la pratique du sport) @fr
preferred label: Ginnasio/ Palestra (Compartimenti e spazi generici per l'esercizio fisico, la ricreazione e la pratica sportiva) @it
broader: Compartimentos e espaços genéricos de exercício físico, recreio e de prática desportiva

Pátio de recreio
type: Concept
in scheme: Tesauro SIPA
preferred label: Playground @en
preferred label: Terrain de jeux @fr
preferred label: Parco giochi @it
broader: Compartimentos e espaços genéricos de exercício físico, recreio e de prática desportiva

Piscina (Compartimentos e espaços genéricos de exercício físico, recreio e de prática desportiva)
type: Concept
in scheme: Tesauro SIPA
preferred label: Swimming pool (Compartments and generic spaces for exercise, recreation and sports) @en
preferred label: Piscine (Compartiments et espaces génériques pour l'exercice physique, la récréation et la pratique du sport) @fr
preferred label: Piscina (Compartimenti e spazi generici per l'esercizio fisico, la ricreazione e la pratica sportiva) @it
broader: Compartimentos e espaços genéricos de exercício físico, recreio e de prática desportiva

Recreio
type: Concept
in scheme: Tesauro SIPA
preferred label: Playground @en
preferred label: Terrain de jeux @fr
preferred label: Parco giochi @it
broader: Compartimentos e espaços genéricos de exercício físico, recreio e de prática desportiva
narrower: Recreio coberto

Recreio coberto
type: Concept
in scheme: Tesauro SIPA
preferred label: Covered playground @en
preferred label: Terrain de jeux couvert @fr
preferred label: Parco giochi coperto @it
broader: Recreio

Compartimentos e espaços genéricos de exposição
type: Concept
in scheme: Tesauro SIPA
preferred label: Compartments and exhibition spaces (Generic compartments and spaces) @en
preferred label: Enceintes et espaces d'exposition (Enceintes et espaces généraux) @fr
preferred label: Recinti e spazi espositivi (Compartimenti e spazi generali) @it
broader: Compartimentos e espaços genéricos segundo a função
narrower: Galeria de exposições (Compartimentos e espaços genéricos de exposição)
narrower: Sala de exposições

Galeria de exposições (Compartimentos e espaços genéricos de exposição)
type: Concept
in scheme: Tesauro SIPA
preferred label: Exhibition gallery @en
preferred label: Galerie d'exposition @fr
preferred label: Galleria espositiva @it
broader: Compartimentos e espaços genéricos de exposição

Sala de exposições
type: Concept
in scheme: Tesauro SIPA
preferred label: Showroom @en
preferred label: Salle d'exposition @fr
preferred label: Sala espositiva @it
broader: Compartimentos e espaços genéricos de exposição
narrower: Sala de exposições temporárias

Sala de exposições temporárias
type: Concept
in scheme: Tesauro SIPA
preferred label: Temporary exhibition hall; Temporary showroom @en
preferred label: Salle d'exposition temporaire @fr
preferred label: Sala per mostre temporanee @it
broader: Sala de exposições

Compartimentos e espaços genéricos de higienização, de desinfeção e desinfestação
type: Concept
in scheme: Tesauro SIPA
preferred label: Compartments and spaces for cleaning, disinfection and disinfestation (Compartments and generic spaces) @en
preferred label: Compartiments et espaces d'hygiène, de désinfection et de désinfestation (compartiments et espaces génériques) @fr
preferred label: Comparti e spazi per l'igiene, la disinfezione e la disinfestazione (Comparti e spazi generici) @it
broader: Compartimentos e espaços genéricos segundo a função
narrower: Câmara de decantação
narrower: Câmara de expurgo
narrower: Câmara depuradora
narrower: Engomadaria
narrower: Lavandaria
narrower: Sala de desinfeção
narrower: Sala de esterilização

Câmara de decantação
type: Concept
in scheme: Tesauro SIPA
preferred label: Decantation chamber @en
preferred label: Chambre de décantation @fr
preferred label: Camera di decantazione @it
broader: Compartimentos e espaços genéricos de higienização, de desinfeção e desinfestação

Câmara de expurgo
type: Concept
in scheme: Tesauro SIPA
preferred label: Expurgation chamber @en
preferred label: Chambre de purge @fr
preferred label: Camera di spurgo @it
broader: Compartimentos e espaços genéricos de higienização, de desinfeção e desinfestação

Câmara depuradora
type: Concept
in scheme: Tesauro SIPA
preferred label: Depurative chamber @en
preferred label: Chambre de purification @fr
preferred label: Camera di depurazione @it
broader: Compartimentos e espaços genéricos de higienização, de desinfeção e desinfestação

Engomadaria
type: Concept
scope note: Compartimento onde se engoma a roupa, por norma anexo à Lavandaria.
in scheme: Tesauro SIPA
preferred label: Ironing room @en
preferred label: Repassage @fr
preferred label: Stiratura @it
broader: Compartimentos e espaços genéricos de higienização, de desinfeção e desinfestação

Lavandaria
type: Concept
scope note: Edifício ou parte extensa de edifício destinado à lavagem, desinfecção, reparação e tratamento de vestuário e roupa de casa de um contingente alargado de indivíduos.
in scheme: Tesauro SIPA
preferred label: Lavanderia @it
preferred label: Laundry @en
preferred label: Blanchisserie @fr
broader: Compartimentos e espaços genéricos de higienização, de desinfeção e desinfestação

Sala de desinfeção
type: Concept
in scheme: Tesauro SIPA
preferred label: Disinfection room @en
preferred label: Salle de désinfection @fr
preferred label: Sala di disinfezione @it
broader: Compartimentos e espaços genéricos de higienização, de desinfeção e desinfestação

Sala de esterilização
type: Concept
in scheme: Tesauro SIPA
preferred label: Sterilization room @en
preferred label: Salle de stérilisation @fr
preferred label: Sala di sterilizzazione @it
broader: Compartimentos e espaços genéricos de higienização, de desinfeção e desinfestação

Compartimentos e espaços genéricos de monitorização e de controlo
type: Concept
in scheme: Tesauro SIPA
preferred label: Monitoring and control compartments and spaces (Cultural and recreational compartments and spaces) @en
preferred label: Compartiments et espaces de surveillance et de contrôle (Compartiments et espaces culturels et récréatifs) @fr
preferred label: Comparti e spazi per il monitoraggio e il controllo (Comparti e spazi culturali e ricreativi) @it
broader: Compartimentos e espaços genéricos segundo a função
narrower: Régie

Régie
type: Concept
in scheme: Tesauro SIPA
preferred label: Regie (Control booth) @en
broader: Compartimentos e espaços genéricos de monitorização e de controlo
narrower: Régie de direção de cena
narrower: Régie de luz
narrower: Régie de som

Régie de direção de cena
type: Concept
in scheme: Tesauro SIPA
preferred label: Stage scenery regie; Stage scenery control booth @en
preferred label: Régie du metteur en scène @fr
preferred label: Régie di controllo del regista di palcoscenico @it
hidden label: Régie de direcção de cena
broader: Régie

Régie de luz
type: Concept
in scheme: Tesauro SIPA
preferred label: Light scene regie; Light scene control booth @en
preferred label: Régie de lumière @fr
preferred label: Régie di luce @it
broader: Régie

Régie de som
type: Concept
in scheme: Tesauro SIPA
preferred label: Sound regie @en
preferred label: Régie du son @fr
preferred label: Régie del suono @it
broader: Régie

Compartimentos e espaços genéricos de observação e análise, de experiência e diagnóstico técnico e científico
type: Concept
in scheme: Tesauro SIPA
preferred label: Compartments and spaces for observation and analysis, experience and technical and scientific diagnosis (Generic components and spaces) @en
preferred label: Compartiments et espaces d'observation et d'analyse, d'expérimentation et d'expérimentation technique et scientifique et de diagnostic (composants et espaces génériques) @fr
preferred label: Compartimenti e spazi per l'osservazione e l'analisi, la sperimentazione e la diagnosi tecnica e scientifica (Componenti e spazi generici) @it
broader: Compartimentos e espaços genéricos segundo a função
narrower: Gabinete de serviço social
narrower: Gabinete técnico
narrower: Laboratório (Compartimentos e espaços genéricos de observação e análise, de experiência e diagnóstico técnico e científico)
narrower: Morgue
narrower: Sala de autópsias
narrower: Sala de ensaios (Compartimentos e espaços genéricos de observação e análise, de experiência e de experiência e diagnóstico técnico e científico)
narrower: Sala de experiências

Gabinete de serviço social
type: Concept
in scheme: Tesauro SIPA
preferred label: Social service office @en
preferred label: Bureau des services sociaux @fr
preferred label: Ufficio di servizio sociale @it
broader: Compartimentos e espaços genéricos de observação e análise, de experiência e diagnóstico técnico e científico

Gabinete técnico
type: Concept
in scheme: Tesauro SIPA
preferred label: Technical office @en
preferred label: Bureau technique @fr
preferred label: Ufficio tecnico @it
broader: Compartimentos e espaços genéricos de observação e análise, de experiência e diagnóstico técnico e científico

Laboratório (Compartimentos e espaços genéricos de observação e análise, de experiência e diagnóstico técnico e científico)
type: Concept
in scheme: Tesauro SIPA
preferred label: Laboratory (Compartments and spaces for observation and analysis, experience and technical and scientific diagnosis) @en
preferred label: Laboratoire (Compartiments et espaces d’observation et d’analyse, expérience et diagnostic technique et scientifique) @fr
preferred label: Laboratorio (Comparti e spazi di osservazione e analisi, esperienza e diagnosi tecnica e scientifica) @it
broader: Compartimentos e espaços genéricos de observação e análise, de experiência e diagnóstico técnico e científico
narrower: Laboratório de análise

Laboratório de análise
type: Concept
in scheme: Tesauro SIPA
preferred label: Analysis laboratory @en
preferred label: Laboratoire d'analyses @fr
preferred label: Laboratorio di analisi @it
broader: Laboratório (Compartimentos e espaços genéricos de observação e análise, de experiência e diagnóstico técnico e científico)

Morgue
type: Concept
scope note: O termo morgue referia-se inicialmente ao espaço destinado à exposição de cadáveres para identificação, mais tarde, estendeu-se também ao local ou edificação onde também eram feitas autópsias médico-legais e outros tipos de exames, normalmente em hospitais. A Carta de Lei de 17 de Agosto de 1899 dividiu Portugal em três circunscrições médico-legais, criando morgues nas respetivas sedes, em Coimbra, junto à Faculdade de Medicina, e em Lisboa e no Porto, junto às Escolas Médico-Cirúrgicas, com funções médico-forenses, mas também para o ensino prático da Medicina Legal. Sobre estas morgues foram fundados, pelo Decreto n.º 5023, de 29 de Novembro de 1918, os três Institutos de Medicina Legal, de Lisboa, Porto e Coimbra, mas com um número alargado de funções, encontrando-se actualmente na sua dependência direta gabinetes médico-legais, cujas competências incluem a realização de autópsias nas comarcas inseridas na sua área de atuação.
in scheme: Tesauro SIPA
preferred label: Mortuary @en
preferred label: Obitorio @it
broader: Compartimentos e espaços genéricos de observação e análise, de experiência e diagnóstico técnico e científico

Sala de autópsias
type: Concept
in scheme: Tesauro SIPA
preferred label: Autopsy room @en
preferred label: Salle d'autopsie @fr
preferred label: Sala autopsie @it
broader: Compartimentos e espaços genéricos de observação e análise, de experiência e diagnóstico técnico e científico

Sala de ensaios (Compartimentos e espaços genéricos de observação e análise, de experiência e de experiência e diagnóstico técnico e científico)
type: Concept
in scheme: Tesauro SIPA
preferred label: Testing room (Compartments and spaces for observation and analysis, experience and technical and scientific diagnosis) @en
preferred label: Salle d’essai (compartiments et espaces d’observation et d’analyse, expérience et diagnostic technique et scientifique) @fr
preferred label: Sala prove (Compartimenti e spazi di osservazione e analisi, esperienza e diagnosi tecnica e scientifica) @it
broader: Compartimentos e espaços genéricos de observação e análise, de experiência e diagnóstico técnico e científico

Sala de experiências
type: Concept
in scheme: Tesauro SIPA
preferred label: Experiment room @en
preferred label: Salle d'expériences @fr
preferred label: Camera dell'esperienza @it
broader: Compartimentos e espaços genéricos de observação e análise, de experiência e diagnóstico técnico e científico

Compartimentos e espaços genéricos de prevenção, de tratamento clínico e intervenção cirúrgica
type: Concept
in scheme: Tesauro SIPA
preferred label: Compartments and spaces for prevention, clinical treatment and surgical intervention (Generic compartments and spaces) @en
preferred label: Compartiments et espaces de prévention, de traitement clinique et d’intervention chirurgicale (Compartiments et espaces génériques) @fr
preferred label: Compartimenti e spazi per la prevenzione, il trattamento clinico e l'intervento chirurgico (Compartimenti e spazi generici) @it
broader: Compartimentos e espaços genéricos segundo a função
narrower: Enfermaria (Compartimentos e espaços genéricos de prevenção, de tratamento clínico e intervenção cirúrgica)
narrower: Gabinete médico
narrower: Solário
narrower: Varanda de convalescença
narrower: Varanda de cura

Enfermaria (Compartimentos e espaços genéricos de prevenção, de tratamento clínico e intervenção cirúrgica)
type: Concept
scope note: Compartimento destinado ao tratamento médico continuado de um contingente alargado de indivíduos, especializado ou não.
in scheme: Tesauro SIPA
preferred label: Infirmary (Compartments and spaces for prevention, clinical treatment and surgical intervention) @en
preferred label: Infirmerie (Compartiments et espaces de prévention, de traitement clinique et d’intervention chirurgicale) @fr
preferred label: Infermeria (Compartimenti e spazi per la prevenzione, il trattamento clinico e l'intervento chirurgico) @it
broader: Compartimentos e espaços genéricos de prevenção, de tratamento clínico e intervenção cirúrgica

Gabinete médico
type: Concept
in scheme: Tesauro SIPA
preferred label: Doctor’s office (Practice) @en
preferred label: Cabinet médical @fr
preferred label: Armadio medico @it
broader: Compartimentos e espaços genéricos de prevenção, de tratamento clínico e intervenção cirúrgica

Solário
type: Concept
in scheme: Tesauro SIPA
preferred label: Solarium @en
broader: Compartimentos e espaços genéricos de prevenção, de tratamento clínico e intervenção cirúrgica

Varanda de convalescença
type: Concept
in scheme: Tesauro SIPA
preferred label: Convalescence balcony @en
preferred label: Balcon de convalescence @fr
preferred label: Balcone di convalescenza @it
broader: Compartimentos e espaços genéricos de prevenção, de tratamento clínico e intervenção cirúrgica

Varanda de cura
type: Concept
in scheme: Tesauro SIPA
preferred label: Healing balcony @en
preferred label: Balcon de cure @fr
preferred label: Balcone di cura @it
broader: Compartimentos e espaços genéricos de prevenção, de tratamento clínico e intervenção cirúrgica

Compartimentos e espaços genéricos de processamento e de transformação de materiais e produtos
type: Concept
in scheme: Tesauro SIPA
preferred label: Compartments and spaces for processing and transformation of materials and products (Compartments and generic spaces) @en
preferred label: Compartiments et espaces pour le traitement et la transformation des matériaux et des produits (Compartiments et espaces génériques) @fr
preferred label: Compartimenti e spazi per la lavorazione e trasformazione di materiali e prodotti (Compartimenti e spazi generici) @it
broader: Compartimentos e espaços genéricos segundo a função
narrower: Casa da balança
narrower: Casa de trabalho
narrower: Casa do forno
narrower: Estúdio (Compartimentos e espaços genéricos de processamento e de transformação de materiais e produtos)
narrower: Lagar (Compartimentos e espaços genéricos de processamento e de transformação de materiais e produtos)
narrower: Oficina (Compartimentos e espaços genéricos de processamento e de transformação de materiais e produtos)
narrower: Reprografia
narrower: Sala de moagem
narrower: Sala de pesagem

Casa da balança
type: Concept
in scheme: Tesauro SIPA
preferred label: Scale room @en
preferred label: Salle des balances @fr
preferred label: Camera della bilancia @it
broader: Compartimentos e espaços genéricos de processamento e de transformação de materiais e produtos

Casa de trabalho
type: Concept
in scheme: Tesauro SIPA
preferred label: Workhouse @en
preferred label: Maison de travail @fr
preferred label: Casa di lavoro @it
broader: Compartimentos e espaços genéricos de processamento e de transformação de materiais e produtos

Casa do forno
type: Concept
in scheme: Tesauro SIPA
preferred label: Oven house @en
preferred label: Maison du four @fr
preferred label: Casa del forno @it
broader: Compartimentos e espaços genéricos de processamento e de transformação de materiais e produtos

Estúdio (Compartimentos e espaços genéricos de processamento e de transformação de materiais e produtos)
type: Concept
in scheme: Tesauro SIPA
preferred label: Studio (Compartments and spaces for processing and transformation of materials and products) @en
preferred label: Studio (Compartiments et espaces pour le traitement et la transformation des matériaux et des produits) @fr
preferred label: Studio (Compartimenti e spazi per la lavorazione e trasformazione di materiali e prodotti) @it
broader: Compartimentos e espaços genéricos de processamento e de transformação de materiais e produtos

Lagar (Compartimentos e espaços genéricos de processamento e de transformação de materiais e produtos)
type: Concept
in scheme: Tesauro SIPA
preferred label: Press @en
preferred label: Pressoir @fr
preferred label: Frantoio (Torchio) @it
broader: Compartimentos e espaços genéricos de processamento e de transformação de materiais e produtos
narrower: Lagar de azeite (Compartimentos e espaços genéricos de processamento e de transformação de materiais e produtos)
narrower: Lagar de vinho (Compartimentos e espaços genéricos de processamento e de transformação de materiais e produtos)

Lagar de azeite (Compartimentos e espaços genéricos de processamento e de transformação de materiais e produtos)
type: Concept
in scheme: Tesauro SIPA
preferred label: Olive oil press @en
preferred label: Moulin à huile (Pressoir à olives) @fr
preferred label: Frantoio @it
broader: Lagar (Compartimentos e espaços genéricos de processamento e de transformação de materiais e produtos)

Lagar de vinho (Compartimentos e espaços genéricos de processamento e de transformação de materiais e produtos)
type: Concept
in scheme: Tesauro SIPA
preferred label: Wine press @en
preferred label: Pressoir à vin @fr
preferred label: Torchio per il vino (Pressa enologica) @it
broader: Lagar (Compartimentos e espaços genéricos de processamento e de transformação de materiais e produtos)

Oficina (Compartimentos e espaços genéricos de processamento e de transformação de materiais e produtos)
type: Concept
in scheme: Tesauro SIPA
preferred label: Workshop @en
preferred label: Atelier @fr
preferred label: Officina @it
broader: Compartimentos e espaços genéricos de processamento e de transformação de materiais e produtos
narrower: Oficina de alfaiataria
narrower: Oficina de bordados
narrower: Oficina de canteiro
narrower: Oficina de carpintaria
narrower: Oficina de carroçaria
narrower: Oficina de cenografia
narrower: Oficina de cestaria
narrower: Oficina de cordoaria
narrower: Oficina de costura
narrower: Oficina de culinária
narrower: Oficina de eletrónica
narrower: Oficina de embalagens
narrower: Oficina de encadernação
narrower: Oficina de estucador
narrower: Oficina de ferraria
narrower: Oficina de fornos, tornos e ajustagem
narrower: Oficina de gravura
narrower: Oficina de marcenaria
narrower: Oficina de mecânica
narrower: Oficina de olaria
narrower: Oficina de pedreiro
narrower: Oficina de picheleiro
narrower: Oficina de pintura
narrower: Oficina de sapataria
narrower: Oficina de serralharia
narrower: Oficina de tamanqueiros
narrower: Oficina de tapeçaria
narrower: Oficina de tecelagem
narrower: Oficina de tipografia

Oficina de alfaiataria
type: Concept
in scheme: Tesauro SIPA
preferred label: Tailoring workshop @en
preferred label: Atelier de couture @fr
preferred label: Officina di sartoria @it
broader: Oficina (Compartimentos e espaços genéricos de processamento e de transformação de materiais e produtos)

Oficina de bordados
type: Concept
scope note: Local onde se desenvolve a atividade de bordar.
in scheme: Tesauro SIPA
preferred label: Embroidery workshop @en
preferred label: Atelier de broderie @fr
preferred label: Officina di ricamo @it
broader: Oficina (Compartimentos e espaços genéricos de processamento e de transformação de materiais e produtos)

Oficina de canteiro
type: Concept
in scheme: Tesauro SIPA
preferred label: Stonemasonry workshop @en
preferred label: Atelier de maçonnerie @fr
preferred label: Officina di scalpellino @it
broader: Oficina (Compartimentos e espaços genéricos de processamento e de transformação de materiais e produtos)

Oficina de carpintaria
type: Concept
in scheme: Tesauro SIPA
preferred label: Carpentry workshop @en
preferred label: Atelier de menuiserie @fr
preferred label: Officina di falegnameria @it
broader: Oficina (Compartimentos e espaços genéricos de processamento e de transformação de materiais e produtos)

Oficina de carroçaria
type: Concept
in scheme: Tesauro SIPA
preferred label: Bodywork workshop @en
preferred label: Atelier de carrosserie @fr
preferred label: Officina di carrozzeria @it
broader: Oficina (Compartimentos e espaços genéricos de processamento e de transformação de materiais e produtos)

Oficina de cenografia
type: Concept
scope note: Local onde se fabricam cenários perspetivados, destinado, essencialmente, a espetáculos.
in scheme: Tesauro SIPA
preferred label: Scenography workshop @en
preferred label: Atelier de scénographie @fr
preferred label: Officina di scenografia @it
broader: Oficina (Compartimentos e espaços genéricos de processamento e de transformação de materiais e produtos)

Oficina de cestaria
type: Concept
scope note: Local onde se fabricam cestas feitas a partir de materiais vegetais.
in scheme: Tesauro SIPA
preferred label: Wickerwork workshop @en
preferred label: Atelier de vannerie @fr
preferred label: Officina di cesteria @it
broader: Oficina (Compartimentos e espaços genéricos de processamento e de transformação de materiais e produtos)

Oficina de cordoaria
type: Concept
scope note: Local onde se fabricam cordas.
in scheme: Tesauro SIPA
preferred label: Ropery workshop @en
preferred label: Atelier de corde @fr
preferred label: Officina delle corde @it
broader: Oficina (Compartimentos e espaços genéricos de processamento e de transformação de materiais e produtos)

Oficina de costura
type: Concept
in scheme: Tesauro SIPA
preferred label: Atelier de couture @fr
preferred label: Sewing workshop @en
preferred label: Officina del cucito @it
broader: Oficina (Compartimentos e espaços genéricos de processamento e de transformação de materiais e produtos)

Oficina de culinária
type: Concept
in scheme: Tesauro SIPA
preferred label: Cooking workshop @en
preferred label: Atelier de cuisine @fr
preferred label: Officina di cucina @it
broader: Oficina (Compartimentos e espaços genéricos de processamento e de transformação de materiais e produtos)

Oficina de eletrónica
type: Concept
in scheme: Tesauro SIPA
preferred label: Electronics workshop @en
preferred label: Atelier d'électronique @fr
preferred label: Officina dell'elettronica @it
hidden label: Oficina de electrónica
broader: Oficina (Compartimentos e espaços genéricos de processamento e de transformação de materiais e produtos)

Oficina de embalagens
type: Concept
in scheme: Tesauro SIPA
preferred label: Packing workshop @en
preferred label: Atelier d'emballage @fr
preferred label: Officina dell'imballaggio @it
broader: Oficina (Compartimentos e espaços genéricos de processamento e de transformação de materiais e produtos)

Oficina de encadernação
type: Concept
in scheme: Tesauro SIPA
preferred label: Binding workshop @en
preferred label: Atelier de reliure @fr
preferred label: Officina di rilegatura @it
broader: Oficina (Compartimentos e espaços genéricos de processamento e de transformação de materiais e produtos)

Oficina de estucador
type: Concept
in scheme: Tesauro SIPA
preferred label: Plastering workshop @en
preferred label: Atelier de stucage @fr
preferred label: Officina dello stucco @it
broader: Oficina (Compartimentos e espaços genéricos de processamento e de transformação de materiais e produtos)

Oficina de ferraria
type: Concept
in scheme: Tesauro SIPA
preferred label: Blacksmith's workshop @en
preferred label: Atelier de forge @fr
preferred label: Officina del fabbro @it
broader: Oficina (Compartimentos e espaços genéricos de processamento e de transformação de materiais e produtos)

Oficina de fornos, tornos e ajustagem
type: Concept
in scheme: Tesauro SIPA
preferred label: Oven, lathe and tuning workshop @en
preferred label: Atelier de fours, de tours et de réglage @fr
preferred label: Officina di forni, torni e di messa a punto @it
broader: Oficina (Compartimentos e espaços genéricos de processamento e de transformação de materiais e produtos)

Oficina de gravura
type: Concept
in scheme: Tesauro SIPA
preferred label: Engraving workshop @en
preferred label: Atelier de gravure @fr
preferred label: Officina di incisione @it
broader: Oficina (Compartimentos e espaços genéricos de processamento e de transformação de materiais e produtos)

Oficina de marcenaria
type: Concept
in scheme: Tesauro SIPA
preferred label: Atelier de menuiserie @fr
preferred label: Carpenter’s workshop @en
preferred label: Officina di lavorazione del legno @it
broader: Oficina (Compartimentos e espaços genéricos de processamento e de transformação de materiais e produtos)

Oficina de mecânica
type: Concept
in scheme: Tesauro SIPA
preferred label: Mechanic workshop @en
preferred label: Atelier de mécanique @fr
preferred label: Officina meccanica @it
broader: Oficina (Compartimentos e espaços genéricos de processamento e de transformação de materiais e produtos)
narrower: Oficina de mecânica de automóveis

Oficina de mecânica de automóveis
type: Concept
in scheme: Tesauro SIPA
preferred label: Auto mechanic workshop @en
preferred label: Atelier de mécanique automobile @fr
preferred label: Officina meccanica auto @it
broader: Oficina de mecânica

Oficina de olaria
type: Concept
in scheme: Tesauro SIPA
preferred label: Pottery workshop @en
preferred label: Atelier de poterie @fr
preferred label: Officina di ceramica @it
broader: Oficina (Compartimentos e espaços genéricos de processamento e de transformação de materiais e produtos)

Oficina de pedreiro
type: Concept
in scheme: Tesauro SIPA
preferred label: Officina del fabbro @it
preferred label: Stonemason’s workshop @en
preferred label: Atelier de tailleur de pierre @fr
broader: Oficina (Compartimentos e espaços genéricos de processamento e de transformação de materiais e produtos)

Oficina de picheleiro
type: Concept
in scheme: Tesauro SIPA
preferred label: Atelier de menuiserie @fr
preferred label: Officina di falegnameria @it
preferred label: Picker's workshop @en
broader: Oficina (Compartimentos e espaços genéricos de processamento e de transformação de materiais e produtos)

Oficina de pintura
type: Concept
in scheme: Tesauro SIPA
preferred label: Painting workshop @en
preferred label: Atelier de peinture @fr
preferred label: Officina del pittore @it
broader: Oficina (Compartimentos e espaços genéricos de processamento e de transformação de materiais e produtos)

Oficina de sapataria
type: Concept
in scheme: Tesauro SIPA
preferred label: Shoemaker's workshop @en
preferred label: Atelier de cordonnerie @fr
preferred label: Officina del calzolaio @it
broader: Oficina (Compartimentos e espaços genéricos de processamento e de transformação de materiais e produtos)

Oficina de serralharia
type: Concept
in scheme: Tesauro SIPA
preferred label: Locksmith workshop @en
preferred label: Atelier de serrurerie @fr
preferred label: Officina del magnano @it
broader: Oficina (Compartimentos e espaços genéricos de processamento e de transformação de materiais e produtos)
narrower: Oficina de serralharia civil
narrower: Oficina de serralharia mecânica

Oficina de serralharia civil
type: Concept
in scheme: Tesauro SIPA
preferred label: Officina del fabbro @it
preferred label: Atelier de serrurerie @fr
preferred label: Civil locksmith workshop @en
broader: Oficina de serralharia

Oficina de serralharia mecânica
type: Concept
in scheme: Tesauro SIPA
preferred label: Mechanic locksmith workshop @en
preferred label: Atelier de serrurerie mécanique @fr
preferred label: Officina fabbri meccanici @it
broader: Oficina de serralharia

Oficina de tamanqueiros
type: Concept
in scheme: Tesauro SIPA
preferred label: Clog-maker's workshop @en
preferred label: Atelier de sabot @fr
preferred label: Officina di zoccoli @it
broader: Oficina (Compartimentos e espaços genéricos de processamento e de transformação de materiais e produtos)

Oficina de tapeçaria
type: Concept
in scheme: Tesauro SIPA
preferred label: Upholstery workshop @en
preferred label: Atelier de tapisserie @fr
preferred label: Officina dell'arazzo @it
broader: Oficina (Compartimentos e espaços genéricos de processamento e de transformação de materiais e produtos)

Oficina de tecelagem
type: Concept
in scheme: Tesauro SIPA
preferred label: Weaving workshop @en
preferred label: Atelier de tissage @fr
preferred label: Officina di tessitura @it
broader: Oficina (Compartimentos e espaços genéricos de processamento e de transformação de materiais e produtos)

Oficina de tipografia
type: Concept
in scheme: Tesauro SIPA
preferred label: Typography workshop @en
preferred label: Atelier de typographie @fr
preferred label: Officina di tipografia @it
broader: Oficina (Compartimentos e espaços genéricos de processamento e de transformação de materiais e produtos)

Reprografia
type: Concept
in scheme: Tesauro SIPA
preferred label: Reprography @en
preferred label: Reprographie @fr
preferred label: Riprografia @it
broader: Compartimentos e espaços genéricos de processamento e de transformação de materiais e produtos

Sala de moagem
type: Concept
in scheme: Tesauro SIPA
preferred label: Mill room @en
preferred label: Salle de broyage @fr
preferred label: Sala di macinazione @it
broader: Compartimentos e espaços genéricos de processamento e de transformação de materiais e produtos

Sala de pesagem
type: Concept
in scheme: Tesauro SIPA
preferred label: Weighing room @en
preferred label: Salle de pesée @fr
preferred label: Camera di pesatura @it
broader: Compartimentos e espaços genéricos de processamento e de transformação de materiais e produtos

Compartimentos e espaços genéricos de recolha, de produção e de processamento de dados e registos
type: Concept
in scheme: Tesauro SIPA
preferred label: Data and records collection, production and processing compartments and spaces (Generic compartments and spaces) @en
preferred label: Compartiments et espaces de collecte, de production et de traitement des données et des enregistrements (compartiments et espaces génériques) @fr
preferred label: Comparti e spazi per la raccolta, la produzione e l'elaborazione di dati e registrazioni (Comparti e spazi generici) @it
broader: Compartimentos e espaços genéricos segundo a função
narrower: Camarote de imprensa
narrower: Casa do telégrafo
narrower: Cartório
narrower: Escritório
narrower: Gabinete
narrower: Sala de imprensa
narrower: Sala de registo
narrower: Secretaria
narrower: Tesouraria
narrower: Tribuna de imprensa

Camarote de imprensa
type: Concept
in scheme: Tesauro SIPA
preferred label: Press box @en
preferred label: Boîte de presse @fr
preferred label: Tribuna stampa @it
broader: Compartimentos e espaços genéricos de recolha, de produção e de processamento de dados e registos

Casa do telégrafo
type: Concept
in scheme: Tesauro SIPA
preferred label: Telegraph house @en
preferred label: Bureau du télégraphe @fr
preferred label: Casa del telegrafo @it
broader: Compartimentos e espaços genéricos de recolha, de produção e de processamento de dados e registos

Cartório
type: Concept
in scheme: Tesauro SIPA
preferred label: Register office @en
preferred label: Notaire @fr
preferred label: Notaio @it
broader: Compartimentos e espaços genéricos de recolha, de produção e de processamento de dados e registos

Escritório
type: Concept
in scheme: Tesauro SIPA
preferred label: Ufficio @it
preferred label: Office @en
preferred label: Bureau @fr
broader: Compartimentos e espaços genéricos de recolha, de produção e de processamento de dados e registos
narrower: Escritório de contabilidade

Escritório de contabilidade
type: Concept
in scheme: Tesauro SIPA
preferred label: Acountancy office @en
preferred label: Bureau de la comptabilité @fr
preferred label: Ufficio contabilità @it
broader: Escritório

Gabinete
type: Concept
in scheme: Tesauro SIPA
preferred label: Office @en
preferred label: Bureau @fr
preferred label: Ufficio (Gabinetto) @it
broader: Compartimentos e espaços genéricos de recolha, de produção e de processamento de dados e registos
narrower: Gabinete administrativo
narrower: Gabinete de investigação

Gabinete administrativo
type: Concept
in scheme: Tesauro SIPA
preferred label: Administrative ofice @en
preferred label: Bureau administratif @fr
preferred label: Ufficio amministrativo @it
broader: Gabinete

Gabinete de investigação
type: Concept
in scheme: Tesauro SIPA
preferred label: Research office @en
preferred label: Bureau de recherche @fr
preferred label: Ufficio ricerca @it
broader: Gabinete

Sala de imprensa
type: Concept
in scheme: Tesauro SIPA
preferred label: Press room @en
preferred label: Salle de presse @fr
preferred label: Sala stampa @it
broader: Compartimentos e espaços genéricos de recolha, de produção e de processamento de dados e registos

Sala de registo
type: Concept
in scheme: Tesauro SIPA
preferred label: Registration room @en
preferred label: Salle d'inscription @fr
preferred label: Sala di registrazione @it
broader: Compartimentos e espaços genéricos de recolha, de produção e de processamento de dados e registos

Secretaria
type: Concept
in scheme: Tesauro SIPA
preferred label: Secretary @en
preferred label: Secrétariat @fr
preferred label: Segreteria @it
broader: Compartimentos e espaços genéricos de recolha, de produção e de processamento de dados e registos

Tesouraria
type: Concept
in scheme: Tesauro SIPA
preferred label: Treasury @en
preferred label: Trésorerie @fr
preferred label: Tesoreria @it
broader: Compartimentos e espaços genéricos de recolha, de produção e de processamento de dados e registos

Tribuna de imprensa
type: Concept
in scheme: Tesauro SIPA
preferred label: Press box @en
preferred label: Tribuna stampa @it
preferred label: Tribune de presse @fr
broader: Compartimentos e espaços genéricos de recolha, de produção e de processamento de dados e registos

Compartimentos e espaços genéricos de refeição e bebida
type: Concept
in scheme: Tesauro SIPA
preferred label: Dining and drinking compartments and spaces (Generic compartments and spaces) @en
preferred label: Compartiments et espaces pour manger et boire (Compartiments et espaces génériques) @fr
preferred label: Compartimenti e spazi per mangiare e bere (Compartimenti e spazi generici) @it
broader: Compartimentos e espaços genéricos segundo a função
narrower: Compartimentos e espaços genéricos de confeção e preparação
narrower: Compartimentos e espaços genéricos de consumo

Compartimentos e espaços genéricos de confeção e preparação
type: Concept
in scheme: Tesauro SIPA
preferred label: Compartments and generic cooking and preparation spaces @en
preferred label: Compartiments et espaces génériques pour la cuisine et la préparation @fr
preferred label: Locali e spazi generici per la cucina e la preparazione @it
broader: Compartimentos e espaços genéricos de refeição e bebida
narrower: Cozinha

Cozinha
type: Concept
in scheme: Tesauro SIPA
preferred label: Kitchen @en
preferred label: Cuisine @fr
preferred label: Cucina @it
broader: Compartimentos e espaços genéricos de confeção e preparação

Compartimentos e espaços genéricos de consumo
type: Concept
in scheme: Tesauro SIPA
preferred label: Generic consumer compartments and spaces @en
preferred label: Compartiments et espaces génériques pour les consommateurs @fr
preferred label: Compartimenti e spazi generici per i consumatori @it
broader: Compartimentos e espaços genéricos de refeição e bebida
narrower: Refeitório
narrower: Sala de banquetes
narrower: Sala de chá
narrower: Sala de jantar
narrower: Sala de pequeno almoço

Refeitório
type: Concept
scope note: Espaço ou conjunto de espaços destinado ao abastecimento, com os bens de consumo de primeira necessidade e em condições económicas controladas e especialmente favoráveis, dos funcionários de um estabelecimento (prisional, hospitalar, educacional ou outro) de grandes dimensões, característico dos complexos localizados em situação periférica ou isolada.
in scheme: Tesauro SIPA
preferred label: Canteen; Refectory @en
preferred label: Réfectoire @fr
preferred label: Refettorio @it
broader: Compartimentos e espaços genéricos de consumo

Sala de banquetes
type: Concept
in scheme: Tesauro SIPA
preferred label: Banqueting room @en
preferred label: Salle de banquet @fr
preferred label: Sala banchetti @it
broader: Compartimentos e espaços genéricos de consumo

Sala de chá
type: Concept
in scheme: Tesauro SIPA
preferred label: Tea room @en
preferred label: Salon de thé @fr
preferred label: Sala da tè @it
broader: Compartimentos e espaços genéricos de consumo

Sala de jantar
type: Concept
in scheme: Tesauro SIPA
preferred label: Dining room @en
preferred label: Salle à manger @fr
preferred label: Sala da pranzo @it
broader: Compartimentos e espaços genéricos de consumo

Sala de pequeno almoço
type: Concept
in scheme: Tesauro SIPA
preferred label: Breakfast room @en
preferred label: Salle de petit-déjeuner @fr
preferred label: Sala colazione @it
broader: Compartimentos e espaços genéricos de consumo

Compartimentos e espaços genéricos de reunião e assembleia
type: Concept
in scheme: Tesauro SIPA
preferred label: Meeting and assembly rooms and spaces (Generic rooms and spaces) @en
preferred label: Compartiments et espaces de réunion et d'assemblée (Compartiments et espaces génériques) @fr
preferred label: Compartimenti e spazi per riunioni e assemblee (Compartimenti e spazi generici) @it
broader: Compartimentos e espaços genéricos segundo a função
narrower: Sala das sessões
narrower: Sala de conferências
narrower: Sala de despacho
narrower: Sala de reuniões

Sala das sessões
type: Concept
scope note: Num tribunal, sala onde um conjunto de juízes, em conferência privada, debate e delibera sobre matéria processual, como é o caso, por exemplo, das decisões em recurso interpostas por um tribunal hierarquicamente inferior.
in scheme: Tesauro SIPA
preferred label: Debate chamber (Briefing room) @en
preferred label: Salle de session @fr
preferred label: Sala di sessione @it
broader: Compartimentos e espaços genéricos de reunião e assembleia

Sala de conferências
type: Concept
in scheme: Tesauro SIPA
preferred label: Conference room @en
preferred label: Salle de conférence @fr
preferred label: Sala conferenze @it
broader: Compartimentos e espaços genéricos de reunião e assembleia

Sala de despacho
type: Concept
in scheme: Tesauro SIPA
preferred label: Dispatch room @en
preferred label: Salle d'expédition @fr
preferred label: Sala spedizioni @it
broader: Compartimentos e espaços genéricos de reunião e assembleia
narrower: Consistório (Sala de despacho)
narrower: Definitório (Sala de despacho)

Consistório (Sala de despacho)
type: Concept
in scheme: Tesauro SIPA
preferred label: Consistory (Dispatch room) @en
preferred label: Consistoire (Salle d'expédition) @fr
preferred label: Concistoro (Sala spedizioni) @it
broader: Sala de despacho

Definitório (Sala de despacho)
type: Concept
in scheme: Tesauro SIPA
preferred label: Definitory (Dispatch room) @en
preferred label: Définitoire (Salle d'expédition) @fr
broader: Sala de despacho

Sala de reuniões
type: Concept
in scheme: Tesauro SIPA
preferred label: Meeting room (Briefing) @en
preferred label: Salle de réunion @fr
preferred label: Sala riunioni @it
broader: Compartimentos e espaços genéricos de reunião e assembleia

Compartimentos e espaços genéricos de transação comercial de bens e serviços
type: Concept
in scheme: Tesauro SIPA
preferred label: Compartments and spaces for commercial transaction of goods and services (Generic compartments and spaces) @en
preferred label: Compartiments et espaces pour les transactions commerciales de biens et de services (Compartiments et espaces génériques) @fr
preferred label: Compartimenti e spazi per la transazione commerciale di beni e servizi ( Compartimenti e spazi generici) @it
broader: Compartimentos e espaços genéricos segundo a função
narrower: Bar (Compartimentos e espaços genéricos de transação comercial de bens e serviços)
narrower: Bilheteira
narrower: Cantina (Compartimentos e espaços genéricos de transação comercial de bens e serviços)
narrower: Loja (Compartimento e espaços genéricos de comercialização)

Bar (Compartimentos e espaços genéricos de transação comercial de bens e serviços)
type: Concept
in scheme: Tesauro SIPA
preferred label: Bar (Generic compartments and spaces for commercial transaction of goods and services) @en
preferred label: Bar (Compartiments et espaces génériques pour les transactions commerciales de biens et de services) @fr
preferred label: Bar (Compartimenti e spazi generici per transazioni commerciali di beni e servizi) @it
broader: Compartimentos e espaços genéricos de transação comercial de bens e serviços

Bilheteira
type: Concept
scope note: Compartimento onde se vendem bilhetes para assistência a um espetáculo ou para visitar um edifício ou estrutura patrimonial.
in scheme: Tesauro SIPA
preferred label: Ticket/ Box offfice @en
preferred label: Billetterie @fr
preferred label: Biglietteria @it
broader: Compartimentos e espaços genéricos de transação comercial de bens e serviços

Cantina (Compartimentos e espaços genéricos de transação comercial de bens e serviços)
type: Concept
in scheme: Tesauro SIPA
preferred label: Canteen (Generic compartments and spaces for commercial transaction of goods and services) @en
preferred label: Cantine (Compartiments et espaces génériques pour les transactions commerciales de biens et de services) @fr
preferred label: Mensa (Compartimenti e spazi generici per transazioni commerciali di beni e servizi) @it
broader: Compartimentos e espaços genéricos de transação comercial de bens e serviços

Loja (Compartimento e espaços genéricos de comercialização)
type: Concept
in scheme: Tesauro SIPA
preferred label: Shop (Generic commercial compartments and spaces) @en
preferred label: Magasin (compartiments et espaces commerciaux génériques) @fr
preferred label: Negozio (Compartimenti e spazi commerciali generici) @it
broader: Compartimentos e espaços genéricos de transação comercial de bens e serviços

Compartimentos e espaços genéricos multiusos
type: Concept
in scheme: Tesauro SIPA
preferred label: Multi-purpose compartments and spaces (Compartments and generic spaces) @en
preferred label: Compartiments et espaces polyvalents (Compartiments et espaces généraux) @fr
preferred label: Compartimenti e spazi multifunzionali (Compartimenti e spazi generali) @it
broader: Compartimentos e espaços genéricos segundo a função
narrower: Anfiteatro (Compartimentos e espaços genéricos multiusos)
narrower: Auditório
narrower: Sala de espetáculos
narrower: Sala polivalente
narrower: Salão nobre

Anfiteatro (Compartimentos e espaços genéricos multiusos)
type: Concept
scope note: Sala composta por estrado e arquibancadas destinado a aulas, conferências, etc.
in scheme: Tesauro SIPA
preferred label: Amphitheatre (Multi-purpose compartments and spaces) @en
preferred label: Amphitéâtre )Compartiments et espaces polyvalents) @fr
preferred label: Anfiteatri (Compartimenti e spazi multifunzionali ) @it
broader: Compartimentos e espaços genéricos multiusos

Auditório
type: Concept
scope note: Espaço destinado a apresentação de seminários ou conferências, possuindo uma bancada para assistência.
in scheme: Tesauro SIPA
preferred label: Auditorium @en
broader: Compartimentos e espaços genéricos multiusos

Sala de espetáculos
type: Concept
in scheme: Tesauro SIPA
preferred label: Showroom @en
preferred label: Salle de spectacle @fr
preferred label: Sala da concerto @it
hidden label: Sala de espectáculos
broader: Compartimentos e espaços genéricos multiusos

Sala polivalente
type: Concept
in scheme: Tesauro SIPA
preferred label: Multi-purpose room @en
preferred label: Salle polyvalente @fr
broader: Compartimentos e espaços genéricos multiusos

Salão nobre
type: Concept
in scheme: Tesauro SIPA
preferred label: Noble room @en
preferred label: Grand hall; Grand salon @fr
preferred label: Sala grande; Grande salone @it
broader: Compartimentos e espaços genéricos multiusos

EDIFÍCIOS E ESTRUTURAS
type: Collection
type: ConceptGroup
preferred label: BUILDINGS AND STRUCTURES @en
preferred label: BÂTIMENTS ET STRUCTURES @fr
preferred label: EDIFICI E STRUTTURE @it
member: c 65005b47
member: c 8938e56c
member: c 6c3d5cf2
member: c 107f5517
member: c c603bf52
member: c b5ebd8f2
member: c ff54c1bd
member: c fc6b71c5
member: c 143c29e6
member: c 130718f3
member: c 1d660c6b
member: c f21f3aed
member: c 9e425e7f
member: c 6965cecc
member: c 2957cefa
member: c 4814210d
member: c 26a25a47
member: c 7d26df09
member: c f28c8b8c
member: c e2ec89ca
member: c f8f481fd
member: c 21f90e84
member: c 587e0d5b
member: c 647c05bd
member: c 7833e665
member: c f50f422d
member: c 3069eed5
member: c 6adfae2b
member: c edb82b2a
member: c 37c9b776
member: c fcd3bd73
member: c 02184cc9
member: c db1050a4
member: c ff9f1a1b
member: c 5eeb9f6b
member: c d63c78c3
member: c 77f48c7f
member: c 69b51616
member: c 76dbf16a
member: c ecb4c257
member: c 0e19ae77
member: c 53dad075
member: c b45ac87b
member: c 7520f8dc
member: c a80d7565
member: c 6487de82
member: c caa453ee
member: c ed841dfe
member: c 30c4e629
member: c b08f5212
member: c 87904f6d
member: c a5e90179
member: c 9e414593
member: c 6f962514
member: c 7d249815
member: c 32784ba7
member: c 60351d77
member: c 0ffb25c6
member: c 9e98a501
member: c 2591e320
member: c c07c50f0
member: c e0af181a
member: c eb7e1722
member: c 0f9834bc
member: c b4129a6b
member: c b58ac1e6
member: c 5396cd0b
member: c 8e1c77a2
member: c a20170c3
member: c 551fb991
member: c b0945170
member: c 8c018bdc
member: c 78517d22
member: c 32d7723a

ELEMENTOS ARQUITETÓNICOS
type: Collection
type: ConceptGroup
preferred label: ARCHITECTURAL ELEMENTS @en
preferred label: ÉLÉMENTS ARCHITECTURAUX @fr
preferred label: ELEMENTI ARCHITETTONICI @it
member: Elementos arquitetónicos
member: Componentes genéricos dos elementos arquitetónicos
member: Ático (Componentes genéricos dos elementos arquitetónicos)
member: Cabeira
member: Cimalha
member: Cornija de coroamento
member: Mocheta
member: Empena (Componentes genéricos dos elementos arquitetónicos)
member: Empena em pinhão
member: Empena holandesa
member: Meia-empena
member: Roda-teto
member: Rodapé
member: Elementos arquitetónicos de segurança
member: Burladero
member: Estribo (Elementos arquitetónicos de segurança)
member: Teia (Elementos arquitetónicos de segurança)
member: Trincheira (Elementos arquitetónicos de segurança)
member: Elementos arquitetónicos decorativos
member: Abraço
member: Alfiz
member: Anel
member: Anelete
member: Apófige
member: Anilha
member: Antefixa
member: Arcatura
member: Astrágalo
member: Armila
member: Colarete
member: Banda
member: Banda lombarda
member: Bocel
member: Bocelão
member: Bocelino
member: Canelura
member: Canal (Canelura)
member: Entrecana
member: Cimeira
member: Estria
member: Grimpa
member: Lambrequim (Elementos arquitetónicos decorativos)
member: Painel (Elementos arquitetónicos decorativos)
member: Painel de azulejo
member: Painel de estuque
member: Painel de madeira
member: Painel de talha
member: Painel segundo o tipo
member: Painel composto
member: Painel perfurado
member: Painel simples
member: Pombinhas
member: Elementos arquitetónicos estruturais
member: Elementos arquitetónicos estruturais compostos
member: Abóbada alfeizada
member: Arcada
member: Arcada cega
member: Contra arcada
member: Arcada geminada
member: Arcada lobada
member: Contrapilastra
member: Fundações
member: Componentes das fundações
member: Betão de limpeza
member: Cabouco
member: Dreno
member: Fundações segundo grau de implantação no terreno
member: Fundações isoladas
member: Alicerce
member: Baldrame
member: Cabeçaria
member: Bloco (Fundações isoladas)
member: Sapata
member: Sapata excêntrica

Elementos arquitetónicos
type: Concept
in scheme: Tesauro SIPA
top concept of: Tesauro SIPA
preferred label: Architectural elements @en
preferred label: Éléments architecturaux @fr
preferred label: Elementi architettonici @it
hidden label: Elementos arquitectónicos
narrower: Componentes genéricos dos elementos arquitetónicos
narrower: Elementos arquitetónicos de segurança
narrower: Elementos arquitetónicos decorativos
narrower: Elementos arquitetónicos estruturais
narrower: Elementos arquitetónicos estruturantes
related: Atributos e propriedades
related: Compartimentos e espaços
related: Materiais e produtos
related: Objetos, Equipamentos, Mobiliário e Veículos
related: c 65005b47
modified: 2025-09-23T13:36:26

Componentes genéricos dos elementos arquitetónicos
type: Concept
in scheme: Tesauro SIPA
preferred label: Generic components of architectural elements @en
preferred label: Composants génériques des éléments architecturaux @fr
preferred label: Componenti generici di elementi architettonici @it
hidden label: Componentes genéricos dos elementos arquitectónicos
broader: Elementos arquitetónicos
narrower: Ático (Componentes genéricos dos elementos arquitetónicos)
narrower: Cabeira
narrower: Cimalha
narrower: Cornija de coroamento
narrower: Empena (Componentes genéricos dos elementos arquitetónicos)
narrower: Roda-teto
narrower: Rodapé

Ático (Componentes genéricos dos elementos arquitetónicos)
type: Concept
scope note: Remate da fachada de um edifício, englobando todos os elementos que evoluem sobre o entablamento.
in scheme: Tesauro SIPA
preferred label: Attic (Generic components of architectural elements) @en
preferred label: Attique (Composants génériques des éléments architecturaux) @fr
preferred label: Attico (Componenti generici di elementi architettonici) @it
broader: Componentes genéricos dos elementos arquitetónicos

Cabeira
type: Concept
scope note: Tábua estreita que remata um rodapé ou o forro do teto.
in scheme: Tesauro SIPA
preferred label: End moulding on ceiling panels @en
broader: Componentes genéricos dos elementos arquitetónicos

Cimalha
type: Concept
scope note: Moldura saliente que remata superiormente a fachada de um edifício, ocultando o telhado e impedindo a escorrência das águas pluviais.
in scheme: Tesauro SIPA
preferred label: Cyma; Eave @en
preferred label: Avant-toit @fr
preferred label: Gronda @it
broader: Componentes genéricos dos elementos arquitetónicos

Cornija de coroamento
type: Concept
scope note: Cornija que remata a fachada de um edifício.
in scheme: Tesauro SIPA
preferred label: Cornice @en
broader: Componentes genéricos dos elementos arquitetónicos
narrower: Mocheta

Mocheta
type: Concept
scope note: Aresta saliente na parte superior de uma cornija de coroamento, para evitar que as águas pluviais escorram pelo muro.
in scheme: Tesauro SIPA
preferred label: Fillet; Listel @en
broader: Cornija de coroamento

Empena (Componentes genéricos dos elementos arquitetónicos)
type: Concept
scope note: Tipo de remate agudo da fachada de um edifício.
in scheme: Tesauro SIPA
preferred label: Gable-end (Generic components of architectural elements) @en
preferred label: Pignon (Composants génériques des éléments architecturaux) @fr
preferred label: Pignone (Componenti generici di elementi architettonici) @it
alternative label: Hastial
broader: Componentes genéricos dos elementos arquitetónicos
narrower: Empena em pinhão
narrower: Empena holandesa
narrower: Meia-empena

Empena em pinhão
type: Concept
in scheme: Tesauro SIPA
preferred label: Crow-stepped gable @en
broader: Empena (Componentes genéricos dos elementos arquitetónicos)

Empena holandesa
type: Concept
in scheme: Tesauro SIPA
preferred label: Dutch gable @en
broader: Empena (Componentes genéricos dos elementos arquitetónicos)

Meia-empena
type: Concept
scope note: Fachada de um edifício com o corpo encostado a outro volume, rematado por um segmento de reta, criando metade de uma empena.
in scheme: Tesauro SIPA
preferred label: Half gable @en
broader: Empena (Componentes genéricos dos elementos arquitetónicos)

Roda-teto
type: Concept
in scheme: Tesauro SIPA
preferred label: Crown modeling @en
broader: Componentes genéricos dos elementos arquitetónicos

Rodapé
type: Concept
scope note: Elemento ou faixa de proteção nas paredes interiores de um edifício, geralmente em madeira, pedra ou tijoleira, que corre junto ao soalho, para proteção da zona inferior da parede contra choques ou humidade.
in scheme: Tesauro SIPA
preferred label: Chair-rail; Foot panel @en
preferred label: Plinthe; Soubassement @fr
preferred label: Zoccolo @it
broader: Componentes genéricos dos elementos arquitetónicos

Elementos arquitetónicos de segurança
type: Concept
in scheme: Tesauro SIPA
preferred label: Safety architectural elements and their elements @en
preferred label: Éléments architecturaux de sécurité et leurs composants @fr
preferred label: Elementi di sicurezza architettonici e loro componenti @it
hidden label: Elementos arquitectónicos de segurança
broader: Elementos arquitetónicos
narrower: Burladero
narrower: Estribo (Elementos arquitetónicos de segurança)
narrower: Teia (Elementos arquitetónicos de segurança)
narrower: Trincheira (Elementos arquitetónicos de segurança)

Burladero
type: Concept
scope note: Segmento de cerca, situado em frente a interrupções na barreira como um refúgio do toureiro e constituindo uma área de circulação entre a barreira e a arena.
in scheme: Tesauro SIPA
broader: Elementos arquitetónicos de segurança

Estribo (Elementos arquitetónicos de segurança)
type: Concept
in scheme: Tesauro SIPA
preferred label: Running board (Security architectural elements) @en
broader: Elementos arquitetónicos de segurança

Teia (Elementos arquitetónicos de segurança)
type: Concept
in scheme: Tesauro SIPA
preferred label: Safety web (Security architectural elements) @en
broader: Elementos arquitetónicos de segurança

Trincheira (Elementos arquitetónicos de segurança)
type: Concept
in scheme: Tesauro SIPA
preferred label: Trench (Security architectural elements @en
broader: Elementos arquitetónicos de segurança

Elementos arquitetónicos decorativos
type: Concept
in scheme: Tesauro SIPA
preferred label: Decorative architectural elements @en
preferred label: Éléments architecturaux décoratifs @fr
preferred label: Elementi architettonici decorativi @it
hidden label: Elementos arquitectónicos decorativos
broader: Elementos arquitetónicos
narrower: Abraço
narrower: Alfiz
narrower: Anel
narrower: Anilha
narrower: Antefixa
narrower: Arcatura
narrower: Astrágalo
narrower: Banda
narrower: Bocel
narrower: Canelura
narrower: Cimeira
narrower: Estria
narrower: Grimpa
narrower: Lambrequim (Elementos arquitetónicos decorativos)
narrower: Painel (Elementos arquitetónicos decorativos)
narrower: Pombinhas

Abraço
type: Concept
scope note: Elemento decorativo colocado em torno de uma coluna.
in scheme: Tesauro SIPA
preferred label: Foliage pattern @en
broader: Elementos arquitetónicos decorativos

Alfiz
type: Concept
scope note: Elemento retangular que forma ressalto, servindo de moldura superior a um portal ou arcossólio, podendo assumir profusa decoração.
in scheme: Tesauro SIPA
broader: Elementos arquitetónicos decorativos

Anel
type: Concept
scope note: Tipo de elemento decorativo, em forma de aro, disposto em volta do fuste de uma coluna.
in scheme: Tesauro SIPA
preferred label: Annulet @en
broader: Elementos arquitetónicos decorativos
narrower: Anelete
narrower: Apófige

Anelete
type: Concept
scope note: Moldura em forma de anel, que liga o fuste ao capitel nas ordens arquitetónicas clássicas.
in scheme: Tesauro SIPA
preferred label: Annulet @en
alternative label: Colarete
alternative label: Manilha
broader: Anel

Apófige
type: Concept
scope note: Elemento decorativo metálico colocado em torno de uma coluna.
in scheme: Tesauro SIPA
preferred label: Apophyge @en
broader: Anel

Anilha
type: Concept
in scheme: Tesauro SIPA
preferred label: Ring @en
broader: Elementos arquitetónicos decorativos

Antefixa
type: Concept
scope note: Telha ornamentada de uma beirada ou na cumeeira. Nalguns casos, ela destaca-se das beiradas e tem ornamentação esculpida.
in scheme: Tesauro SIPA
preferred label: Antefix @en
preferred label: Antéfixe @fr
preferred label: Antefissa @it
broader: Elementos arquitetónicos decorativos

Arcatura
type: Concept
scope note: Elemento arquitetónico constituído por uma sucessão de pequenos arcos, cegos ou não, aplicados em cornijas, parapeitos de janela, socos, cornijas, etc.
in scheme: Tesauro SIPA
preferred label: Arcature @en
preferred label: Arcata @it
broader: Elementos arquitetónicos decorativos

Astrágalo
type: Concept
scope note: Moldura que separa o fuste do capitel numa coluna.
in scheme: Tesauro SIPA
preferred label: Astragal @en
preferred label: Astragale @fr
preferred label: Astragalo @it
alternative label: Conorino
broader: Elementos arquitetónicos decorativos
narrower: Armila
narrower: Colarete

Armila
type: Concept
scope note: Moldura circular na base de um capitel dórico.
in scheme: Tesauro SIPA
preferred label: Annulet; Armill @en
alternative label: Armela
broader: Astrágalo

Colarete
type: Concept
scope note: Astrágalo decorado por pérolas ou óvulos.
in scheme: Tesauro SIPA
preferred label: Frill @en
broader: Astrágalo

Banda
type: Concept
scope note: Tipo de moldura horizontal estreita, arquitetónica ou pintada, no primeiro caso, algo saliente.
in scheme: Tesauro SIPA
preferred label: Band; Strip @en
broader: Elementos arquitetónicos decorativos
narrower: Banda lombarda

Banda lombarda
type: Concept
scope note: Arcada cega formada por duas bandas dispostas verticalmente, ligadas por um arco, muito utilizada como elemento de remate no topo das fachadas ou marcando um friso ou cornija.
in scheme: Tesauro SIPA
preferred label: Lombard band @en
broader: Banda

Bocel
type: Concept
scope note: Elemento decorativo, de perfil convexo, colocado na base de uma coluna.
in scheme: Tesauro SIPA
preferred label: Torus; Tore @en
broader: Elementos arquitetónicos decorativos
narrower: Bocelão
narrower: Bocelino

Bocelão
type: Concept
scope note: Tipo de bocel muito grosso.
in scheme: Tesauro SIPA
preferred label: Large torus @en
broader: Bocel

Bocelino
type: Concept
scope note: Tipo de bocel muito estreito, que liga o fuste ao capitel da coluna.
in scheme: Tesauro SIPA
preferred label: Thinnest part of a column @en
broader: Bocel

Canelura
type: Concept
scope note: Moldura côncava vertical ou helicoidal que percorre um fuste de coluna ou de pilastra.
in scheme: Tesauro SIPA
preferred label: Fluting; Groove @en
preferred label: Cannelure @fr
preferred label: Scanalatura @it
broader: Elementos arquitetónicos decorativos
narrower: Canal (Canelura)
narrower: Entrecana

Canal (Canelura)
type: Concept
scope note: Cada uma das caneluras do tríglifo ou de uma coluna nas ordens arquitetónicas clássicas.
in scheme: Tesauro SIPA
preferred label: Flute (Fluting) @en
broader: Canelura

Entrecana
type: Concept
scope note: Superfície entre cada uma das caneluras do fuste de uma coluna.
in scheme: Tesauro SIPA
preferred label: Fillet between flutes @en
alternative label: Contracana
alternative label: Contracanal
alternative label: Listel
broader: Canelura

Cimeira
type: Concept
in scheme: Tesauro SIPA
preferred label: Crest; Ridge @en
alternative label: Crista
alternative label: Fastígio
alternative label: Metas
broader: Elementos arquitetónicos decorativos

Estria
type: Concept
scope note: Decoração feita por sulcos abertos paralelamente numa superfície.
in scheme: Tesauro SIPA
preferred label: Stria @en
broader: Elementos arquitetónicos decorativos

Grimpa
type: Concept
scope note: Elemento que remata um edifício.
in scheme: Tesauro SIPA
preferred label: Summit; Crest @en
broader: Elementos arquitetónicos decorativos

Lambrequim (Elementos arquitetónicos decorativos)
type: Concept
scope note: Tipo de elemento decorativo e recortado que percorre as beiradas do telhado, executado em metal ou madeira, com o intuito de esconder as goteiras.
in scheme: Tesauro SIPA
preferred label: Lambrequin (Decorative architectural elements) @en
preferred label: Lambrequin (Éléments architecturaux décoratifs) @fr
preferred label: Cimiero (Elementi architettonici decorativi) @it
broader: Elementos arquitetónicos decorativos

Painel (Elementos arquitetónicos decorativos)
type: Concept
scope note: Superfície fechada por uma moldura.
in scheme: Tesauro SIPA
preferred label: Panel (Decorative architectural elements) @en
preferred label: Panneau (Éléments architecturaux décoratifs) @fr
preferred label: Pannello (Elementi architettonici decorativi) @it
broader: Elementos arquitetónicos decorativos
narrower: Painel de azulejo
narrower: Painel de estuque
narrower: Painel de madeira
narrower: Painel segundo o tipo

Painel de azulejo
type: Concept
scope note: Conjunto de azulejos formando uma composição ornamental ou figurativa-narrativa. Pode ou não ser delimitado por barra, cercadura, friso ou outro tipo de guarnição. Pode estar integrado num revestimento de azulejos de padrão ou ser aplicado independentemente numa superfície mural.
in scheme: Tesauro SIPA
preferred label: Tile panel @en
preferred label: Panneau de carreaux @fr
preferred label: Pannello di maioliche @it
broader: Painel (Elementos arquitetónicos decorativos)

Painel de estuque
type: Concept
scope note: Superfície de estuque fechada por uma moldura.
in scheme: Tesauro SIPA
preferred label: Stucco panel @en
preferred label: Panneau en stuc @fr
preferred label: Pannello in stucco @it
broader: Painel (Elementos arquitetónicos decorativos)

Painel de madeira
type: Concept
scope note: Superfície de madeira fechada por uma moldura.
in scheme: Tesauro SIPA
preferred label: Wooden panel @en
preferred label: Panneau en bois @fr
preferred label: Pannello in legno @it
broader: Painel (Elementos arquitetónicos decorativos)
narrower: Painel de talha

Painel de talha
type: Concept
scope note: Superfície entalhada fechada por uma moldura.
in scheme: Tesauro SIPA
preferred label: Carved wood panel @en
preferred label: Panneau sculpté en bois @fr
preferred label: Pannello intagliato @it
broader: Painel de madeira

Painel segundo o tipo
type: Concept
in scheme: Tesauro SIPA
preferred label: Panel by type @en
preferred label: Panneau selon le type @fr
preferred label: Pannello per tipologia @it
broader: Painel (Elementos arquitetónicos decorativos)
narrower: Painel composto
narrower: Painel perfurado
narrower: Painel simples

Painel composto
type: Concept
in scheme: Tesauro SIPA
preferred label: Composite panel @en
preferred label: Panneau composite @fr
preferred label: Pannello composito @it
broader: Painel segundo o tipo

Painel perfurado
type: Concept
in scheme: Tesauro SIPA
preferred label: Perforated panel @en
preferred label: Panneau perforé @fr
preferred label: Pannello traforato @it
broader: Painel segundo o tipo

Painel simples
type: Concept
in scheme: Tesauro SIPA
preferred label: Simple panel @en
preferred label: Panneau simple @fr
preferred label: Pannello semplice @it
broader: Painel segundo o tipo

Pombinhas
type: Concept
scope note: Elemento decorativo, normalmente com forma zoomórfica, colocado sobre os telhados ou beiradas.
in scheme: Tesauro SIPA
broader: Elementos arquitetónicos decorativos

Elementos arquitetónicos estruturais
type: Concept
in scheme: Tesauro SIPA
preferred label: Structural architectural elements @en
preferred label: Éléments architecturaux structurels @fr
preferred label: Elementi architettonici strutturali @it
hidden label: Elementos arquitectónicos estruturais
broader: Elementos arquitetónicos
narrower: Elementos arquitetónicos estruturais compostos
narrower: Elementos arquitetónicos estruturais segundo a função
narrower: Elementos arquitetónicos estruturais simples

Elementos arquitetónicos estruturais compostos
type: Concept
in scheme: Tesauro SIPA
preferred label: Composite architectural structural elements @en
preferred label: Éléments architecturaux composites @fr
preferred label: Elementi architettonici strutturali compositi @it
hidden label: Elementos arquitectónicos estruturais compostos
broader: Elementos arquitetónicos estruturais
narrower: Abóbada alfeizada
narrower: Arcada
narrower: Contrapilastra
narrower: Fundações
narrower: Vigamento

Abóbada alfeizada
type: Concept
scope note: Tipo de abóbada que forma uma arcada adossada a um muro, tendo funções estruturais de reforço do muro ou decorativas.
in scheme: Tesauro SIPA
preferred label: Stretched vault @en
broader: Elementos arquitetónicos estruturais compostos

Arcada
type: Concept
scope note: Vão rasgado num muro com a forma de arco e possuindo o respetivo pé-direito. Pode designar um conjunto de arcos que sustenta um teto ou uma abóbada.
in scheme: Tesauro SIPA
preferred label: Arcata @it
preferred label: Arcade; Arched vault @en
preferred label: Arcade @fr
alternative label: Arcadura
alternative label: Arcaria
broader: Elementos arquitetónicos estruturais compostos
narrower: Arcada cega
narrower: Arcada geminada
narrower: Arcada lobada

Arcada cega
type: Concept
scope note: Conjunto de arcos embebidos num muro, permitido o seu reforço e a condução do peso que ele suporta até aos extremos, normalmente escorados por contrafortes.
in scheme: Tesauro SIPA
preferred label: Blind bow @en
alternative label: Arcada falsa
broader: Arcada
narrower: Contra arcada

Contra arcada
type: Concept
scope note: Parede no interior de uma arcada cega, a qual pode ostentar elementos decorativos.
in scheme: Tesauro SIPA
preferred label: Counter-arch @en
broader: Arcada cega

Arcada geminada
type: Concept
scope note: Conjunto de dois arcos semelhantes ou formado por dois semicírculos tangentes de uma arcada.
in scheme: Tesauro SIPA
preferred label: Semi-datached arch @en
broader: Arcada

Arcada lobada
type: Concept
scope note: Arcada formada por uma sucessão de arcos de perfil semicircular.
in scheme: Tesauro SIPA
preferred label: Lobed arch @en
broader: Arcada

Contrapilastra
type: Concept
scope note: Duas pilastras colocadas frente a frente numa galeria ou pórtico.
in scheme: Tesauro SIPA
preferred label: Counter-pilaster; Opposite pilaster @en
broader: Elementos arquitetónicos estruturais compostos

Fundações
type: Concept
scope note: Conjunto de elementos estruturais que estão em contacto ou penetram no solo, em graus distintos de profundidade, com a função de transmitir ao terreno as cargas finais de um edifício ou de uma estrutura (peso próprio, sobrecarga, elementos atmosféricos), assegurando a estabilidade dos mesmos.
in scheme: Tesauro SIPA
preferred label: Foundation @en
preferred label: Fondations @fr
preferred label: Basamento @it
broader: Elementos arquitetónicos estruturais compostos
narrower: Componentes das fundações
narrower: Fundações segundo grau de implantação no terreno

Componentes das fundações
type: Concept
in scheme: Tesauro SIPA
preferred label: Foundation components @en
preferred label: Composants des fondations @fr
preferred label: Componenti del basamento @it
broader: Fundações
narrower: Betão de limpeza
narrower: Cabouco
narrower: Dreno

Betão de limpeza
type: Concept
scope note: Camada fina de betão, de baixa resistência, utilizada para regularizar e proteger a superfície do solo antes da aplicação de betão estrutural ou de fundações.
in scheme: Tesauro SIPA
preferred label: Concrete blinding @en
broader: Componentes das fundações

Cabouco
type: Concept
scope note: Vala aberta no solo, onde assentam os alicerces de um edifício ou de uma estrutura.
in scheme: Tesauro SIPA
preferred label: Ditch; Trench @en
broader: Componentes das fundações

Dreno
type: Concept
in scheme: Tesauro SIPA
preferred label: Drain @en
broader: Componentes das fundações

Fundações segundo grau de implantação no terreno
type: Concept
in scheme: Tesauro SIPA
preferred label: Foundation accoding to degree of implantation in the field @en
preferred label: Fondations selon le degré d’implantation sur le terrain @fr
preferred label: Fondazioni secondo il grado di impianto a terra @it
broader: Fundações
narrower: Fundações isoladas
narrower: Fundações profundas
narrower: Fundações superficiais

Fundações isoladas
type: Concept
in scheme: Tesauro SIPA
preferred label: Isolated foundations @en
broader: Fundações segundo grau de implantação no terreno
narrower: Alicerce
narrower: Bloco (Fundações isoladas)
narrower: Sapata

Alicerce
type: Concept
scope note: Fiada de pedra ou maciços de alvenaria ou betão enterrados no solo, constituindo um tipo de fundação isolada, que suporta o peso de um único pilar e permite, em conjunto com outros elementos do mesmo tipo, sustentar as paredes de um edifício ou estrutura.
in scheme: Tesauro SIPA
preferred label: Foundation @en
preferred label: Fondement; Soubassement @fr
preferred label: Fondamenta; Base @it
broader: Fundações isoladas
narrower: Baldrame
narrower: Cabeçaria

Baldrame
type: Concept
scope note: Alicerce executado em alvenaria.
in scheme: Tesauro SIPA
preferred label: Foundation; Basement @en
alternative label: Massame
broader: Alicerce

Cabeçaria
type: Concept
scope note: Pedras pouco afeiçoadas, empregues na construção da base de muros em alvenaria.
in scheme: Tesauro SIPA
preferred label: Header @en
broader: Alicerce

Bloco (Fundações isoladas)
type: Concept
scope note: Tipo de fundação que suporta apenas a carga de um elemento ou pilar.
in scheme: Tesauro SIPA
preferred label: Block (Isolated foundations) @en
broader: Fundações isoladas

Sapata
type: Concept
scope note: Maciços, normalmente de alvenaria de pedra ou de betão armado, enterrados no solo, sobre os quais assentam os pilares. São usadas apenas em solos com razoável capacidade de suporte.
in scheme: Tesauro SIPA
preferred label: Overspan; Bracket @en
preferred label: Sabot @fr
preferred label: Pianella @it
broader: Fundações isoladas
narrower: Sapata excêntrica

Sapata excêntrica
type: Concept
scope note: Tipo de sapata, em que as cargas do elemento ou pilar que sustenta não passam pelo seu centro, podendo surgir na face, no ângulo ou em qualquer ponto da mesma.
in scheme: Tesauro SIPA
preferred label: Eccentric overspan @en
broader: Sapata

Fundações profundas
type: Concept
in scheme: Tesauro SIPA
preferred label: Deep foundation @en
preferred label: Fondations profondes @fr
preferred label: Fondazioni profonde @it
broader: Fundações segundo grau de implantação no terreno
narrower: Estaca
narrower: Pegão (Fundações profundas)

Estaca
type: Concept
scope note: Elementos que constituem a base estrutural de uma construção, constituída por elementos cravados no solo, de madeira, metal ou betão. Este sistema é sobretudo utilizado em terrenos de comportamento instável, em que é necessário atingir o solo.
in scheme: Tesauro SIPA
preferred label: Pile @en
preferred label: Pieu @fr
preferred label: Palo; Paletto @it
broader: Fundações profundas
narrower: Estaca de fricção
narrower: Microestaca
narrower: Piloti (Estaca)

Estaca de fricção
type: Concept
scope note: Tipo de estaca utilizada para transmitir cargas ao solo através do atrito entre a sua superfície e o terreno circundante.
in scheme: Tesauro SIPA
preferred label: Shell pile @en
broader: Estaca

Microestaca
type: Concept
scope note: Método de consolidação estrutural utilizado em terrenos de constituição argilosa, que consiste na perfuração do terreno com pequenas estacas metálicas ou em betão, funcionando como ancoragem ou reforço das fundações de uma construção.
in scheme: Tesauro SIPA
preferred label: Micropile @en
broader: Estaca

Piloti (Estaca)
type: Concept
in scheme: Tesauro SIPA
preferred label: Stilts (Pile) @en
broader: Estaca

Pegão (Fundações profundas)
type: Concept
scope note: Tipo de fundação isolada e profunda, de forma cilíndrica ou prismática, com a base simples ou alargada (em pata de elefante), executada em betão e destinada a conduzir as cargas de um edifício até ao solo firme, a grande profundidade.
in scheme: Tesauro SIPA
preferred label: Foundation pit (Deep foundation) @en
alternative label: Poço de fundação
broader: Fundações profundas

Fundações superficiais
type: Concept
in scheme: Tesauro SIPA
preferred label: Shallow foundation @en
broader: Fundações segundo grau de implantação no terreno
narrower: Fundações corridas

Fundações corridas
type: Concept
in scheme: Tesauro SIPA
preferred label: Overspan; Console bracket @en
broader: Fundações superficiais
narrower: Enroncamento
narrower: Fundação em laje

Enroncamento
type: Concept
scope note: Conjunto de pedras soltas que servem de alicerce a construções hidráulicas.
in scheme: Tesauro SIPA
preferred label: Stonepitching; Riprap @en
broader: Fundações corridas

Fundação em laje
type: Concept
scope note: Tipo de fundação superficial e corrida, em forma de laje, permitindo suportar as cargas de todos os pilares ou paredes de um edifício ou estrutura. É utilizada em terrenos pouco coesos ou em edifícios de altura diminuta.
in scheme: Tesauro SIPA
preferred label: Slab foundation @en
broader: Fundações corridas

Vigamento
type: Concept
in scheme: Tesauro SIPA
preferred label: Framework; Timbering @en
alternative label: Calcanheira
alternative label: Madeiramento
alternative label: Travação
alternative label: Travejamento
broader: Elementos arquitetónicos estruturais compostos
narrower: Componentes do vigamento
narrower: Vigamento segundo o contexto

Componentes do vigamento
type: Concept
in scheme: Tesauro SIPA
preferred label: Beam framework components @en
preferred label: Composants du système de poutres @fr
preferred label: Componenti della travatura @it
broader: Vigamento
narrower: Espera (Vigamento)
narrower: Lacunário
narrower: Viga

Espera (Vigamento)
type: Concept
in scheme: Tesauro SIPA
preferred label: Rafter (Framework) @en
broader: Componentes do vigamento

Lacunário
type: Concept
scope note: Espaço entre duas vigas.
in scheme: Tesauro SIPA
preferred label: Lacunar; Sunken panel @en
broader: Componentes do vigamento

Viga
type: Concept
scope note: Elemento estrutural, predominantemente horizontal, de madeira, ferro ou cabo metálico que une dois elementos arquitetónicos paralelos (muros, impostas, entregas de asna, etc.), funcionado ao longo do eixo de uma parede, unindo os cunhais, ou transversalmente ao longo do edifício, mantendo o afastamento e o aprumo dos paramentos. Possuem uma função estrutural ao manterem a coesão das paredes e da estrutura da cobertura, através da compressão a que estão sujeitas pelos pratos ou âncoras de amarramento visíveis, em geral, nas fachadas.
in scheme: Tesauro SIPA
preferred label: Beam @en
preferred label: Poutre @fr
preferred label: Trave @it
alternative label: Perna
broader: Componentes do vigamento
narrower: Viga de canto e de travação
narrower: Viga mestra
narrower: Vigota

Viga de canto e de travação
type: Concept
in scheme: Tesauro SIPA
preferred label: Fastening corner beam @en
broader: Viga
narrower: Caibro
narrower: Contrafeito
narrower: Escora
narrower: Laroz
narrower: Vara (Viga)

Caibro
type: Concept
scope note: Viga que recebe as ripas, onde assentam as telhas.
in scheme: Tesauro SIPA
preferred label: Rafter; Roof timber @en
broader: Viga de canto e de travação

Contrafeito
type: Concept
scope note: Viga no remate dos caibros para suavizar a inclinação do telhado sobre a sanca.
in scheme: Tesauro SIPA
preferred label: Roof beam @en
broader: Viga de canto e de travação

Escora
type: Concept
scope note: Viga secundária que une, reforçando-as, duas vigas principais, podendo ser retilínea ou em segmento de arco.
in scheme: Tesauro SIPA
preferred label: Shore; Prop @en
preferred label: Sabot d 'arrêt @fr
preferred label: Puntello (Sostegno) @it
alternative label: Contrafileira
alternative label: Espeque (Viga)
alternative label: Estronca
alternative label: Forçura
broader: Viga de canto e de travação
narrower: Esbirro

Esbirro
type: Concept
scope note: Escora vertical que sustenta um vigamento.
in scheme: Tesauro SIPA
preferred label: Prop; Shore; Wooden support @en
broader: Escora

Laroz
type: Concept
scope note: Viga que une perpendicularmente a cumeeira ao frechal, utilizada em pequenas coberturas.
in scheme: Tesauro SIPA
preferred label: Jack rafter @en
broader: Viga de canto e de travação

Vara (Viga)
type: Concept
scope note: Cada uma das vigas que constitui o plano inclinado de uma cobertura e que serve de sustentação às ripas.
in scheme: Tesauro SIPA
preferred label: Rod; Pole (Beam) @en
broader: Viga de canto e de travação

Viga mestra
type: Concept
scope note: Viga principal que sustenta todas as outras vigas, podendo surgir, numa cobertura, várias vigas com esta função.
in scheme: Tesauro SIPA
preferred label: Main beam @en
preferred label: Poutre principale @fr
preferred label: Trave incrociata @it
alternative label: Carreira
broader: Viga
narrower: Asna
narrower: Cumeeira (Viga mestra)
narrower: Linha de asna

Asna
type: Concept
scope note: Cada um dos elementos principais e em disposição inclinada, que suportam a cobertura do telhado num vigamento de asnas. Uma asna está sujeita a dois tipos de esforços, trabalhando à tração, como suporte da cobertura e à compressão, através das entregas nas paredes, revelando-se autoportante como elemento isolado.
in scheme: Tesauro SIPA
preferred label: Roof truss @en
alternative label: Chaveirão
alternative label: Tesoura
broader: Viga mestra

Cumeeira (Viga mestra)
type: Concept
scope note: Elemento estrutural de uma cobertura, na forma de trave ou barrote de madeira que define o topo da estrutura da cobertura, ao longo do qual assentam os barrotes e rincões.
in scheme: Tesauro SIPA
preferred label: Ridge (Main beam) @en
preferred label: Faite; Faitage (Poutre principale) @fr
preferred label: Cima (Trave incrociata) @it
broader: Viga mestra

Linha de asna
type: Concept
scope note: Viga horizontal que suporta, no vértice inferior, a cobertura do telhado.
in scheme: Tesauro SIPA
preferred label: Roof truss line @en
broader: Viga mestra

Vigota
type: Concept
scope note: Pequena viga.
in scheme: Tesauro SIPA
preferred label: Small beam @en
broader: Viga

Vigamento segundo o contexto
type: Concept
in scheme: Tesauro SIPA
preferred label: Beam system according to context @en
preferred label: Système de poutres selon le contexte @fr
preferred label: Sistema di travi secondo il contesto @it
broader: Vigamento
narrower: Vigamento de coberturas
narrower: Vigamento de fundações
narrower: Vigamento de paredes
narrower: Vigamento de pavimentos

Vigamento de coberturas
type: Concept
scope note: Armação de vigas dispostas segundo uma malha articulada, que sustenta a cobertura do telhado, uma fundação, parede ou pavimento, executada em madeira, betão armado ou tijolo, suportando uma carga que faz trabalhar cada um dos elementos à flexão.
in scheme: Tesauro SIPA
preferred label: Roof framework @en
broader: Vigamento segundo o contexto
narrower: Estrutura de barrote
narrower: Pausagem
narrower: Vigamento de asnas
narrower: Vigamento de cavalete
narrower: Vigamento de escoras em arco

Estrutura de barrote
type: Concept
in scheme: Tesauro SIPA
preferred label: Joist framework @en
broader: Vigamento de coberturas

Pausagem
type: Concept
scope note: Tipo de vigamento de coberturas, em que as vigas são colocadas de forma muito espaçada.
in scheme: Tesauro SIPA
preferred label: Wooden framework with pauses @en
broader: Vigamento de coberturas

Vigamento de asnas
type: Concept
scope note: Tipo mais simples de vigamento de cobertura, de madeira, metal ou betão, constituído, em cada módulo, por três elementos dispostos em forma de triângulo, composto pelas asnas, que se unem inferiormente pela linha de asna, sustentado por viga central, denominada pendural. Como reforço aparecem por vezes escoras unindo a parte de baixo do pendural às pernas.
in scheme: Tesauro SIPA
preferred label: Truss framework @en
broader: Vigamento de coberturas

Vigamento de cavalete
type: Concept
scope note: Tipo de vigamento de cobertura constituído por vigas, que se estruturam a partir de um arco central, permitindo um maior alteamento da estrutura.
in scheme: Tesauro SIPA
preferred label: Easel; Trestle framework @en
broader: Vigamento de coberturas

Vigamento de escoras em arco
type: Concept
scope note: Tipo de vigamento de cobertura constituído por vigas que formam uma malha a partir de um elemento central, de forma quadrangular, que interrompem as asnas.
in scheme: Tesauro SIPA
preferred label: Arch struts framework @en
broader: Vigamento de coberturas

Vigamento de fundações
type: Concept
in scheme: Tesauro SIPA
preferred label: Foundation framework @en
broader: Vigamento segundo o contexto
narrower: Cepo
narrower: Viga de fundação

Cepo
type: Concept
in scheme: Tesauro SIPA
preferred label: Log; Timber block @en
broader: Vigamento de fundações

Viga de fundação
type: Concept
scope note: Elemento construído em vários materiais, atualmente em betão armado, que funcionam como travamentos transversais que ligam várias sapatas, servindo de base de arranque das paredes verticais.
in scheme: Tesauro SIPA
preferred label: Foundation beam @en
broader: Vigamento de fundações

Vigamento de paredes
type: Concept
scope note: Elemento composto por um conjunto de vigas de ferro, unidas entre si, colocado na espessura de um muro para o consolidar.
in scheme: Tesauro SIPA
preferred label: Wall framework @en
broader: Vigamento segundo o contexto
narrower: Aspa
narrower: Encabeira
narrower: Estribo (Vigamento de paredes)
narrower: Prumo (Vigamento de paredes )
narrower: Tábuas costaneiras

Aspa
type: Concept
scope note: Elemento constituído por duas vigas de madeira em X (aspa), que servem para travar os elementos verticais colocados entre elas.
in scheme: Tesauro SIPA
preferred label: St Andrew’s cross @en
broader: Vigamento de paredes

Encabeira
type: Concept
scope note: Elemento de madeira que serve como base para o encaixe de outras tábuas no vigamento de paredes.
in scheme: Tesauro SIPA
preferred label: Header @en
broader: Vigamento de paredes

Estribo (Vigamento de paredes)
type: Concept
in scheme: Tesauro SIPA
preferred label: Stirrup (Wall framework) @en
broader: Vigamento de paredes

Prumo (Vigamento de paredes )
type: Concept
scope note: Trave vertical, colocada no centro da estrutura de um tabique.
in scheme: Tesauro SIPA
preferred label: Plomb bob (Wall framework) @en
broader: Vigamento de paredes

Tábuas costaneiras
type: Concept
in scheme: Tesauro SIPA
preferred label: Flitches @en
broader: Vigamento de paredes

Vigamento de pavimentos
type: Concept
in scheme: Tesauro SIPA
preferred label: Floor framework @en
broader: Vigamento segundo o contexto
narrower: Boneca (Vigamento de pavimentos - componentes)

Boneca (Vigamento de pavimentos - componentes)
type: Concept
in scheme: Tesauro SIPA
preferred label: Prop; Stay (Floor framework - components) @en
alternative label: Pontalete
broader: Vigamento de pavimentos

Elementos arquitetónicos estruturais segundo a função
type: Concept
in scheme: Tesauro SIPA
preferred label: Structural architectural elements according to function @en
preferred label: Éléments architecturaux structurels selon la fonction @fr
preferred label: Elementi architettonici strutturali secondo la funzione @it
hidden label: Elementos arquitectónicos estruturais segundo a função
broader: Elementos arquitetónicos estruturais
narrower: Elementos arquitetónicos estruturais de compartimentação específicos
narrower: Elementos arquitetónicos estruturais de compartimentação genéricos

Elementos arquitetónicos estruturais de compartimentação específicos
type: Concept
in scheme: Tesauro SIPA
preferred label: Specific structural architectural partitioning elements @en
preferred label: Éléments architecturaux structurels spécifiques de compartimentage @fr
preferred label: Elementi architettonici strutturali specifici di compartimentazione @it
hidden label: Elementos arquitectónicos estruturais de compartimentação específicos
broader: Elementos arquitetónicos estruturais segundo a função
narrower: Cobertura (Elementos arquitetónicos estruturais)
narrower: Parede e muro
narrower: Pavimento
narrower: Piso (Elementos arquitetónicos estruturais de compartimentação)

Cobertura (Elementos arquitetónicos estruturais)
type: Concept
scope note: Estrutura que fecha, superiormente, um edifício, uma estrutura construída ou um espaço, composta por elementos de suporte e respetivo revestimento, com duas funções essenciais: a proteção geral da construção contra as intempéries, em particular das águas pluviais e a coesão estrutural como meio de ligação horizontal das paredes. As coberturas podem tomar formas e tipos construtivos variados de acordo com as exigências geográficas (utilização de terraços em zonas de clima quentes), climatéricas (telhados de águas inclinadas em zonas de forte pluviosidade ou neve) ou arquitetónicas (domos ou coruchéus) sendo importante ter em atenção alguns fatores que tornam particular a zona da cobertura. Devido à função de proteger da ação direta dos agentes atmosféricos a cobertura engloba geralmente sistemas de captação e drenagem das águas pluviais.
in scheme: Tesauro SIPA
preferred label: Roofing; Roof (Structural architectural elements) @en
preferred label: Toit; Toiture; Couvercle (Éléments architecturaux structurels) @fr
preferred label: Tetto; Copertina (Elementi architettonici strutturali) @it
broader: Elementos arquitetónicos estruturais de compartimentação específicos
narrower: Componentes da cobertura
narrower: Cobertura segundo o tipo

Componentes da cobertura
type: Concept
in scheme: Tesauro SIPA
preferred label: Roof components @en
preferred label: Composants de la couverture @fr
preferred label: Componenti del copertina @it
broader: Cobertura (Elementos arquitetónicos estruturais)
narrower: Componentes de distribuição, drenagem e escoamento de águas
narrower: Componentes de proteção
narrower: Componentes de revestimento

Componentes de distribuição, drenagem e escoamento de águas
type: Concept
in scheme: Tesauro SIPA
preferred label: Water distribution, drainage and runoff components @en
preferred label: Composants de distribution, drainage et évacuation des eaux @fr
preferred label: Componenti di distribuzione, drenaggio e deflusso delle acque @it
broader: Componentes da cobertura
narrower: Algeroz
narrower: Bica
narrower: Gárgula
narrower: Goteira

Algeroz
type: Concept
scope note: Canal que escoa as águas pluviais da cobertura, transportando-a até tubos de queda; é executado em vários materiais.
in scheme: Tesauro SIPA
preferred label: Gutter @en
preferred label: Grondaia @it
preferred label: Cornière; Tuile à onglet @fr
alternative label: Caleira
alternative label: Agueiredo
alternative label: Agueiro
broader: Componentes de distribuição, drenagem e escoamento de águas

Bica
type: Concept
in scheme: Tesauro SIPA
preferred label: Tap @en
preferred label: Tuyau @fr
preferred label: Rubinetto @it
broader: Componentes de distribuição, drenagem e escoamento de águas

Gárgula
type: Concept
scope note: Elemento saliente, executado em pedra ou terracota, contendo um canal de escoamento das águas pluviais provenientes das coberturas, afastando-as das paredes dos edifícios ou estruturas; podem apresentar-se simples ou esculpidas.
in scheme: Tesauro SIPA
preferred label: Gargoyle @en
preferred label: Gargouille @fr
preferred label: Doccione @it
broader: Componentes de distribuição, drenagem e escoamento de águas
narrower: Gárgula de canhão

Gárgula de canhão
type: Concept
scope note: Elemento de escoamento, de forma cilíndrica, ostentando, maioritariamente, elementos decorativos geométricos.
in scheme: Tesauro SIPA
preferred label: Cannon gargoyle @en
broader: Gárgula

Goteira
type: Concept
scope note: Pequeno canal de perfil curvo, aberto no peitoril ou bacia de uma janela de sacada, permitindo o escoamento das águas pluviais.
in scheme: Tesauro SIPA
preferred label: Gutter @en
alternative label: Biqueira
broader: Componentes de distribuição, drenagem e escoamento de águas

Componentes de proteção
type: Concept
in scheme: Tesauro SIPA
preferred label: Protection components (Roof) @en
preferred label: Composants de protection (Couvercle) @fr
preferred label: Componenti di protezione (Copertina) @it
hidden label: Componentes de protecção
broader: Componentes da cobertura
narrower: Aba
narrower: Beirada

Aba
type: Concept
scope note: Elemento que prolonga a cobertura, ultrapassando o alinhamento da fachada, para permitir a queda da água pluvial sem afetar as paredes de um edifício, executado em variadíssimos materiais (cerâmica, madeira, betão, metal...).
in scheme: Tesauro SIPA
preferred label: Overhang; Leave @en
broader: Componentes de proteção
narrower: Aba corrida
narrower: Abeta

Aba corrida
type: Concept
scope note: Elemento que prolonga a cobertura, percorrendo a totalidade do perímetro do edifício.
in scheme: Tesauro SIPA
preferred label: Serial overhang; Leave @en
broader: Aba

Abeta
type: Concept
scope note: Elemento de pequenas dimensões, que prolonga a cobertura.
in scheme: Tesauro SIPA
preferred label: Little overhang @en
broader: Aba

Beirada
type: Concept
scope note: Última fiada de telha no revestimento de uma cobertura, constituindo, normalmente, a aba, podendo ser simples ou composta, neste último caso, permitindo o reforço da fiada.
in scheme: Tesauro SIPA
preferred label: Eaves (Border) @en
broader: Componentes de proteção
narrower: Beirada dupla
narrower: Beirada tripla

Beirada dupla
type: Concept
scope note: Beirada composta por duas fiadas de telha.
in scheme: Tesauro SIPA
preferred label: Double eaves (border) @en
alternative label: Beirada com sub-beira
broader: Beirada

Beirada tripla
type: Concept
scope note: Beirada composta por três fiadas de telha.
in scheme: Tesauro SIPA
preferred label: Triple eaves (border) @en
alternative label: Beirada com sub-beira dupla
broader: Beirada

Componentes de revestimento
type: Concept
in scheme: Tesauro SIPA
preferred label: Revetting components (Roof) @en
preferred label: Composants du revêtement (Couvercle) @fr
preferred label: Componenti di rivestimento (Copertina) @it
broader: Componentes da cobertura
narrower: Água
narrower: Guarda-pó
narrower: Laje (Cobertura)
narrower: Placa (Componentes de revestimento)
narrower: Telhado

Água
type: Concept
scope note: Cada um dos planos inclinados de uma cobertura em telhado ou de uma cobertura plana, podendo ser em número variado, designado por uma, duas, três… águas e de dimensões variáveis, adaptando-se aos elementos estruturantes da cobertura.
in scheme: Tesauro SIPA
preferred label: Pane; Slope (Roof) @en
broader: Componentes de revestimento
narrower: Água de muro
narrower: Água mestra
narrower: Rincão

Água de muro
type: Concept
scope note: Pequena(s) vertente(s) inclinada(s) sobre uma mansarda, evitando a infiltração de humidade.
in scheme: Tesauro SIPA
preferred label: Wall curtain @en
broader: Água

Água mestra
type: Concept
scope note: Cada uma das vertentes de maiores dimensões, que constituem um telhado.
in scheme: Tesauro SIPA
preferred label: Gable; Rake @en
broader: Água

Rincão
type: Concept
scope note: Cada uma das vertentes de menores dimensões, que constituem um telhado.
in scheme: Tesauro SIPA
preferred label: Valley @en
alternative label: Tacaniça
broader: Água

Guarda-pó
type: Concept
scope note: Forro existente entre as vigas da cobertura e o telhado, que serve para proteger o espaço que cobre.
in scheme: Tesauro SIPA
preferred label: Panelling @en
broader: Componentes de revestimento
narrower: Ripado

Ripado
type: Concept
scope note: Forro executado em madeira ou material vegetal, que, unido, fecha o vigamento, constituindo um guarda-pó.
in scheme: Tesauro SIPA
preferred label: Lath @en
broader: Guarda-pó
narrower: Ripa

Ripa
type: Concept
scope note: Cada um dos elementos de madeira que forma um telhado de ripado.
in scheme: Tesauro SIPA
preferred label: Batten @en
broader: Ripado

Laje (Cobertura)
type: Concept
scope note: Revestimento de uma cobertura plana de um edifício ou estrutura, executado em pedra, monolítica ou aparelhada, ou em betão armado. Pode ser suportado por uma estrutura de vigas ou pelas paredes do edifício ou estrutura.
in scheme: Tesauro SIPA
preferred label: Slab (Roof) @en
broader: Componentes de revestimento
narrower: Chapéu (Laje)

Chapéu (Laje)
type: Concept
scope note: Laje de pedra que cobre a parte superior de uma anta.
in scheme: Tesauro SIPA
preferred label: Vent pipe (Slab) @en
broader: Laje (Cobertura)

Placa (Componentes de revestimento)
type: Concept
scope note: Revestimento plano de uma cobertura em betão armado.
in scheme: Tesauro SIPA
preferred label: Plate; Sheet (Revetting components) @en
broader: Componentes de revestimento

Telhado
type: Concept
scope note: Estrutura que fecha, exteriormente, um edifício, uma estrutura construída ou um espaço, construída em vários materiais, cerâmicos (telha ou azulejo), lousa, cantaria ou laje, madeira, chapa metálica ou matérias perecíveis, de origem vegetal (colmo, estorno e bacejo).
in scheme: Tesauro SIPA
preferred label: Roof @en
preferred label: Toit @fr
preferred label: Tetto @it
broader: Componentes de revestimento
narrower: Cumeeira (Telhado)
narrower: Escama
narrower: Espigão (Telhado)
narrower: Passadeira
narrower: Revessa
narrower: Telha (Telhado)
narrower: Telhão
narrower: Teto

Cumeeira (Telhado)
type: Concept
scope note: Segmento horizontal no topo de um telhado, onde se encontram as águas.
in scheme: Tesauro SIPA
preferred label: Ridge (Roof) @en
alternative label: Cuma
alternative label: Enfesta
alternative label: Lomba
alternative label: Pau de fileira
broader: Telhado

Escama
type: Concept
scope note: Lâmina em forma de escama, executada em madeira, ardósia ou barro, utilizada no revestimento de uma cobertura.
in scheme: Tesauro SIPA
preferred label: Scale @en
broader: Telhado

Espigão (Telhado)
type: Concept
in scheme: Tesauro SIPA
preferred label: Ridge, Hip (Roof) @en
broader: Telhado

Passadeira
type: Concept
scope note: Degrau ou escada que percorre as coberturas, permitindo o acesso aos vários níveis do telhado, executado em alvenaria ou telha.
in scheme: Tesauro SIPA
preferred label: Filter; Strainer @en
broader: Telhado

Revessa
type: Concept
scope note: Linha de intersecção de duas vertentes do telhado, formando um ângulo reentrante.
in scheme: Tesauro SIPA
preferred label: Roof valley @en
broader: Telhado

Telha (Telhado)
type: Concept
scope note: Elemento empregue no revestimento de uma cobertura exterior, de vários materiais, como o vidro ou cerâmica, esta a mais frequente. Podem apresentar-se simples ou decoradas com pinturas ou elementos relevados.
in scheme: Tesauro SIPA
preferred label: Tile (Roof) @en
preferred label: Tuile (Toit) @fr
preferred label: Tegola (Tetto) @it
broader: Telhado

Telhão
type: Concept
scope note: Telha de grandes dimensões, utilizada na feitura do beiral e da cumeeira, podendo ser um telhão normal, um telhão de início, com uma das faces com acabamento cuidado, ou telhão de três ou quatro faces, permitindo formar os ângulos.
in scheme: Tesauro SIPA
preferred label: Pressed tile @en
broader: Telhado

Teto
type: Concept
scope note: Estrutura que fecha interior e superiormente um edifício, uma estrutura construída ou um espaço, composta por elementos de revestimento, executado em vários materiais e assumindo variadíssimas formas.
in scheme: Tesauro SIPA
preferred label: Toit @fr
preferred label: Tetto @it
preferred label: Ceiling @en
alternative label: Cobertura interior
hidden label: Tecto
broader: Telhado
narrower: Componentes do teto
narrower: Teto segundo o tipo

Componentes do teto
type: Concept
in scheme: Tesauro SIPA
preferred label: Ceiling components @en
preferred label: Composants du plafond @fr
preferred label: Componenti del soffitto @it
hidden label: Componentes do tecto
broader: Teto
narrower: Caniço
narrower: Estafe
narrower: Forro
narrower: Painéis de teto
narrower: Placas de teto
narrower: Sanca

Caniço
type: Concept
scope note: Revestimento do teto feito em material vegetal.
in scheme: Tesauro SIPA
preferred label: Reed @en
broader: Componentes do teto

Estafe
type: Concept
scope note: Placas de revestimento do teto, feitas em gesso e pita, aplicados sobre uma estrutura de madeira.
in scheme: Tesauro SIPA
preferred label: Fibrous plaster @en
broader: Componentes do teto
narrower: Fasquia

Fasquia
type: Concept
scope note: Elemento de madeira, comprido, onde se fixam as placas de estafe.
in scheme: Tesauro SIPA
preferred label: Lath @en
broader: Estafe

Forro
type: Concept
scope note: Revestimento de um espaço em madeiramento.
in scheme: Tesauro SIPA
preferred label: Lining; Padding (Ceiling) @en
preferred label: Doublure (Plafond) @fr
preferred label: Rivestimento @it
broader: Componentes do teto
narrower: Forro de esteira simples
narrower: Forro de saia e camisa

Forro de esteira simples
type: Concept
scope note: Forro com a madeira colocada em fiadas paralelas e uniformes.
in scheme: Tesauro SIPA
preferred label: Lettice lining @en
broader: Forro

Forro de saia e camisa
type: Concept
scope note: Forro de madeira, composto por tábuas sobrepostas, dispostas de forma alternada.
in scheme: Tesauro SIPA
preferred label: Overlaid lettice ceiling @en
alternative label: Forro de esteira sobreposta
broader: Forro

Painéis de teto
type: Concept
in scheme: Tesauro SIPA
preferred label: Ceiling pannels @en
hidden label: Painéis de tecto
broader: Componentes do teto
narrower: Caixotão

Caixotão
type: Concept
scope note: Cada um dos painéis retangulares ou quadrados que forram um teto ou abóbada, envolvido por barrotes ou molduras, simples ou ostentando decoração pictórica ou relevada.
in scheme: Tesauro SIPA
preferred label: Cassettone @it
preferred label: Pannel (Caisson) @en
preferred label: Caisson de plafond @fr
alternative label: Artesão
alternative label: Artesa
broader: Painéis de teto

Placas de teto
type: Concept
scope note: Revestimento do teto com placas cerâmicas, sem vidrado.
in scheme: Tesauro SIPA
preferred label: Ceiling boards @en
hidden label: Placas de tecto
broader: Componentes do teto
narrower: Socarrat

Socarrat
type: Concept
in scheme: Tesauro SIPA
preferred label: Socarrat ceramic decorative ceiling @en
broader: Placas de teto

Sanca
type: Concept
scope note: Elemento saliente que permite ligar a parede ao teto, apresentando-se na forma de cornija ou moldura.
in scheme: Tesauro SIPA
preferred label: Cove; Coving @en
broader: Componentes do teto

Teto segundo o tipo
type: Concept
in scheme: Tesauro SIPA
preferred label: Ceiling by type @en
preferred label: Plafond selon le type @fr
preferred label: Soffitto per tipologia @it
hidden label: Tecto segundo o tipo
broader: Teto
narrower: Teto acústico
narrower: Teto apainelado
narrower: Teto corta-fogo
narrower: Teto em alfarge
narrower: Teto em gamela
narrower: Teto em masseira
narrower: Teto em telha vã
narrower: Teto em vigamento
narrower: Teto falso

Teto acústico
type: Concept
scope note: Teto revestido com vários materiais que permitem um isolamento do barulho exterior ou deixar passar o ruído interior para outras dependências. Pode ser isolado por uma placa acústica, perfurada, estuque acústico, extraordinariamente poroso, absorvendo os ruídos, ou uma manta acústica, executada em lã de vidro ou lã mineral.
in scheme: Tesauro SIPA
preferred label: Acoustic ceiling @en
hidden label: Tecto acústico
broader: Teto segundo o tipo
narrower: Painel acústico

Painel acústico
type: Concept
scope note: Dispositivo que permite melhorar a qualidade do som em um ambiente, reduzindo a reverberação e o eco, através da absorção e difusão das ondas sonoras.
in scheme: Tesauro SIPA
preferred label: Acoustic panel @en
preferred label: Panneau acoustique @fr
preferred label: Pannello acustico @it
broader: Teto acústico

Teto apainelado
type: Concept
scope note: Teto formado pela junção de vários painéis, decorados ou não.
in scheme: Tesauro SIPA
preferred label: Panelled ceiling @en
alternative label: Teto artesoado
hidden label: Tecto apainelado
broader: Teto segundo o tipo

Teto corta-fogo
type: Concept
scope note: Elemento horizontal que delimita um espaço, que, pelos seus materiais construtivos, permite isolá-lo em caso de deflagração de incêndio.
in scheme: Tesauro SIPA
preferred label: Firebreak ceiling @en
hidden label: Tecto corta-fogo
broader: Teto segundo o tipo

Teto em alfarge
type: Concept
scope note: Teto ornado por várias molduras cruzadas, formando elementos geométricos ou arabescos, de origem muçulmana e adotado na Península Ibérica durante os séculos XV e XVI, na arte mudéjar.
in scheme: Tesauro SIPA
preferred label: Iberian-style decorative ceiling @en
hidden label: Tecto em alfarge
broader: Teto segundo o tipo
narrower: Ajaraca

Ajaraca
type: Concept
scope note: Cada uma das molduras do teto em alfarje.
in scheme: Tesauro SIPA
preferred label: Spanish ornamental pattern @en
broader: Teto em alfarge

Teto em gamela
type: Concept
in scheme: Tesauro SIPA
preferred label: Gamela mortar ceiling @en
hidden label: Tecto em gamela
broader: Teto segundo o tipo

Teto em masseira
type: Concept
in scheme: Tesauro SIPA
preferred label: Masseira mortar ceiling @en
hidden label: Tecto em masseira
broader: Teto segundo o tipo

Teto em telha vã
type: Concept
scope note: Teto sem qualquer tipo de revestimento ou forro, com o vigamento e telhado à vista.
in scheme: Tesauro SIPA
preferred label: Unlined tiled ceiling @en
alternative label: Valadio
hidden label: Tecto em telha vã
broader: Teto segundo o tipo

Teto em vigamento
type: Concept
in scheme: Tesauro SIPA
preferred label: Roof timbers; Framework ceiling @en
hidden label: Tecto em vigamento
broader: Teto segundo o tipo

Teto falso
type: Concept
scope note: Cobertura interior, executada em materiais leves (madeira, gesso cartonado...) e que cria uma caixa de ar entre esta e o teto, propriamente dito, onde passam condutas, sistemas elétricos, etc.
in scheme: Tesauro SIPA
preferred label: False ceiling @en
preferred label: Faux plafond @fr
preferred label: Controsoffitto @it
hidden label: Tecto falso
broader: Teto segundo o tipo

Cobertura segundo o tipo
type: Concept
in scheme: Tesauro SIPA
preferred label: Roof by type @en
preferred label: Couverture selon le type @fr
preferred label: Copertura per tipologia @it
broader: Cobertura (Elementos arquitetónicos estruturais)
narrower: Abóbada
narrower: Cobertura em canhão
narrower: Cobertura plana
narrower: Pala
narrower: Telhado de águas concorrentes
narrower: Telhado de águas não concorrentes
narrower: Telheiro

Abóbada
type: Concept
scope note: Cobertura interior de um espaço ou conjunto de espaços, consistindo na transladação de um arco ou na justaposição de vários, apoiada em paredes, pilares ou colunas, apresentando perfis diversos e executada em variados materiais (betão, pedra, tijolo).
in scheme: Tesauro SIPA
preferred label: Vault @en
preferred label: Voute @fr
preferred label: Volta @it
alternative label: Concamaração
alternative label: Fórnice
broader: Cobertura segundo o tipo
narrower: Componentes da abóbada
narrower: Abóbada segundo o tipo

Componentes da abóbada
type: Concept
in scheme: Tesauro SIPA
preferred label: Vault components @en
preferred label: Composants de la voûte @fr
preferred label: Componenti della volta @it
broader: Abóbada
narrower: Arranque da abóbada
narrower: Pano de abóbada
narrower: Rim (Abóbada)
narrower: Cúpula

Arranque da abóbada
type: Concept
scope note: Plano onde se inicia a curvatura da abóbada.
in scheme: Tesauro SIPA
preferred label: Vault springer @en
alternative label: Nascimento da abóbada
broader: Componentes da abóbada
narrower: Saimel

Saimel
type: Concept
scope note: Aduela na nascença de um arco ou abóbada.
in scheme: Tesauro SIPA
preferred label: Springer; Keystone @en
broader: Arranque da abóbada

Pano de abóbada
type: Concept
scope note: Superfície lisa que compõe o intradorso da abóbada, compreendido entre o saimel, a nervura e o fecho.
in scheme: Tesauro SIPA
preferred label: Vault screen @en
alternative label: Casquete
broader: Componentes da abóbada

Rim (Abóbada)
type: Concept
in scheme: Tesauro SIPA
preferred label: Sprandel (Vault) @en
broader: Componentes da abóbada

Abóbada segundo o tipo
type: Concept
in scheme: Tesauro SIPA
preferred label: Vault by type @en
preferred label: Voûte selon le type @fr
preferred label: Volta per tipologia @it
broader: Abóbada
narrower: Abóbada abatida
narrower: Abóbada anular
narrower: Abóbada cónica
narrower: Abóbada de aresta
narrower: Abóbada de barrete de clérigo
narrower: Abóbada de berço
narrower: Abóbada de caracol
narrower: Abóbada de cruzaria de ogivas
narrower: Abóbada de lunetas
narrower: Abóbada de nervuras
narrower: Abóbada de Santo António
narrower: Abóbada de vela
narrower: Abóbada em semicúpula
narrower: Abóbada enviesada
narrower: Abóbada tornejante
narrower: Abobadilha (Teto)

Abóbada abatida
type: Concept
scope note: Tipo de abóbada que apresenta, no seu intradorso, o perfil de um arco abatido.
in scheme: Tesauro SIPA
preferred label: Depressed vault @en
alternative label: Abóbada de sarapanel
broader: Abóbada segundo o tipo
narrower: Abóbada em asa de cesto

Abóbada em asa de cesto
type: Concept
scope note: Tipo de abóbada apoiada em duas paredes, de secção muito abatida e muito larga, cujo perfil se assemelha à asa de um cesto.
in scheme: Tesauro SIPA
preferred label: Three-centered vault @en
broader: Abóbada abatida

Abóbada anular
type: Concept
scope note: Tipo de abóbada sustentada por pés-direitos dispostos de forma concêntrica.
in scheme: Tesauro SIPA
preferred label: Annular vault @en
broader: Abóbada segundo o tipo

Abóbada cónica
type: Concept
scope note: Tipo de abóbada apoiada em quatro paredes, cujo intradorso evolui em forma de cone.
in scheme: Tesauro SIPA
preferred label: Conical vault @en
alternative label: Abóbada conoide
broader: Abóbada segundo o tipo

Abóbada de aresta
type: Concept
scope note: Tipo de abóbada formada pela intersecção de duas abóbadas de berço semelhantes, apoiando-se diretamente nos ângulos do espaço que cobre, projetando arestas salientes, podendo apresentar nervuras ou apenas uma pequena aresta.
in scheme: Tesauro SIPA
preferred label: Double barrel vault @en
preferred label: Voute à arête @fr
preferred label: Volta a schifo @it
broader: Abóbada segundo o tipo

Abóbada de barrete de clérigo
type: Concept
scope note: Tipo de abóbada formada pela intersecção em ângulo reto, de quatro panos em quarto de círculo, que diminuem e se encontram no topo, com ângulos muito salientes e cujo peso descarrega uniformemente nas quatro paredes.
in scheme: Tesauro SIPA
preferred label: Cloister vault; Dominical vault @en
alternative label: Abóbada de ângulo
alternative label: Abóbada de claustro
broader: Abóbada segundo o tipo

Abóbada de berço
type: Concept
scope note: Tipo de abóbada contínua, gerado por um arco, que se repete num eixo longitudinal, cujo peso descarrega diretamente em duas paredes.
in scheme: Tesauro SIPA
preferred label: Tunnel vault @en
preferred label: Voute en berceau @fr
preferred label: Volta a crociera @it
alternative label: Abóbada cilindroide
alternative label: Abóbada de canudo
alternative label: Abóbada de tubo
alternative label: Abóbada de volta inteira
broader: Abóbada segundo o tipo
narrower: Abóbada de berço quebrado
narrower: Abóbada de meio berço

Abóbada de berço quebrado
type: Concept
scope note: Tipo de abóbada de berço com o perfil ligeiramente apontado.
in scheme: Tesauro SIPA
preferred label: Barrel vault @en
alternative label: Abóbada de berço apontado
broader: Abóbada de berço

Abóbada de meio berço
type: Concept
scope note: Tipo de abóbada em quarto de círculo, muito utilizada nas naves colaterais de um edifício religioso.
in scheme: Tesauro SIPA
preferred label: Semi-barrel vault @en
broader: Abóbada de berço
narrower: Abóbada de Marselha
narrower: Abóbada Montpellier

Abóbada de Marselha
type: Concept
in scheme: Tesauro SIPA
preferred label: Marseille vault @en
broader: Abóbada de meio berço

Abóbada Montpellier
type: Concept
in scheme: Tesauro SIPA
preferred label: Montpellier vault @en
broader: Abóbada de meio berço

Abóbada de caracol
type: Concept
scope note: Tipo de abóbada de um espaço que corre entre uma parede e um eixo central vertical e fixo, estando as fiadas do revestimento do intradorso colocadas em espiral. É utilizada, preferencialmente, para a cobertura de escadas de caracol.
in scheme: Tesauro SIPA
preferred label: Spiral vault @en
alternative label: Abóbada de boca de forno
alternative label: Abóbada de São Gil
alternative label: Abóbada em espiral
alternative label: Abóbada serpentina
broader: Abóbada segundo o tipo

Abóbada de cruzaria de ogivas
type: Concept
scope note: Tipo de abóbada que resulta de um cruzamento em ângulo reto de segmentos de arcos apontados, constituídos por molduras salientes, que descarregam diretamente nos ângulos do espaço que cobrem e permitindo uma grande elevação da altura da cobertura.
in scheme: Tesauro SIPA
preferred label: Rib vault; Pointed groin vault @en
broader: Abóbada segundo o tipo
narrower: Abóbada sextapartida

Abóbada sextapartida
type: Concept
scope note: Tipo de abóbada de cruzaria de ogivas, dividida por uma nervura transversal, que nasce entre os arcos formeiros, originando seis panos de abóbada. É muito utilizada na arquitetura gótica francesa.
in scheme: Tesauro SIPA
preferred label: Sexpartite vault @en
broader: Abóbada de cruzaria de ogivas

Abóbada de lunetas
type: Concept
scope note: Tipo de abóbada cruzada ao longo do seu comprimento por pequenas abóbadas, permitindo rasgar vãos de iluminação.
in scheme: Tesauro SIPA
preferred label: Barrel vault; Lunette vault @en
broader: Abóbada segundo o tipo
narrower: Penetração

Penetração
type: Concept
scope note: Pequena abóbada, normalmente de perfil curvo, que estabelece a ligação entre o pano de uma abóbada de lunetas e a moldura dos vãos que se rasgam acima do arranque da mesma.
in scheme: Tesauro SIPA
preferred label: Panetration, Infeed @en
broader: Abóbada de lunetas

Abóbada de nervuras
type: Concept
scope note: Tipo de abóbada marcada por várias molduras salientes, as nervuras, que cruzam o seu pano, permitindo descarregar o peso em zonas estratégicas, nos ângulos, através de pilares, colunas ou mísulas. Podem apresentar de quatro nervuras, as mais simples, a várias, dando origem a uma abóbada polinervada.
in scheme: Tesauro SIPA
preferred label: Ribbed vault @en
preferred label: Voûte à nervures @fr
preferred label: Volta a nervature @it
broader: Abóbada segundo o tipo
narrower: Abóbada polinervada
narrower: Componentes da abóbada de nervuras

Abóbada polinervada
type: Concept
scope note: Tipo de abóbada com elevado número de nervuras, sempre superior a quatro, dispondo-se de formas variadas.
in scheme: Tesauro SIPA
preferred label: Ribbed vault @en
preferred label: Voûte à nervures @fr
preferred label: Volta a nervature @it
broader: Abóbada de nervuras
narrower: Abóbada de combados
narrower: Abóbada de leque
narrower: Abóbada estrelada

Abóbada de combados
type: Concept
scope note: Tipo de abóbada polinervada, em que as nervuras secundárias apresentam um perfil curvo, cobrindo, do ponto de vista de descarga de forças, um maior perímetro de pano de abóbada.
in scheme: Tesauro SIPA
preferred label: Lierne vault; Stellar vault @en
broader: Abóbada polinervada

Abóbada de leque
type: Concept
scope note: Tipo de abóbada polinervada, em que as nervuras se encontram dispostas em forma semicircular, figurando um leque aberto.
in scheme: Tesauro SIPA
preferred label: Fan vault @en
broader: Abóbada polinervada

Abóbada estrelada
type: Concept
scope note: Tipo de abóbada polinervada, em que as nervuras secundárias se encontram dispostas em forma de estrela de várias pontas.
in scheme: Tesauro SIPA
preferred label: Stellar vault; Star-ribbed vault @en
broader: Abóbada polinervada

Componentes da abóbada de nervuras
type: Concept
in scheme: Tesauro SIPA
preferred label: Ribbed vault components @en
broader: Abóbada de nervuras
narrower: Bocete
narrower: Chave (Componentes da abóbada de nervuras)
narrower: Nervura
narrower: Ramo

Bocete
type: Concept
scope note: Escudo, disco ou pequeno painel, liso ou decorado, que fecha cada um dos encontros das nervuras das abóbadas. Os elementos nele representados, podem ser de origem diversa: heráldica, simbólica ou meramente decorativa.
in scheme: Tesauro SIPA
preferred label: Keystone @en
alternative label: Fecho
broader: Componentes da abóbada de nervuras

Chave (Componentes da abóbada de nervuras)
type: Concept
scope note: Pedra (aduela) central da abóbada, que fecha a intersecção dos arcos, podendo ostentar elementos decorativos.
in scheme: Tesauro SIPA
preferred label: Closer (Ribbed vault components) @en
broader: Componentes da abóbada de nervuras

Nervura
type: Concept
scope note: Moldura saliente no intradorso de uma abóbada, correspondente aos arcos que se cruzam e que serve para transportar o peso da mesma até aos suportes, situados nos ângulos.
in scheme: Tesauro SIPA
preferred label: Nervure; Rib (Ribbed vault) @en
preferred label: Nervure @fr
preferred label: Nervatura @it
alternative label: Nervo
broader: Componentes da abóbada de nervuras
narrower: Aranhiço
narrower: Nervura principal
narrower: Nervura secundária

Aranhiço
type: Concept
scope note: Rede complexa de nervuras numa abóbada.
in scheme: Tesauro SIPA
preferred label: Rib @en
broader: Nervura

Nervura principal
type: Concept
scope note: Moldura saliente que secciona transversalmente o pano de uma abóbada, cruzando-se com outra semelhante, em ângulo reto, dividindo-o em quatro panos.
in scheme: Tesauro SIPA
preferred label: Main rib @en
alternative label: Formalote
broader: Nervura

Nervura secundária
type: Concept
scope note: Cada uma das molduras que seccionam o pano da abóbada e que transportam o peso até à nervura principal ou diretamente aos suportes.
in scheme: Tesauro SIPA
preferred label: Secondary rib @en
broader: Nervura
narrower: Cadeia (Nervura secundária)
narrower: Lierne
narrower: Tercelete

Cadeia (Nervura secundária)
type: Concept
scope note: Cada uma das nervuras que une os bocetes principais numa abóbada de cruzaria de ogivas.
in scheme: Tesauro SIPA
preferred label: Bond; String (Secondary rib) @en
broader: Nervura secundária

Lierne
type: Concept
scope note: Nervura secundária que secciona, ao centro, o pano da abóbada.
in scheme: Tesauro SIPA
preferred label: Nervatura di volta gotica; Costolone @it
broader: Nervura secundária

Tercelete
type: Concept
scope note: Nervura secundária que une um lierne à nervura principal, podendo ser de perfil reto ou curvo.
in scheme: Tesauro SIPA
preferred label: Tierceron @en
preferred label: Costolone gotico @it
alternative label: Terceirão
broader: Nervura secundária
narrower: Combado

Combado
type: Concept
scope note: Nervura secundária que une um lierne à nervura principal, com perfil curvo.
in scheme: Tesauro SIPA
preferred label: Lierne; Stella @en
broader: Tercelete

Ramo
type: Concept
scope note: Conjunto de nervuras, que arranca do suporte, situado nos ângulos.
in scheme: Tesauro SIPA
preferred label: Branch @en
broader: Componentes da abóbada de nervuras

Abóbada de Santo António
type: Concept
in scheme: Tesauro SIPA
preferred label: Saint Anthony vault @en
broader: Abóbada segundo o tipo

Abóbada de vela
type: Concept
scope note: Tipo de abóbada semiesférica, lançada sobre um espaço quadrangular, em que os ângulos formam quatro arcos, permitindo a sua inserção num plano retilíneo.
in scheme: Tesauro SIPA
preferred label: Semi-concameration vault @en
alternative label: Meia-concameração
broader: Abóbada segundo o tipo

Abóbada em semicúpula
type: Concept
scope note: Tipo de abóbada em quarto de esfera, utilizado em nichos, remates de capelas ou absides.
in scheme: Tesauro SIPA
preferred label: Semi-dome vault @en
broader: Abóbada segundo o tipo
narrower: Abóbada de concha

Abóbada de concha
type: Concept
scope note: Tipo de abóbada em quarto de esfera, utilizado em nichos, remates de capelas ou absides, ostentando caneluras no intradorso.
in scheme: Tesauro SIPA
preferred label: Shell vault @en
broader: Abóbada em semicúpula

Abóbada enviesada
type: Concept
scope note: Tipo de abóbada de berço, assente em duas paredes, mas cujas linhas de nascença, embora paralelas, se encontram em planos horizontais diferentes.
in scheme: Tesauro SIPA
preferred label: Biased vault @en
alternative label: Abóbada aviajada
alternative label: Abóbada de escarção
alternative label: Abóbada montante
alternative label: Abóbada oblíqua
broader: Abóbada segundo o tipo

Abóbada tornejante
type: Concept
scope note: Tipo de abóbada de uma superfície radiante, apoiada nas paredes e num suporte central, normalmente um pilar.
in scheme: Tesauro SIPA
preferred label: Biased vault @en
broader: Abóbada segundo o tipo

Abobadilha (Teto)
type: Concept
scope note: Abóbada de pequena espessura, executada em materiais leves, como o tijolo, podendo assumir várias formas.
in scheme: Tesauro SIPA
preferred label: Small vault; Jack-arch (Ceiling) @en
broader: Abóbada segundo o tipo
narrower: Abobadilha de cesto
narrower: Abobadilha de engra
narrower: Abobadilha de percinas
narrower: Abobadilha forrada
narrower: Abobadilha simples

Abobadilha de cesto
type: Concept
scope note: Tipo de abobadilha, frequentemente construída sem escoramento (cimbre), utilizando tijolos leves e gesso rápido.
in scheme: Tesauro SIPA
preferred label: Barrel small vault @en
broader: Abobadilha (Teto)

Abobadilha de engra
type: Concept
in scheme: Tesauro SIPA
preferred label: Corner small avult @en
broader: Abobadilha (Teto)

Abobadilha de percinas
type: Concept
in scheme: Tesauro SIPA
preferred label: Tubular frame small vault @en
broader: Abobadilha (Teto)

Abobadilha forrada
type: Concept
scope note: Tipo de abobadilha constituída por duas fiadas de tijolos.
in scheme: Tesauro SIPA
preferred label: Padded small vault @en
broader: Abobadilha (Teto)

Abobadilha simples
type: Concept
scope note: Tipo de abobadilha constituída por uma única fiada de tijolos.
in scheme: Tesauro SIPA
preferred label: Small vault; Jack-arch @en
broader: Abobadilha (Teto)

Cúpula
type: Concept
scope note: Cobertura em forma de abóbada hemisférica ou poligonal, lançada sobre um espaço centralizado (circular, elíptico ou poligonal), construída em pedra, tijolo ou betão, constituída por uma calote externa, o domo, e por uma interna, denominada cúpula, que, por extensão, passou a designar a totalidade da estrutura.
in scheme: Tesauro SIPA
preferred label: Cupola; Dome @en
preferred label: Coupole; Dôme @fr
preferred label: Cupola @it
broader: Componentes da abóbada
narrower: Componentes da cúpula
narrower: Cúpula segundo o tipo

Componentes da cúpula
type: Concept
in scheme: Tesauro SIPA
preferred label: Dome components @en
preferred label: Composants du dôme @fr
preferred label: Componenti della cupola @it
broader: Cúpula
narrower: Calote
narrower: Domo
narrower: Entrecorte (Cúpula)
narrower: Lanternim
narrower: Pendente
narrower: Tambor (Cúpula)
narrower: Trompa

Calote
type: Concept
scope note: Intradorso da forma curva da cúpula.
in scheme: Tesauro SIPA
preferred label: Flattened dome @en
broader: Componentes da cúpula

Domo
type: Concept
scope note: Extradorso da forma curva da cúpula.
in scheme: Tesauro SIPA
preferred label: Cupola @it
preferred label: Dome @en
preferred label: Dôme @fr
alternative label: Zimbório
broader: Componentes da cúpula

Entrecorte (Cúpula)
type: Concept
scope note: Espaço entre o domo e o calote.
in scheme: Tesauro SIPA
preferred label: Intersection (Dome) @en
alternative label: Entrecúpula
broader: Componentes da cúpula

Lanternim
type: Concept
scope note: Pequeno elemento torreado que remata a cúpula e que permite criar um corpo de luzes no fecho da mesma.
in scheme: Tesauro SIPA
preferred label: Skylight @en
broader: Componentes da cúpula

Pendente
type: Concept
in scheme: Tesauro SIPA
preferred label: Pendentive @en
alternative label: Pendurão
broader: Componentes da cúpula

Tambor (Cúpula)
type: Concept
scope note: Parede que surge entre o arranque da cúpula e a sua calote, apresentando-se cega ou permitindo rasgar vãos de iluminação, circunscritos, ou não, por elementos decorativos ou arquitetónicos.
in scheme: Tesauro SIPA
preferred label: Tholobate; Tambour (Dome) @en
preferred label: Tambour (Dôme) @fr
preferred label: Tamburo (Cupola) @it
broader: Componentes da cúpula

Trompa
type: Concept
scope note: Elemento triangular, com as faces curvas, colocado no ângulo das paredes, fazendo a transição entre o espaço quadrangular e a superfície curva da cúpula.
in scheme: Tesauro SIPA
preferred label: Tubular frame @en
alternative label: Perxina
broader: Componentes da cúpula

Cúpula segundo o tipo
type: Concept
in scheme: Tesauro SIPA
preferred label: Dome according to type @en
preferred label: Dôme selon le type @fr
preferred label: Cupola secondo il tipo @it
broader: Cúpula
narrower: Cúpula bolbosa
narrower: Cúpula cega
narrower: Cúpula de pendentes
narrower: Cúpula de trompas
narrower: Cúpula geodésica
narrower: Cúpula suspensa
narrower: Cupulim

Cúpula bolbosa
type: Concept
scope note: Cúpula que forma um bojo a partir do seu arranque, contracurvando até culminar no vértice, utilizada na arte oriental e no período do Romantismo.
in scheme: Tesauro SIPA
preferred label: Bulbous dome @en
broader: Cúpula segundo o tipo

Cúpula cega
type: Concept
scope note: Cobertura hemisférica, assente diretamente no arranque, não permitindo a introdução de um corpo de luzes, para iluminação interior.
in scheme: Tesauro SIPA
preferred label: Blind dome @en
broader: Cúpula segundo o tipo

Cúpula de pendentes
type: Concept
scope note: Cobertura hemisférica, lançada sobre um espaço quadrangular, necessitando de um elemento que faça a transição entre o círculo da cúpula e o seu arranque, de forma poligonal, efectuado a partir do pendente, elemento triangular, com um dos lados curvo.
in scheme: Tesauro SIPA
preferred label: Dome on pendentives @en
broader: Cúpula segundo o tipo

Cúpula de trompas
type: Concept
scope note: Cobertura hemisférica, lançada sobre um espaço quadrangular, necessitando de um elemento que faça a transição entre o círculo da cúpula e o seu arranque, de forma poligonal, efetuado a partir da trompa, elemento em forma de abóbada cónica.
in scheme: Tesauro SIPA
preferred label: Dome on squinches @en
broader: Cúpula segundo o tipo

Cúpula geodésica
type: Concept
scope note: Cúpula feita com materiais leves, suportada por elementos rígidos, normalmente metálicos, sistema utilizado, pela primeira vez, pelo americano Buckminster Fuller (1895-1983).
in scheme: Tesauro SIPA
preferred label: Geodesic dome @en
broader: Cúpula segundo o tipo
narrower: Alvéolo

Alvéolo
type: Concept
scope note: Cada um dos elementos vazados circunscritos pela rede dos elementos rígidos da cúpula geodésica.
in scheme: Tesauro SIPA
preferred label: Alveolus (Cell) @en
broader: Cúpula geodésica

Cúpula suspensa
type: Concept
in scheme: Tesauro SIPA
preferred label: Pendant dome @en
broader: Cúpula segundo o tipo

Cupulim
type: Concept
scope note: Cobertura em forma de domo, aplicada a pequenos espaços ou que protege a entrada de escadas em terraços.
in scheme: Tesauro SIPA
preferred label: Skylight; Fanlight @en
broader: Cúpula segundo o tipo

Cobertura em canhão
type: Concept
scope note: Tipo de cobertura com perfil longitudinal curvo.
in scheme: Tesauro SIPA
preferred label: Barrel roof @en
alternative label: Cobertura em vagão
broader: Cobertura segundo o tipo

Cobertura plana
type: Concept
scope note: Estrutura que fecha horizontalmente um edifício ou um espaço, podendo estar assente em vigamento, abóbada ou abobadilha, normalmente protegido, em cada uma das suas faces, por uma guarda de diversos materiais, com acesso interno ou externo.
in scheme: Tesauro SIPA
preferred label: Flat roof @en
broader: Cobertura segundo o tipo
narrower: Cobertura plana não praticável
narrower: Cobertura plana praticável

Cobertura plana não praticável
type: Concept
scope note: Cobertura plana cujo tipo de revestimento não permite que se utilize a sua superfície.
in scheme: Tesauro SIPA
preferred label: Non praticable flat roof @en
broader: Cobertura plana

Cobertura plana praticável
type: Concept
scope note: Cobertura plana, cujo revestimento permite o acesso e a fruição da sua superfície.
in scheme: Tesauro SIPA
preferred label: Praticable flat roof @en
broader: Cobertura plana
narrower: Cobertura verde
narrower: Terraço (Cobertura plana praticável)

Cobertura verde
type: Concept
scope note: Cobertura plana cujo revestimento é formado por um jardim.
in scheme: Tesauro SIPA
preferred label: Green roof @en
alternative label: Cobertura ajardinada
broader: Cobertura plana praticável

Terraço (Cobertura plana praticável)
type: Concept
scope note: Cobertura plana de um edifício, pavimentado a pedra ou argamassa.
in scheme: Tesauro SIPA
preferred label: Terrace (Praticable flat roof) @en
broader: Cobertura plana praticável

Pala
type: Concept
in scheme: Tesauro SIPA
preferred label: Peak @en
broader: Cobertura segundo o tipo

Telhado de águas concorrentes
type: Concept
in scheme: Tesauro SIPA
preferred label: Gabled roof @en
broader: Cobertura segundo o tipo
narrower: Cobertura em mansarda
narrower: Cobertura de pailhão
narrower: Cobertura em tesoura
narrower: Cobertura em coruchéu

Cobertura em mansarda
type: Concept
scope note: Elemento que fecha um edifício ou um espaço, interrompido por um ou vários vãos, cada um deles denominado trapeira, que permitem iluminar o último andar de uma construção, instalado na vertente da referida cobertura.
in scheme: Tesauro SIPA
preferred label: Mansard roof @en
alternative label: Cobertura amansardada
alternative label: Gateira (Cobertura em telhado de águas concorrentes)
broader: Telhado de águas concorrentes

Cobertura de pailhão
type: Concept
in scheme: Tesauro SIPA
preferred label: Panelling roof @en
broader: Telhado de águas concorrentes
narrower: Cobertura à holandesa

Cobertura à holandesa
type: Concept
scope note: Tipo de cobertura de pailhão.
in scheme: Tesauro SIPA
preferred label: Dutch-style roof @en
broader: Cobertura de pailhão

Cobertura em tesoura
type: Concept
scope note: Estruturas múltiplas que fecham um edifício ou um espaço, correspondendo uma estrutura a cada um dos espaços funcionais do mesmo.
in scheme: Tesauro SIPA
preferred label: Scissor roof; Treasury roof @en
alternative label: Cobertura em tesouro
broader: Telhado de águas concorrentes

Cobertura em coruchéu
type: Concept
scope note: Elemento inclinado e bastante elevado que fecha um edifício ou um espaço, apresentando várias formas, construída em diversos materiais e com vários tipos de revestimento, como azulejo, escama de lousa ou cantaria.
in scheme: Tesauro SIPA
preferred label: Spire roof @en
alternative label: Aconchado
alternative label: Acorochado
alternative label: Flecha (Cobertura em telhado de águas concorrentes
alternative label: Ponta
broader: Telhado de águas concorrentes
narrower: Cobertura em coruchéu bolboso
narrower: Cobertura em coruchéu campaniforme
narrower: Cobertura em coruchéu cónico
narrower: Cobertura em coruchéu em agulha
narrower: Cobertura em coruchéu piramidal

Cobertura em coruchéu bolboso
type: Concept
scope note: Tipo de coruchéu que forma um bojo a partir do seu arranque, contracurvando até culminar no vértice.
in scheme: Tesauro SIPA
preferred label: Bulbous spire roof @en
broader: Cobertura em coruchéu

Cobertura em coruchéu campaniforme
type: Concept
scope note: Tipo de coruchéu que fecha um edifício ou um espaço de forma contracurvada, lembrando a forma de um sino.
in scheme: Tesauro SIPA
preferred label: Bell beaker spire roof @en
broader: Cobertura em coruchéu

Cobertura em coruchéu cónico
type: Concept
scope note: Tipo de coruchéu em forma de cone.
in scheme: Tesauro SIPA
preferred label: Conical spire roof @en
broader: Cobertura em coruchéu

Cobertura em coruchéu em agulha
type: Concept
scope note: Coruchéu muito alto e estreito, podendo ostentar decoração rendilhada.
in scheme: Tesauro SIPA
preferred label: Needle spire roof; Towering spire roof @en
broader: Cobertura em coruchéu

Cobertura em coruchéu piramidal
type: Concept
scope note: Tipo de coruchéu em forma de pirâmide quadrangular ou poligonal.
in scheme: Tesauro SIPA
preferred label: Pyramid spire roof @en
broader: Cobertura em coruchéu

Telhado de águas não concorrentes
type: Concept
in scheme: Tesauro SIPA
preferred label: Non-cocurrent roofing @en
broader: Cobertura segundo o tipo
narrower: Cobertura em dente de serra

Cobertura em dente de serra
type: Concept
scope note: Estrutura ampla que fecha um edifício ou um espaço, em que os vários planos que a constituem formam o perfil de uma lâmina de serra, tendo um plano vertical e um formando ângulo oblíquo.
in scheme: Tesauro SIPA
preferred label: Saw-tooth roof @en
broader: Telhado de águas não concorrentes
narrower: Shed

Shed
type: Concept
scope note: Tipo de cobertura em dente de serra, sendo um dos planos ou vertentes inclinado, surgindo vãos de iluminação, no plano vertical. Muito utilizado em grandes superfícies e na arquitetura industrial.
in scheme: Tesauro SIPA
broader: Cobertura em dente de serra

Telheiro
type: Concept
scope note: Cobertura simples de telhas destinada a abrigar animais, proteger utensílios, etc.
in scheme: Tesauro SIPA
preferred label: Tile-covered shed; Hovel @en
broader: Cobertura segundo o tipo

Parede e muro
type: Concept
scope note: Elemento predominantemente vertical executada em alvenaria de diversos materiais, cantaria, madeira ou betão, que fecha ou divide um espaço, edifício ou estrutura, cumprindo, ainda, um papel estrutural de suporte das cargas da construção, tanto verticais (gravíticas) como horizontais (vento e sismos).
in scheme: Tesauro SIPA
preferred label: Wall and masonry wall @en
preferred label: Mur et paroi @fr
preferred label: Muro e parete @it
broader: Elementos arquitetónicos estruturais de compartimentação específicos
narrower: Componentes da parede e muro segundo a função
narrower: Componentes genéricos da parede e muro
narrower: Parede e muro segundo a forma
narrower: Parede e muro segundo a função
narrower: Parede e muro segundo a implantação
related: Silhar (Pedra segundo a forma)
modified: 2025-09-23T13:57:39

Componentes da parede e muro segundo a função
type: Concept
in scheme: Tesauro SIPA
preferred label: Wall and masonry components by function @en
preferred label: Composants du mur et paroi selon la fonction @fr
preferred label: Componenti del muro e parete secondo la funzione @it
broader: Parede e muro
narrower: Componentes de enchimento da parede e muro
narrower: Componentes de revestimento da parede e muro
narrower: Componentes estruturais da parede e muro

Componentes de enchimento da parede e muro
type: Concept
in scheme: Tesauro SIPA
preferred label: Wall infill components @en
preferred label: Composants de remplissage du mur e paroi @fr
preferred label: Componenti di riempimento del muro e parete @it
broader: Componentes da parede e muro segundo a função
narrower: Cama (Componentes de enchimento da parede e muro)

Cama (Componentes de enchimento da parede e muro)
type: Concept
in scheme: Tesauro SIPA
preferred label: Bedding layer (Wall infill components) @en
preferred label: Lit de maçonnerie (Composants de remplissage du mur et paroi) @fr
broader: Componentes de enchimento da parede e muro

Componentes de revestimento da parede e muro
type: Concept
in scheme: Tesauro SIPA
preferred label: Wall cladding components @en
preferred label: Composants de parement du mur et paroi @fr
preferred label: Componenti di rivestimento del muro e parete @it
broader: Componentes da parede e muro segundo a função
narrower: Lambril
narrower: Silhar (Componentes de revestimento da parede e muro)

Lambril
type: Concept
scope note: Revestimento parcial de uma parede interior com elementos pintados ou dourados, madeira ou mármore, cobrindo, geralmente, apenas o seu terço inferior.
in scheme: Tesauro SIPA
preferred label: Zoccolo @it
preferred label: Wainscotting; Panelling @en
preferred label: Lambris; Lambrissage @fr
alternative label: Guarnição
alternative label: Alizar (Parede e muro)
alternative label: Olivel
broader: Componentes de revestimento da parede e muro

Silhar (Componentes de revestimento da parede e muro)
type: Concept
scope note: Revestimento de azulejos, ocupando o comprimento total de uma parede. No caso do azulejo, é constituído, geralmente, por cerca de 10 ou 12 azulejos de altura.
in scheme: Tesauro SIPA
preferred label: Ashlar block (Wall cladding components) @en
preferred label: Pierre de taille (Composants de parement du mur et paroi) @fr
preferred label: Conci di pietra (Componenti di rivestimento del muro e parete) @it
broader: Componentes de revestimento da parede e muro

Componentes estruturais da parede e muro
type: Concept
in scheme: Tesauro SIPA
preferred label: Wall structural components @en
preferred label: Éléments structurels du mur et paroi @fr
preferred label: Componenti strutturali del muro e parete @it
broader: Componentes da parede e muro segundo a função
narrower: Cunhal
narrower: Engra
narrower: Espera (Parede)
narrower: Silhar (Componentes estruturais da parede e muro)

Cunhal
type: Concept
scope note: Elemento saliente, no encontro de duas paredes exteriores, podendo ser executado em cantaria aparelhada ou assumindo a forma de vários elementos arquitetónicos, como colunas e pilastras.
in scheme: Tesauro SIPA
preferred label: Angle; Corner @en
preferred label: Angle (Coin) @fr
preferred label: Angolo (Spigolo) @it
broader: Componentes estruturais da parede e muro
narrower: Capitel-cunhal
narrower: Cunhal segundo a forma

Capitel-cunhal
type: Concept
scope note: Capitel que reforça um cunhal, por vezes aplicado de maneira a formar uma falsa pilastra.
in scheme: Tesauro SIPA
preferred label: Corner capital @en
broader: Cunhal

Cunhal segundo a forma
type: Concept
in scheme: Tesauro SIPA
preferred label: Corner according to shape @en
broader: Cunhal
narrower: Cantoneira (Cunhal)
narrower: Cunhal apilastrado
narrower: Cunhal perpianho

Cantoneira (Cunhal)
type: Concept
scope note: Cunhal reforçado ou ornamentado por colunas ou pilastras.
in scheme: Tesauro SIPA
preferred label: Angle bar (Corner) @en
broader: Cunhal segundo a forma

Cunhal apilastrado
type: Concept
scope note: Cunhal constituído por uma pilastra, normalmente da ordem toscana, podendo apresentar-se simples ou da ordem colossal.
in scheme: Tesauro SIPA
preferred label: Pilaster corner @en
broader: Cunhal segundo a forma

Cunhal perpianho
type: Concept
scope note: Cunhal com colocação de silhares de forma alternada, um com a face maior visível (colocado ao comprido), outro com a menor (colocado ao atravessado).
in scheme: Tesauro SIPA
preferred label: Bondstone corner @en
alternative label: Alheta
alternative label: Cadeia de ligação
broader: Cunhal segundo a forma

Engra
type: Concept
scope note: Elemento saliente, no encontro de duas paredes interiores.
in scheme: Tesauro SIPA
preferred label: Corner; Angle @en
broader: Componentes estruturais da parede e muro

Espera (Parede)
type: Concept
scope note: Silhar em ressalto na construção de um muro ou parede, para estabelecer a ligação com o elemento ainda por construir.
in scheme: Tesauro SIPA
preferred label: Dimension stone (Wall) @en
alternative label: Pedra de espera
broader: Componentes estruturais da parede e muro

Silhar (Componentes estruturais da parede e muro)
type: Concept
scope note: Cada uma das pedras ou tijolos que constitui uma parede.
in scheme: Tesauro SIPA
preferred label: Ashlar (Wall structural components) @en
preferred label: Pierre de taille (Éléments structurels du mur et paroi) @fr
preferred label: Bugnato; Concio (Componenti strutturali del muro e parete) @it
alternative label: Alistão
alternative label: Enxilhar
broader: Componentes estruturais da parede e muro
narrower: Bloco (Componentes estruturais da parede e muro)
narrower: Rebo
narrower: Tijolo (Componentes estruturais da parede e muro)

Bloco (Componentes estruturais da parede e muro)
type: Concept
scope note: Silhar de pedra, de grandes dimensões.
in scheme: Tesauro SIPA
preferred label: Block (Wall structural components) @en
broader: Silhar (Componentes estruturais da parede e muro)
narrower: Bloco cerâmico

Bloco cerâmico
type: Concept
scope note: Silhar feito em cerâmica.
in scheme: Tesauro SIPA
preferred label: Ceramic block @en
preferred label: Bloc céramique @fr
preferred label: Blocco ceramico @it
broader: Bloco (Componentes estruturais da parede e muro)

Rebo
type: Concept
scope note: Pequena pedra, colocada entre as principais de uma parede.
in scheme: Tesauro SIPA
preferred label: Rubble; Grit @en
broader: Silhar (Componentes estruturais da parede e muro)

Tijolo (Componentes estruturais da parede e muro)
type: Concept
scope note: Elemento paralelepipédico feito de barro ou cimento, podendo ser maciço ou furado, este permitindo aliviar o seu próprio peso, empregue na construção de uma parede ou muro.
in scheme: Tesauro SIPA
preferred label: Brick (Wall structural components) @en
preferred label: Brique (Éléments structurels du mur et paroi) @fr
preferred label: Mattone (Componenti strutturali del muro e parete) @it
broader: Silhar (Componentes estruturais da parede e muro)

Componentes genéricos da parede e muro
type: Concept
in scheme: Tesauro SIPA
preferred label: Generic wall and masonry components @en
preferred label: Composants génériques du mur @fr
preferred label: Componenti generici del muro e parete @it
broader: Parede e muro
narrower: Enchamate
narrower: Modíolo
narrower: Nicho (Parede)
narrower: Paramento
narrower: Plúteo
narrower: Tremó
narrower: Vaseira

Enchamate
type: Concept
scope note: Maciço de alvenaria ou cantaria compreendido entre dois vãos, numa parede exterior.
in scheme: Tesauro SIPA
preferred label: Completion of a building wall @en
broader: Componentes genéricos da parede e muro

Modíolo
type: Concept
scope note: Espaço de uma parede, compreendido entre dois modilhões e normalmente decorado.
in scheme: Tesauro SIPA
preferred label: Modillion @en
broader: Componentes genéricos da parede e muro

Nicho (Parede)
type: Concept
scope note: Elemento côncavo rasgado numa parede, destinado a albergar uma estátua ou um objecto de iluminação, normalmente flanqueado por elementos arquitetónicos, como colunas e pilares, com cobertura em abóbada em semicúpula ou em abóbada de concha e encimado por vários tipos de elementos decorativos.
in scheme: Tesauro SIPA
preferred label: Niche (Wall) @en
preferred label: Niche (Mur) @fr
preferred label: Nicchia (Muro) @it
alternative label: Zoteca
broader: Componentes genéricos da parede e muro
narrower: Columbário (Componentes genéricos da parede e muro)
narrower: Edícula (Nicho)
narrower: Nicho segundo o tipo arquitetónico

Columbário (Componentes genéricos da parede e muro)
type: Concept
scope note: Nicho aberto numa parede, destinado a colocar as urnas cinerárias nos cemitérios romanos ou cada um dos nichos de um pombal, destinado a albergar uma ave.
in scheme: Tesauro SIPA
preferred label: Columbarium (Generic wall and masonry components) @en
preferred label: Columbarium (Composants génériques du mur et paroi) @fr
preferred label: Colombario (Componenti generici del muro e parete) @it
broader: Nicho (Parede)

Edícula (Nicho)
type: Concept
scope note: Pequeno nicho rasgado numa parede, envolvido por decoração arquitetónica, concebido para conter uma imagem.
in scheme: Tesauro SIPA
preferred label: Oratory; Little chapel (Niche) @en
broader: Nicho (Parede)

Nicho segundo o tipo arquitetónico
type: Concept
in scheme: Tesauro SIPA
preferred label: Niche according to architectural type @en
preferred label: Niche selon le type d'architecture @fr
preferred label: Nicchia secondo la tipologia architettonica @it
hidden label: Nicho segundo o tipo arquitectónico
broader: Nicho (Parede)
narrower: Arcossólio
narrower: Mihrab
narrower: Nicho de alfaias (Nicho segundo o tipo arquitetónico)

Arcossólio
type: Concept
scope note: Elemento rasgado numa parede, em forma de arco, contendo um túmulo. Frequentemente utilizado no período Paleocristão, viria a ser uma solução corrente na arte cristã ocidental a partir do Românico, perdurando até ao Maneirismo.
in scheme: Tesauro SIPA
preferred label: Arcosolium @en
preferred label: Arcosolio @fr
broader: Nicho segundo o tipo arquitetónico

Mihrab
type: Concept
scope note: Nicho rasgado na quibla de um edifício destinado ao culto religioso muçulmano.
in scheme: Tesauro SIPA
preferred label: Mihrab; Mehrab @en
broader: Nicho segundo o tipo arquitetónico

Nicho de alfaias (Nicho segundo o tipo arquitetónico)
type: Concept
scope note: Nicho rasgado na espessura de uma parede, junto a um altar, sendo utilizado para depositar as alfaias litúrgicas, durante as cerimónias religiosas. Utilizado pelos celebrantes desde a Idade Média, para depositar as alfaias (cálice, caixa de hóstias, patena), durante a liturgia, é constituído por arco de volta perfeita, apresentando, por vezes, concheado interior e decoração fitomórfica, especialmente no fecho do arco. Executado em cantaria, do tipo dominante na região em que se integram, de calcário, no centro ou Sul do país, e de granito, nas zonas beirãs e no Norte.
in scheme: Tesauro SIPA
preferred label: Liturgical silverware niche (Niche according to architectural type) @en
broader: Nicho segundo o tipo arquitetónico

Paramento
type: Concept
scope note: Superfície visível de um muro.
in scheme: Tesauro SIPA
preferred label: Parament @en
preferred label: Doublage maçonnerie rapporté (Parement) @fr
preferred label: Paramento (Rivestimento esterno) @it
broader: Componentes genéricos da parede e muro

Plúteo
type: Concept
scope note: Parede ostentando, normalmente, elementos decorativos, fechando o espaço entre duas colunas, muito utilizado na arte muçulmana e mudéjar.
in scheme: Tesauro SIPA
preferred label: Pluteum @en
broader: Componentes genéricos da parede e muro

Tremó
type: Concept
scope note: Superfície visível de uma parede interior, situada entre dois vãos.
in scheme: Tesauro SIPA
preferred label: Pier table @en
broader: Componentes genéricos da parede e muro

Vaseira
type: Concept
scope note: Elemento saliente para colocar vasos com flores, existente junto às janelas de alguns edifícios.
in scheme: Tesauro SIPA
preferred label: Brick shelf (Wall) @en
broader: Componentes genéricos da parede e muro

Parede e muro segundo a forma
type: Concept
in scheme: Tesauro SIPA
preferred label: Wall according to shape @en
preferred label: Mur e paroi selon la forme @fr
preferred label: Muro e parete secondo la forma @it
broader: Parede e muro
narrower: Alambor
narrower: Aprumado
narrower: Barriga
narrower: Entrecorte (Parede)
narrower: Esbarro
narrower: Parede em ressalto
narrower: Parede radial
narrower: Pomério

Alambor
type: Concept
scope note: Parede cuja espessura diminui consoante evolui em altura, ficando inclinada numa das faces, normalmente a exterior.
in scheme: Tesauro SIPA
preferred label: Escarpment @en
alternative label: Gaivel
alternative label: Jorramento
alternative label: Parede escarpada
broader: Parede e muro segundo a forma
narrower: Arrasto
narrower: Talude

Arrasto
type: Concept
scope note: Inclinação das paredes dos poços e minas.
in scheme: Tesauro SIPA
preferred label: Drag wall @en
broader: Alambor

Talude
type: Concept
scope note: Forte inclinação no paramento de um muro ou muralha, na sua totalidade ou parcialmente.
in scheme: Tesauro SIPA
preferred label: Slope; Ramp @en
broader: Alambor

Aprumado
type: Concept
scope note: Parede ou muro que se encontra direita, perpendicular à superfície em que assente.
in scheme: Tesauro SIPA
preferred label: Plumbed @en
preferred label: À plomb @fr
preferred label: A piombo @it
broader: Parede e muro segundo a forma

Barriga
type: Concept
scope note: Saliência de perfil curvo na prumada de uma parede.
in scheme: Tesauro SIPA
preferred label: Bulge; Swelling @en
broader: Parede e muro segundo a forma

Entrecorte (Parede)
type: Concept
scope note: Recorte no cunhal de um edifício, para facilitar a passagem de veículos numa via pública estreita.
in scheme: Tesauro SIPA
preferred label: Intersection (Wall) @en
broader: Parede e muro segundo a forma

Esbarro
type: Concept
scope note: Ressalto inclinado que une duas secções de uma parede ou de um muro.
in scheme: Tesauro SIPA
preferred label: Abutment (Overthrow) @en
preferred label: Déversoir (Soubassement de l’appui) @fr
preferred label: Spalla (Basamento) @it
broader: Parede e muro segundo a forma

Parede em ressalto
type: Concept
scope note: Ressalto na parte inferior de um muro ou parede, para reforçar a construção.
in scheme: Tesauro SIPA
preferred label: Ridge wall @en
alternative label: Avançamento
alternative label: Bailéu
broader: Parede e muro segundo a forma

Parede radial
type: Concept
scope note: Elemento predominantemente vertical que divide ou circunscreve um espaço, executado em alvenaria ou cantaria.
in scheme: Tesauro SIPA
preferred label: Radial wall @en
broader: Parede e muro segundo a forma

Pomério
type: Concept
scope note: Saliência formada por uma parede ou muro, no seu nível inferior.
in scheme: Tesauro SIPA
preferred label: Pomerium @en
broader: Parede e muro segundo a forma

Parede e muro segundo a função
type: Concept
in scheme: Tesauro SIPA
preferred label: Wall according to function @en
preferred label: Mur et paroi selon la fonction @fr
preferred label: Muro e parete secondo la funzione @it
broader: Parede e muro
narrower: Parede e muro de defesa
narrower: Parede e muro de limitação e divisão
narrower: Parede e muro de proteção
narrower: Parede e muro estrutural

Parede e muro de defesa
type: Concept
scope note: Parede ou muro construído em contexto militar com especificidades de adaptação às técnicas bélicas.
in scheme: Tesauro SIPA
preferred label: Defensive wall @en
preferred label: Mur et paroi de défense @fr
preferred label: Muro difensivo @it
broader: Parede e muro segundo a função
narrower: Camisa
narrower: Contraescarpa
narrower: Cordão (Parede e muro de defesa)
narrower: Escarpa
narrower: Escarpa exterior
narrower: Escarpa interior
narrower: Face
narrower: Flanco
narrower: Componentes genéricos da parede e muro de defesa
modified: 2025-09-23T13:37:54

Camisa
type: Concept
scope note: Silharia de pedra que reveste o reparo de uma fortificação moderna, na escarpa exterior, para melhor sustentação das terras.
in scheme: Tesauro SIPA
preferred label: Berm (Wall casing layer) @en
preferred label: Chemise (Contre-fort) @fr
preferred label: Camicia (scarpata interna) @it
broader: Parede e muro de defesa
modified: 2025-09-23T13:38:40

Contraescarpa
type: Concept
scope note: Face exterior do fosso de uma fortificação, construída em declive, oposta à escarpa, que na fortificação abaluartada tem ao alto o caminho coberto. Normalmente, a contraescarpa era quase ou completamente vertical, de modo a impedir que o inimigo que entrasse no fosso conseguisse escapar.
in scheme: Tesauro SIPA
preferred label: Counterscarp @en
preferred label: Contrescarpe @fr
preferred label: Controscarpa @it
hidden label: Contra-escarpa
broader: Parede e muro de defesa

Cordão (Parede e muro de defesa)
type: Concept
scope note: Friso decorativo de secção semicircular construído em pedra nas fortificações modernas, no topo dos paramentos, sobre a escarpa e sob o parapeito.
in scheme: Tesauro SIPA
preferred label: Cord; String course (Defensive wall) @en
preferred label: Cordon de la muraille (Mur et paroi de défense) @fr
preferred label: Cordone di scarpa (Muro difensivo) @it
broader: Parede e muro de defesa

Escarpa
type: Concept
scope note: Face interior do fosso de um castelo medieval, normalmente perpendicular ao mesmo.
in scheme: Tesauro SIPA
preferred label: Scarp (Slope) @en
preferred label: Éscarpe @fr
preferred label: Scarpa @it
broader: Parede e muro de defesa

Escarpa exterior
type: Concept
scope note: Componente do reparo constituído pela inclinação da face exterior da fortificação moderna, desde o cordão até ao fosso. Constitui o revestimento interno do fosso, sendo normalmente coberto a silharia, denominada de camisa.
in scheme: Tesauro SIPA
preferred label: Outer scarp (Outer slope) @en
preferred label: Éscarpe extérieure @fr
preferred label: Scarpa esterna @it
broader: Parede e muro de defesa

Escarpa interior
type: Concept
scope note: Componente do reparo constituído pela inclinação ou taludes do mesmo para o lado interior da fortificação moderna, a partir do terrapleno. Inicialmente nem sempre a escarpa interior era revestida a pedra e, atualmente, ainda pode apresentar troços com o talude de terra parcialmente aparente.
in scheme: Tesauro SIPA
preferred label: Inner scarp (Inner slope) @en
preferred label: Éscarpe intérieure @fr
preferred label: Scarpa interna @it
broader: Parede e muro de defesa

Face
type: Concept
scope note: Parte do baluarte direcionada para a parte de fora da fortificação moderna que interliga a extremidade do flanco e com a outra face forma um ângulo saliente, designado de ângulo flanqueado, local onde, normalmente, se construíam as guaritas.
in scheme: Tesauro SIPA
preferred label: Wall face @en
preferred label: Faccia (muro) @it
broader: Parede e muro de defesa
narrower: Ângulo flanqueado

Ângulo flanqueado
type: Concept
scope note: Ângulo saliente formado pelas duas faces do baluarte na fortificação moderna. A importância deste ângulo foi objeto de discussão entre os engenheiros da fortificação abaluartada.
in scheme: Tesauro SIPA
preferred label: Flanked angle @en
preferred label: Angle flanqué @fr
preferred label: Angolo flanquato @it
broader: Face

Flanco
type: Concept
scope note: Parte do baluarte que liga a face do mesmo à cortina da fortificação moderna, onde era colocada a artilharia para defender a cortina, o flanco do baluarte oposto e o fosso. O ângulo do flanco com a cortina foi tema de discussão entre as várias escolas de fortificação.
in scheme: Tesauro SIPA
preferred label: Flank @en
preferred label: Flanc @fr
preferred label: Fianco @it
broader: Parede e muro de defesa
narrower: Ângulo flanqueante
narrower: Espalda
narrower: Flanco coberto
narrower: Orelhão

Ângulo flanqueante
type: Concept
scope note: Ângulo formado pelo flanco de um baluarte ou meio baluarte e pela cortina na fortificação moderna.
in scheme: Tesauro SIPA
preferred label: Flanking angle @en
preferred label: Angle flanquant @fr
preferred label: Angolo di flangiatura @it
broader: Flanco

Espalda
type: Concept
scope note: Corpo quadrangular acrescentado na zona de ligação entre a face e o flanco de um baluarte da fortificação moderna, encurtando o flanco, para resguardar as peças de artilharia que atiravam sobre o inimigo, quando este atravessava o fosso e atacava a cortina.
in scheme: Tesauro SIPA
preferred label: Reverse side @en
broader: Flanco

Flanco coberto
type: Concept
scope note: Parte do flanco de um baluarte coberto pelo orelhão ou espalda quando existentes sobre o resto do flanco, para que a artilharia aí colocada ficasse menos exposta às baterias do inimigo.
in scheme: Tesauro SIPA
preferred label: Covered flank @en
preferred label: Flanc couvert @fr
preferred label: Fianco coperto @it
alternative label: Flanco encoberto
alternative label: Flanco retirado
broader: Flanco

Orelhão
type: Concept
scope note: Corpo de perfil curvo acrescentado na zona de ligação entre a face e o flanco de um baluarte da fortificação moderna, encurtando-o, para resguardar as peças de artilharia que atiravam sobre o inimigo ao atravessar o fosso ou tentar atacar a praça com minas.
in scheme: Tesauro SIPA
preferred label: Bartizan (Projecting turret) @en
preferred label: Echauguette (Tourelle) @fr
preferred label: Orecchione @it
broader: Flanco

Componentes genéricos da parede e muro de defesa
type: Concept
in scheme: Tesauro SIPA
preferred label: Generic components of defensive walls @en
preferred label: Composants génériques des murs de défense @fr
preferred label: Componenti generici dei muri di difesa @it
broader: Parede e muro de defesa
narrower: Ângulo de espalda

Ângulo de espalda
type: Concept
scope note: Ângulo formado pela face e pelo flanco contíguo de um baluarte ou meio baluarte na fortificação moderna.
in scheme: Tesauro SIPA
preferred label: Reverse angle @en
preferred label: Angle d’espalda @fr
preferred label: Angolo di espalda @it
broader: Componentes genéricos da parede e muro de defesa

Parede e muro de limitação e divisão
type: Concept
in scheme: Tesauro SIPA
preferred label: Boundary and division wall @en
broader: Parede e muro segundo a função
narrower: Divisória
narrower: Parede de enchimento
narrower: Parede dupla
narrower: Parede fachada
narrower: Parede meia

Divisória
type: Concept
scope note: Parede que constitui a divisória de um espaço, executada em material leve e facilmente removível, como o fasquiado, tabique, gesso cartonado, madeira ou vidro.
in scheme: Tesauro SIPA
preferred label: Partition wall @en
alternative label: Repartimento
broader: Parede e muro de limitação e divisão

Parede de enchimento
type: Concept
scope note: Parede divisória feita com tijolo a meia vez, tijolo ao alto ou tijolo de cutelo. A estas paredes ou tabiques dá-se também o nome de pano de tijolo.
in scheme: Tesauro SIPA
preferred label: Filling wall @en
alternative label: Tabique (Parede)
broader: Parede e muro de limitação e divisão

Parede dupla
type: Concept
in scheme: Tesauro SIPA
preferred label: Double wall @en
broader: Parede e muro de limitação e divisão

Parede fachada
type: Concept
scope note: Cada uma das superfícies verticais exteriores, que envolvem e definem o perímetro de uma construção e a caracterizam esteticamente, através da linguagem ou expressão arquitetónica dos seus elementos, materiais e riqueza ornamental.
in scheme: Tesauro SIPA
preferred label: Façade wall @en
broader: Parede e muro de limitação e divisão
narrower: Componentes da parede fachada
narrower: Parede fachada segundo a implantação
narrower: Parede fachada segundo o tipo

Componentes da parede fachada
type: Concept
in scheme: Tesauro SIPA
preferred label: Façade wall components @en
preferred label: Composants du mur de façade @fr
preferred label: Componenti del muro di facciata @it
broader: Parede fachada
narrower: Cornija continuada
narrower: Nembo
narrower: Pano (Componentes da parede fachada)
narrower: Registo (Fachada)

Cornija continuada
type: Concept
scope note: Moldura saliente que contorna todo o perímetro exterior de um edifício, marcando os pisos do mesmo ou os registos da fachada.
in scheme: Tesauro SIPA
preferred label: Cornice @en
preferred label: Corniche @fr
broader: Componentes da parede fachada

Nembo
type: Concept
scope note: Maciço de alvenaria ou cantaria compreendido entre dois vãos, numa parede interior.
in scheme: Tesauro SIPA
preferred label: Solid mansonry work @en
broader: Componentes da parede fachada

Pano (Componentes da parede fachada)
type: Concept
scope note: Cada uma das faixas verticais em que se decompõe uma fachada, circunscrita por elementos arquitetónicos (pilastras, colunas, pilares...).
in scheme: Tesauro SIPA
preferred label: Curtain wall (Façade wall components) @en
alternative label: Caixão
broader: Componentes da parede fachada

Registo (Fachada)
type: Concept
scope note: Cada uma das faixas em que se decompõe horizontalmente uma fachada, circunscrita por elementos arquitetónicos (friso, cornija...).
in scheme: Tesauro SIPA
preferred label: Decorative pannel (Façade) @en
broader: Componentes da parede fachada

Parede fachada segundo a implantação
type: Concept
in scheme: Tesauro SIPA
preferred label: Façade wall by placement @en
preferred label: Mur de façade selon l’implantation @fr
preferred label: Muro di facciata secondo l’orientamento @it
broader: Parede fachada
narrower: Fachada lateral
narrower: Fachada posterior
narrower: Fachada principal

Fachada lateral
type: Concept
scope note: Cada uma das faces exteriores de um edifício, disposta perpendicularmente à principal.
in scheme: Tesauro SIPA
preferred label: Lateral façade @en
alternative label: Flanco
alternative label: Ilharga
broader: Parede fachada segundo a implantação
narrower: Empena (Fachada lateral)

Empena (Fachada lateral)
type: Concept
scope note: Fachada lateral de um edifício, parcial ou totalmente visível, rasgada por alguns vãos.
in scheme: Tesauro SIPA
preferred label: Gable (Lateral façade) @en
broader: Fachada lateral
narrower: Outão

Outão
type: Concept
scope note: Fachada lateral cega de um edifício.
in scheme: Tesauro SIPA
preferred label: Side wall @en
broader: Empena (Fachada lateral)

Fachada posterior
type: Concept
scope note: Face exterior de um edifício, situada paralelamente à fachada principal.
in scheme: Tesauro SIPA
preferred label: Back façade @en
alternative label: Fachada tardoz
broader: Parede fachada segundo a implantação

Fachada principal
type: Concept
scope note: Fachada por onde se processa o principal acesso ao imóvel.
in scheme: Tesauro SIPA
preferred label: Main façade; Frontage @en
alternative label: Frente
alternative label: Fachada anterior
alternative label: Frontaria
alternative label: Frontispício
broader: Parede fachada segundo a implantação
narrower: Antico

Antico
type: Concept
scope note: Fachada e vestíbulo de um templo clássico ou de outros edifícios romanos.
in scheme: Tesauro SIPA
preferred label: Wall pier @en
preferred label: Contrefort du mur @fr
preferred label: Contrafforte di muro @it
broader: Fachada principal

Parede fachada segundo o tipo
type: Concept
in scheme: Tesauro SIPA
preferred label: Façade wall by type @en
preferred label: Mur de façade selon le type @fr
preferred label: Muro di facciata per tipologia @it
broader: Parede fachada
narrower: Fachada de cortina

Fachada de cortina
type: Concept
scope note: Fachada falsa que se sobrepõe à parede de um edifício e estrutura. Na arquitetura contemporânea, é muito utilizada, na forma de elementos pré-fabricados, colocados em retícula, em frente ao plano principal.
in scheme: Tesauro SIPA
preferred label: Curtain façade @en
broader: Parede fachada segundo o tipo
narrower: Painéis de fachada

Painéis de fachada
type: Concept
scope note: Elementos pré-fabricados, destinados a preencher as zonas reticuladas de uma fachada de cortina.
in scheme: Tesauro SIPA
preferred label: Façade pannels @en
broader: Fachada de cortina
narrower: Ataches

Ataches
type: Concept
scope note: Peças metálicas que ligam os painéis de fachada numa fachada de cortina.
in scheme: Tesauro SIPA
preferred label: Brads @en
broader: Painéis de fachada

Parede meia
type: Concept
scope note: Parede que divide um espaço pertencente a dois proprietários distintos, os quais partilham a propriedade da mesma.
in scheme: Tesauro SIPA
preferred label: Party wall @en
broader: Parede e muro de limitação e divisão

Parede e muro de proteção
type: Concept
scope note: Elemento predominantemente vertical, constituído por uma parede ou muro e, normalmente, uma sapata, que permite sustentar um determinado volume de terras, podendo ser de pedra seca, pedra argamassada, tijolo, betão simples ou armado, madeira ou de pranchas metálicas.
in scheme: Tesauro SIPA
preferred label: Protection wall @en
hidden label: Parede e muro de protecção
broader: Parede e muro segundo a função
narrower: Murete corta-fogo
narrower: Parede corta-fogo

Murete corta-fogo
type: Concept
scope note: Pequeno muro que divide dois edifícios e se prolonga sobre as coberturas, funcionando como elemento isolante, em caso de deflagração de incêndio.
in scheme: Tesauro SIPA
preferred label: Firebreak muret @en
broader: Parede e muro de proteção

Parede corta-fogo
type: Concept
scope note: Elemento predominantemente vertical que delimita um espaço, que, pelos seus materiais construtivas, permite isolá-lo em caso de deflagração de incêndio.
in scheme: Tesauro SIPA
preferred label: Firebreak wall @en
broader: Parede e muro de proteção

Parede e muro estrutural
type: Concept
in scheme: Tesauro SIPA
preferred label: Structural wall @en
broader: Parede e muro segundo a função
narrower: Parede mestra

Parede mestra
type: Concept
scope note: Elemento predominantemente vertical que serve para sustentar um edifício e os elementos que o cobrem. É normalmente construída em alvenaria de pedra, rebocada (de grande espessura) ou com aparelho, pode também ser constituída por uma estrutura de madeira com enchimento de alvenaria (de espessura mais reduzida).
in scheme: Tesauro SIPA
preferred label: Mur porteur @fr
preferred label: Main wall @en
preferred label: Muro portante @it
alternative label: Parede portante
broader: Parede e muro estrutural

Parede e muro segundo a implantação
type: Concept
in scheme: Tesauro SIPA
preferred label: Wall according to establishment @en
preferred label: Mur selon l'implantation @fr
preferred label: Muro secondo l'impianto @it
broader: Parede e muro
narrower: Parede exterior
narrower: Parede interior

Parede exterior
type: Concept
scope note: Elemento de um edifício, predominantemente vertical e virado ao exterior.
in scheme: Tesauro SIPA
preferred label: Outer wall @en
broader: Parede e muro segundo a implantação
narrower: Tapume

Tapume
type: Concept
scope note: Vedação feita de tábuas.
in scheme: Tesauro SIPA
preferred label: Enclos @fr
preferred label: Partition; Hedge @en
preferred label: Steccato @it
alternative label: Tapigo
broader: Parede exterior

Parede interior
type: Concept
scope note: Elemento de um edifício, predominantemente vertical e virado ao interior.
in scheme: Tesauro SIPA
preferred label: Inner wall @en
broader: Parede e muro segundo a implantação
narrower: Parede fundeira
narrower: Parede lateral
narrower: Parede interior segundo a orientação
narrower: Parede testeira

Parede fundeira
type: Concept
scope note: Parede interior de um templo, estrutura religiosa ou espaço funcional, onde, normalmente, se inscreve o acesso principal ao mesmo.
in scheme: Tesauro SIPA
preferred label: Back wall @en
broader: Parede interior

Parede lateral
type: Concept
scope note: Cada uma das faces interiores visíveis de um edifício, estrutura ou espaço funcional, perpendicular às paredes fundeira e testeira.
in scheme: Tesauro SIPA
preferred label: Side wall @en
broader: Parede interior

Parede interior segundo a orientação
type: Concept
in scheme: Tesauro SIPA
preferred label: Interior wall according to orientation @en
broader: Parede interior
narrower: Parede da Epístola
narrower: Parede do Evangelho
narrower: Quibla

Parede da Epístola
type: Concept
scope note: Num edifício destinado ao culto da religião católica, corresponde à parede lateral direita, lado onde o celebrante procedia à leitura das Epístolas.
in scheme: Tesauro SIPA
preferred label: Epistle wall @en
broader: Parede interior segundo a orientação

Parede do Evangelho
type: Concept
scope note: Num edifício destinado ao culto da religião católica, corresponde à parede lateral esquerda, lado onde o celebrante procedia à leitura do Evangelho.
in scheme: Tesauro SIPA
preferred label: Gospel wall @en
broader: Parede interior segundo a orientação

Quibla
type: Concept
scope note: Num edifício destinado ao culto da religião muçulmana, corresponde à parede testeira, para onde os orantes se viram, sempre orientada para a cidade sagrada de Meca.
in scheme: Tesauro SIPA
preferred label: Qibla; Kiblah @en
preferred label: Qibla; Kiblat @fr
broader: Parede interior segundo a orientação

Parede testeira
type: Concept
scope note: Face interior visível de um templo, estrutura religiosa ou espaço funcional, paralela à parede fundeira.
in scheme: Tesauro SIPA
preferred label: Front wall @en
broader: Parede interior

Pavimento
type: Concept
scope note: Elemento de proteção e acabamento de uma superfície para uma função prática de circulação (aderência, rigidez, resistência) e uma função decorativa (materiais, cores, desenho). Em estruturas de madeira o revestimento funciona sobre o vigamento que serve de suporte ao assentamento do soalho (tábuas com 0,10m a 0,20m de largo e 0.02m a 0,03m de espessura). Por vezes sobre este último são aplicados vários tipos de revestimento final, como cera, ladrilhos, pedra, tijoleira e alcatifas. No caso de estruturas de betão, o revestimento é aplicado diretamente na laje do piso sobre uma betonilha ou camada de regularização. Nos revestimentos com ladrilho cerâmico ou hidráulico há que ter cuidado com o guarnecimento das juntas para evitar que os elementos se soltem ou deteriorem. No caso de um jardim, constitui a cobertura inerte do solo. Pode ser permeável, semipermeável ou impermeável consoante permita ou não a passagem da água para o solo. Pode ser mineral ou artificial, desagregado, por módulos ou contínuo.
in scheme: Tesauro SIPA
preferred label: Floor @en
preferred label: Plancher; Parquet @fr
broader: Elementos arquitetónicos estruturais de compartimentação específicos
narrower: Componentes do pavimento
narrower: Pavimento segundo o material e técnicas de aplicação
narrower: Pavimento segundo o tipo

Componentes do pavimento
type: Concept
in scheme: Tesauro SIPA
preferred label: Floor components @en
preferred label: Composants du plancher @fr
preferred label: Componenti del pavimento @it
broader: Pavimento
narrower: Lancil
narrower: Tout-venant

Lancil
type: Concept
scope note: Elemento estreito e comprido, utilizado para defender o rebordo do soalho ou de um passeio público.
in scheme: Tesauro SIPA
preferred label: Kerb @en
preferred label: Accotement (Bordure) @fr
preferred label: Cordolo (Bordo) @it
broader: Componentes do pavimento

Tout-venant
type: Concept
scope note: Pavimento pouco resistente à tensão, de material betuminoso, utilizado, essencialmente, em ruas ou estradas.
in scheme: Tesauro SIPA
broader: Componentes do pavimento

Pavimento segundo o material e técnicas de aplicação
type: Concept
in scheme: Tesauro SIPA
preferred label: Floor according to material and application techniques @en
preferred label: Plancher en fonction du matériau et techniques d'application @fr
preferred label: Pavimentazione secondo il meteriale e tecniche di applicazione @it
broader: Pavimento
narrower: Pavimento cerâmico
narrower: Pavimento cimentado
narrower: Pavimento em asfalto
narrower: Pavimento em betão
narrower: Pavimento em calçada
narrower: Pavimento em calçada com linha de água
narrower: Pavimento em corticite
narrower: Pavimento em gravilha
narrower: Pavimento em lajeado
narrower: Pavimento em macadame
narrower: Pavimento em madeira

Pavimento cerâmico
type: Concept
scope note: Pavimento revestido com placas cerâmicas, de dimensões e cores variadas, com superfície vidrada ou não, assentes numa argamassa e consolidados com betume.
in scheme: Tesauro SIPA
preferred label: Ceramic floor @en
broader: Pavimento segundo o material e técnicas de aplicação
narrower: Pavimento em tijoleira

Pavimento em tijoleira
type: Concept
in scheme: Tesauro SIPA
preferred label: Tile floor @en
preferred label: Plancher carrelé @fr
preferred label: Pavimento in piastrelle @it
broader: Pavimento cerâmico

Pavimento cimentado
type: Concept
in scheme: Tesauro SIPA
preferred label: Cemented floor @en
preferred label: Plancher cimenté @fr
preferred label: Pavimento cementato @it
broader: Pavimento segundo o material e técnicas de aplicação
narrower: Pavimento em betonilha

Pavimento em betonilha
type: Concept
in scheme: Tesauro SIPA
preferred label: Screed floor @en
broader: Pavimento cimentado

Pavimento em asfalto
type: Concept
in scheme: Tesauro SIPA
preferred label: Tarmac floor @en
broader: Pavimento segundo o material e técnicas de aplicação

Pavimento em betão
type: Concept
in scheme: Tesauro SIPA
preferred label: Concrete floor @en
broader: Pavimento segundo o material e técnicas de aplicação
narrower: Pavimento em blocos de betão

Pavimento em blocos de betão
type: Concept
scope note: Pavimento revestido a blocos placas de betão pré-fabricadas, assentes num leito de areia. É muito utilizado em pavimentos exteriores.
in scheme: Tesauro SIPA
preferred label: Concrete blocks floor @en
broader: Pavimento em betão

Pavimento em calçada
type: Concept
scope note: Pavimento constituído por lajes ou placas de vários tipos de pedra (basalto, calcário, granito, mármore e xisto).
in scheme: Tesauro SIPA
preferred label: Cobbled floor @en
preferred label: Plancher en pavés @fr
preferred label: Pavimento in ciottoli @it
broader: Pavimento segundo o material e técnicas de aplicação

Pavimento em calçada com linha de água
type: Concept
scope note: Pavimento em calçada, integrando uma caleira, elaborada na mesma técnica, para drenagem das águas pluviais.
in scheme: Tesauro SIPA
preferred label: Cobbled floor with waterline @en
broader: Pavimento segundo o material e técnicas de aplicação
narrower: Pavimento em calçada à portuguesa
narrower: Pavimento em calçada tradicional
narrower: Pavimento em calhau rolado

Pavimento em calçada à portuguesa
type: Concept
scope note: Pavimento revestido a pedras afeiçoadas, normalmente calcário branco e negro, cravados em areia e compondo elementos figurativos ou geométricos.
in scheme: Tesauro SIPA
preferred label: Portuguese-style cobbled floor @en
broader: Pavimento em calçada com linha de água

Pavimento em calçada tradicional
type: Concept
scope note: Pavimento constituído por várias pedras de dimensões variáveis, cravadas numa argamassa ou num leito de areia, com disposição regular ou irregular.
in scheme: Tesauro SIPA
preferred label: Traditional cobbled floor @en
broader: Pavimento em calçada com linha de água

Pavimento em calhau rolado
type: Concept
scope note: Pavimento revestido com pequenos seixos de rio, não afeiçoados, dispostos aleatoriamente ou criando pequenos padrões geométricos.
in scheme: Tesauro SIPA
preferred label: Pebbles floor @en
alternative label: Pavimento de jogas
alternative label: Pavimento de seixo rolado
broader: Pavimento em calçada com linha de água

Pavimento em corticite
type: Concept
scope note: Pavimento revestido com placas de cortiça, que ganham aderência ao suporte através de uma cola.
in scheme: Tesauro SIPA
preferred label: Corticine floor @en
broader: Pavimento segundo o material e técnicas de aplicação

Pavimento em gravilha
type: Concept
scope note: Pavimento constituído por pequenas pedras miúdas soltas e sem qualquer ligante.
in scheme: Tesauro SIPA
preferred label: Gravel floor @en
preferred label: Sol en gravier @fr
preferred label: Pavimento in ghiaia @it
broader: Pavimento segundo o material e técnicas de aplicação

Pavimento em lajeado
type: Concept
scope note: Pavimento constituído por pedras ou placas de pedra de grandes dimensões, dispostas de forma uniforme.
in scheme: Tesauro SIPA
preferred label: Flagged floor @en
broader: Pavimento segundo o material e técnicas de aplicação

Pavimento em macadame
type: Concept
scope note: Pavimento com pedra britada e saibro, calcado por cilindro.
in scheme: Tesauro SIPA
preferred label: Macadam floor @en
broader: Pavimento segundo o material e técnicas de aplicação

Pavimento em madeira
type: Concept
scope note: Pavimento com revestimento ou estrutura de assento em madeira.
in scheme: Tesauro SIPA
preferred label: Wooden floor @en
preferred label: Plancher en bois @fr
preferred label: Pavimento in legno @it
broader: Pavimento segundo o material e técnicas de aplicação
narrower: Parquet
narrower: Soalho
narrower: Taco

Parquet
type: Concept
scope note: Pavimento revestido com pequenas peças de madeira, formando desenhos geométricos.
in scheme: Tesauro SIPA
alternative label: Parquete
broader: Pavimento em madeira

Soalho
type: Concept
scope note: Pavimento composto por tábuas de madeira corrida.
in scheme: Tesauro SIPA
preferred label: Wooden flor; Floorboard @en
preferred label: Plancher en bois; Parquet @fr
preferred label: Tavolato @it
alternative label: Solho
broader: Pavimento em madeira
narrower: Sanefa (Soalho)
narrower: Taburno
narrower: Tarugo

Sanefa (Soalho)
type: Concept
in scheme: Tesauro SIPA
preferred label: Cross beam (Floor) @en
preferred label: Lambrequin; Cantonnière (Parquet) @fr
preferred label: Mantovana (Tavolato) @it
broader: Soalho

Taburno
type: Concept
scope note: Tampa de madeira que cobre as sepulturas de uma igreja, constituindo o pavimento da mesma.
in scheme: Tesauro SIPA
preferred label: Predella @it
preferred label: Stairstep; Platform @en
preferred label: Marchepied @fr
broader: Soalho

Tarugo
type: Concept
in scheme: Tesauro SIPA
preferred label: Dowel @en
broader: Soalho

Taco
type: Concept
scope note: Bloco paralelepipédico, de madeira, constituindo o revestimento de um pavimento, podendo ser colocado de várias formas, constituindo desenhos geométricos.
in scheme: Tesauro SIPA
preferred label: Plank @en
broader: Pavimento em madeira
narrower: Pavimento em saibro
narrower: Pavimento em terra batida
narrower: Pavimento em vidro
narrower: Pavimento metálico

Pavimento em saibro
type: Concept
in scheme: Tesauro SIPA
preferred label: Gravel floor @en
preferred label: Sol en gravier @fr
preferred label: Pavimento in ghiaia @it
broader: Taco

Pavimento em terra batida
type: Concept
in scheme: Tesauro SIPA
preferred label: Rammed earth floor @en
preferred label: Plancher en terre battue @fr
preferred label: Pavimento sterrato @it
broader: Taco

Pavimento em vidro
type: Concept
in scheme: Tesauro SIPA
preferred label: Glass floor @en
broader: Taco

Pavimento metálico
type: Concept
in scheme: Tesauro SIPA
preferred label: Metal floor @en
broader: Taco

Pavimento segundo o tipo
type: Concept
in scheme: Tesauro SIPA
preferred label: Floor by type @en
preferred label: Plancher selon le type @fr
preferred label: Pavimento per tipologia @it
broader: Pavimento
narrower: Pavimento elevado
narrower: Pavimento flexível
narrower: Pavimento flutuante
narrower: Pavimento rígido

Pavimento elevado
type: Concept
scope note: Tipo de pavimento que permite criar um vão entre o piso original e a superfície de circulação, permitindo a passagem de instalações técnicas
in scheme: Tesauro SIPA
preferred label: Raised floor @en
alternative label: Pavimento suspenso
broader: Pavimento segundo o tipo
narrower: Plenum

Plenum
type: Concept
scope note: Espaço das instalações técnicas num pavimento elevado.
in scheme: Tesauro SIPA
broader: Pavimento elevado

Pavimento flexível
type: Concept
scope note: Tipo de pavimento utilizado em vias públicas, efetuado com várias camadas que se deformam sob carga, distribuindo o peso do tráfego pelas camadas inferiores até o subleito. Normalmente, é composto por camadas granulares e um revestimento asfáltico.
in scheme: Tesauro SIPA
preferred label: Flexible floor @en
broader: Pavimento segundo o tipo

Pavimento flutuante
type: Concept
scope note: Tipo de pavimento onde as peças são unidas entre si, formando uma superfície sobre o contrapiso, sem qualquer tipo de cola ou fixação.
in scheme: Tesauro SIPA
preferred label: Laminated floor @en
preferred label: Plancher flottant @fr
preferred label: Pavimento flottante @it
broader: Pavimento segundo o tipo

Pavimento rígido
type: Concept
scope note: Tipo de pavimento utilizado em vias públicas, em que a camada superior absorve quase a totalidade da carga.
in scheme: Tesauro SIPA
preferred label: Rigid floor @en
broader: Pavimento segundo o tipo

Piso (Elementos arquitetónicos estruturais de compartimentação)
type: Concept
in scheme: Tesauro SIPA
preferred label: Paving; Pavement @en
preferred label: Plancher; Étage @fr
preferred label: Pavimento; Piano @it
broader: Elementos arquitetónicos estruturais de compartimentação específicos

Elementos arquitetónicos estruturais de compartimentação genéricos
type: Concept
in scheme: Tesauro SIPA
preferred label: Generic structural architectural partitioning elements @en
preferred label: Éléments structurels génériques de compartimentage @fr
preferred label: Elementi strutturali architettonici generici di compartimentazione @it
hidden label: Elementos arquitectónicos estruturais de compartimentação genéricos
broader: Elementos arquitetónicos estruturais segundo a função
narrower: Junta
narrower: Roço
narrower: Traceria

Junta
type: Concept
in scheme: Tesauro SIPA
preferred label: Knuckle; Junction @en
broader: Elementos arquitetónicos estruturais de compartimentação genéricos
narrower: Chaga

Chaga
type: Concept
in scheme: Tesauro SIPA
preferred label: Carving; Cut @en
broader: Junta

Roço
type: Concept
scope note: Sulco rasgado numa parede, pavimento ou teto para passagem de canalizações ou tubos de sistemas elétricos, telefónicos, etc.
in scheme: Tesauro SIPA
preferred label: Groove made in stones @en
broader: Elementos arquitetónicos estruturais de compartimentação genéricos

Traceria
type: Concept
scope note: Padronagem mais ou menos elaborada, por vezes em grilhagem, usado para preencher vãos de janelas ou a revestir paredes.
in scheme: Tesauro SIPA
preferred label: Tracery @en
preferred label: Tracerie @fr
preferred label: Intaglio; Traforo @it
alternative label: Grelhagem
broader: Elementos arquitetónicos estruturais de compartimentação genéricos
narrower: Traceria cega
narrower: Traceria vazada

Traceria cega
type: Concept
scope note: Traceria usada para ornamentar uma superfície plana.
in scheme: Tesauro SIPA
preferred label: Blind tracery @en
broader: Traceria

Traceria vazada
type: Concept
scope note: Traceria formada por uma malha de lâminas, aplicado a vãos ou a paredes, permitindo criar lumes de iluminação ou elementos de arejamento.
in scheme: Tesauro SIPA
preferred label: Emptied tracery @en
broader: Traceria
narrower: Adufa (Traceria vazada)

Adufa (Traceria vazada)
type: Concept
scope note: Elemento vazado que protege um vão de grandes dimensões, constituído por lamelas de pedra, chumbo, madeira, ripas, tijolo ou betão, dispostas geometricamente, assumindo várias funções, conforme a sua aplicação. Pode ter a função de ventilação quando aplicada a uma janela, de proteção da devassa de privacidade, quando aplicada a vãos que rasgam um espaço de clausura ou de diminuição da amplitude do som dos sinos, quando aplicada a uma ventana.
in scheme: Tesauro SIPA
preferred label: Shutter; Lattice (Emptied tracery) @en
broader: Traceria vazada

Elementos arquitetónicos estruturais simples
type: Concept
in scheme: Tesauro SIPA
preferred label: Simple structural architectural elements @en
preferred label: Éléments architecturaux structurels simples @fr
preferred label: Elementi architettonici strutturali semplici @it
hidden label: Elementos arquitectónicos estruturais simples
broader: Elementos arquitetónicos estruturais
narrower: Componentes dos elementos arquitetónicos estruturais simples
narrower: Elementos arquitetónicos estruturais simples segundo a forma de agregação e estilo decorativo
narrower: Elementos arquitetónicos estruturais simples segundo a função

Componentes dos elementos arquitetónicos estruturais simples
type: Concept
in scheme: Tesauro SIPA
preferred label: Components of simple structural architectural elements @en
preferred label: Composants des éléments architecturaux structurels simples @fr
preferred label: Componenti degli elementi architettonici strutturali semplici @it
hidden label: Componentes dos elementos arquitectónicos estruturais simples
broader: Elementos arquitetónicos estruturais simples
narrower: Base
narrower: Capitel
narrower: Fuste

Base
type: Concept
scope note: Corpo onde assenta o fuste de uma coluna ou de pilar.
in scheme: Tesauro SIPA
preferred label: Base; Foundation (Simple structural architectural elements) @en
preferred label: Base (Éléments architecturaux structurels simples) @fr
preferred label: Base (Elementi architettonici strutturali semplici) @it
broader: Componentes dos elementos arquitetónicos estruturais simples
narrower: Escócia
narrower: Pedestal

Escócia
type: Concept
scope note: Moldura inferior da base de uma coluna, pilar ou pilastra, de forma côncava e que permite ampliar a área de apoio de um fuste.
in scheme: Tesauro SIPA
preferred label: Scotia @en
alternative label: Nacela
alternative label: Tróquilo
broader: Base

Pedestal
type: Concept
scope note: Tipo de suporte emoldurado que sustenta uma coluna ou uma estátua.
in scheme: Tesauro SIPA
preferred label: Piédestal @fr
preferred label: Piedistallo @it
broader: Base
narrower: Junquilho
narrower: Soco

Junquilho
type: Concept
scope note: Par de elementos convexos, que decoram as bases das colunas, pilares ou pilastras, nas ordens clássicas jónica e coríntia.
in scheme: Tesauro SIPA
preferred label: Mortise; Notch @en
broader: Pedestal

Soco
type: Concept
scope note: Base ressaltante em relação ao plano das fachadas englobando os seus elementos salientes (pilares ou pórticos), podendo ser executado em argamassa ou pedra.
in scheme: Tesauro SIPA
preferred label: Socle @en
broader: Pedestal

Capitel
type: Concept
scope note: Elemento que constitui o topo de uma coluna, pilastra, pilar, estípite ou quarteirão, coroando o fuste e servindo, normalmente, para suporte de uma arquitrave. Em cada uma das ordens arquitetónicas ou estilos artísticos, assume decoração diferenciada.
in scheme: Tesauro SIPA
preferred label: Capital @en
preferred label: Chapiteau @fr
preferred label: Capitello @it
broader: Componentes dos elementos arquitetónicos estruturais simples
narrower: Componentes do capitel
narrower: Capitel segundo o tipo
related: Ordem arquitetónica
modified: 2025-09-23T13:40:26

Componentes do capitel
type: Concept
in scheme: Tesauro SIPA
preferred label: Capital components @en
preferred label: Composants du chapiteau @fr
preferred label: Componenti del capitello @it
broader: Capitel
narrower: Ábaco (Capitel)
narrower: Coxim
narrower: Equino
narrower: Gola (Capitel)
narrower: Travesseiro

Ábaco (Capitel)
type: Concept
scope note: Elemento cimeiro de um capitel, onde assenta o elemento que sustenta, normalmente a arquitrave ou o arranque de um arco.
in scheme: Tesauro SIPA
preferred label: Abacus (Capital) @en
preferred label: Abaque (Chapiteau) @fr
preferred label: Abbacos (Capitello) @it
broader: Componentes do capitel

Coxim
type: Concept
scope note: Elemento principal do capitel, de maiores dimensões e ostentando a decoração.
in scheme: Tesauro SIPA
preferred label: Cushion capital @en
broader: Componentes do capitel

Equino
type: Concept
scope note: Parte inferior do capitel dórico, de forma oval ou circular.
in scheme: Tesauro SIPA
preferred label: Echinus; Quarter-round @en
broader: Componentes do capitel

Gola (Capitel)
type: Concept
scope note: Parte situada entre o astrágalo e o cesto do capitel dórico.
in scheme: Tesauro SIPA
preferred label: Cyma; Ogee (Capital) @en
broader: Componentes do capitel

Travesseiro
type: Concept
scope note: Face lateral das volutas num capitel jónico.
in scheme: Tesauro SIPA
preferred label: Volute face @en
broader: Componentes do capitel

Capitel segundo o tipo
type: Concept
in scheme: Tesauro SIPA
preferred label: Capital by type @en
preferred label: Chapiteau selon le type @fr
preferred label: Capitello per tipologia @it
broader: Capitel
narrower: Capitel cúbico
narrower: Capitel de cesto
narrower: Capitel de colchete

Capitel cúbico
type: Concept
scope note: Tipo de capitel com a forma superior de um cubo e os lados inferiores arredondados.
in scheme: Tesauro SIPA
preferred label: Cubic capital @en
broader: Capitel segundo o tipo
narrower: Capitel cúbico em concha

Capitel cúbico em concha
type: Concept
scope note: Capitel cúbico em que os lados estão esculpidos em forma de concha.
in scheme: Tesauro SIPA
preferred label: Shell-shaped cubic capital @en
broader: Capitel cúbico

Capitel de cesto
type: Concept
scope note: Capitel com o corpo curvo, decorado com desenho intrincado, semelhante à textura de um cesto.
in scheme: Tesauro SIPA
preferred label: Basket capital @en
broader: Capitel segundo o tipo

Capitel de colchete
type: Concept
scope note: Capitel com o corpo decorado com folhas estilizadas.
in scheme: Tesauro SIPA
preferred label: Crocket capital @en
broader: Capitel segundo o tipo

Fuste
type: Concept
scope note: Elemento eminentemente vertical, que compõe a coluna, ligando a base ao capitel, podendo estar decorado ou não.
in scheme: Tesauro SIPA
preferred label: Shaft @en
preferred label: Fût @fr
preferred label: Fusto @it
alternative label: Caria
broader: Componentes dos elementos arquitetónicos estruturais simples
narrower: Tambor (Fuste)

Tambor (Fuste)
type: Concept
scope note: Cada um dos elementos cilíndricos que compõem o fuste de uma coluna.
in scheme: Tesauro SIPA
preferred label: Fuste @en
broader: Fuste

Elementos arquitetónicos estruturais simples segundo a forma de agregação e estilo decorativo
type: Concept
in scheme: Tesauro SIPA
preferred label: Simple structural elements by aggregation and decorative style @en
preferred label: Éléments structurels simples selon l’agrégation et le style décoratif @fr
preferred label: Elementi strutturali semplici secondo forma di aggregazione e stile decorativo @it
hidden label: Elementos arquitectónicos estruturais simples segundo a forma de agregação e estilo decorativo
broader: Elementos arquitetónicos estruturais simples
narrower: Arcaria
narrower: Balaustrada
narrower: Cachorrada
narrower: Colunata
narrower: Ordem arquitetónica

Arcaria
type: Concept
in scheme: Tesauro SIPA
preferred label: Arcature @fr
preferred label: Arcata @it
preferred label: Arcade @en
broader: Elementos arquitetónicos estruturais simples segundo a forma de agregação e estilo decorativo

Balaustrada
type: Concept
scope note: Conjunto de balaústres, unidos por elementos nos topo e base, dispostos em intervalos regulares, sendo, por vezes, entrecortados por acrotério. É frequentemente utilizada nas guardas de varandas, coros, terraços ou como elemento divisório. Nos espaços religiosos, pode surgir a fechar um altar, capela, coro, nave ou a zona do batistério.
in scheme: Tesauro SIPA
preferred label: Balustrade @en
preferred label: Balaustraia @it
broader: Elementos arquitetónicos estruturais simples segundo a forma de agregação e estilo decorativo
narrower: Balaustrada falsa

Balaustrada falsa
type: Concept
scope note: Elemento arquitetónico composto por balaústres recortados sobre uma parede ou muro pleno.
in scheme: Tesauro SIPA
preferred label: Blind balustrade @en
alternative label: Balaustrada cega
broader: Balaustrada

Cachorrada
type: Concept
scope note: Conjunto sucessivo de cachorros a sustentar uma cobertura.
in scheme: Tesauro SIPA
preferred label: Corbelling; Corbel work @en
broader: Elementos arquitetónicos estruturais simples segundo a forma de agregação e estilo decorativo
related: Cachorro

Colunata
type: Concept
scope note: Conjunto de colunas colocadas em frente a uma fachada ou em todo o perímetro de um edifício ou estrutura, podendo, ainda, designar o conjunto de colunas que sustentam uma cobertura ou um entablamento.
in scheme: Tesauro SIPA
preferred label: Collonade @en
preferred label: Colonnade @fr
preferred label: Colonnato @it
broader: Elementos arquitetónicos estruturais simples segundo a forma de agregação e estilo decorativo
related: Coluna

Ordem arquitetónica
type: Concept
scope note: Conjunto de elementos arquitetónicos estruturados e decorados segundo um cânone, composto por vários módulos proporcionais entre si e na relação com o conjunto. Nasceu no mundo grego, tendo sofrido adaptações e variações no período romano, que as herdou e as difundiu a partir do Tratado de Vitrúvio (séc. I a.C.). A arte do Renascimento redescobre estas ordens, estudando-as e aplicando-as de forma rigorosa, sendo alvo de vários tratados que as difundiram como o de Leon Battista Alberti, o “De Re Aedificatoria” (1486), com sucessivas reedições latinas e italianas, de Sebastiano Serlio (1545), Jacopo Barozzi, conhecido como Vignola (1562) e de Andrea Palladio (1570)
in scheme: Tesauro SIPA
preferred label: Architectural order @en
preferred label: Ordre d'architecture @fr
preferred label: Ordine architettonico @it
hidden label: Ordem arquitectónica
broader: Elementos arquitetónicos estruturais simples segundo a forma de agregação e estilo decorativo
narrower: Ordem dórica
narrower: Ordem dórica-romana
narrower: Ordem colossal
narrower: Ordem compósita
narrower: Ordem coríntia
narrower: Ordem jónica
narrower: Ordem romano-coríntia
narrower: Ordem sobreposta
narrower: Ordem toscana
related: Capitel
related: Coluna
related: Pilar
related: Pilastra
modified: 2025-09-23T13:42:03

Ordem dórica
type: Concept
scope note: Foi uma das primeiras ordens arquitetónicas a aparecer no mundo antigo, no século V a.C., aplicada na construção dos primeiros templos da Acrópole de Atenas, caracterizando-se por uma sobriedade relativamente às que lhe sucederam. É composta por uma plataforma de três degraus, o estereóbato e o estilóbato, onde assentam as colunas, sem base e com o fuste canelado, possuindo de 16 a 20 caneluras, consoante o diâmetro da coluna, cingida, superiormente por anéis estreitos. A estrutura do fuste dilata-se, criando um capitel sem decoração, o équino, encimado por um ábaco, onde assenta o entablamento. Este é composto por uma arquitrave lisa e por um friso, dividido em métopas, uma superfície lisa, ornada por florões ou motivos pintados, e os tríglifos, elemento vertical, composto por três estrias (glifos), que se prolongam na base em gotas. A estrutura remata em mútulos, que criam uma saliência, permitindo proteger a estrutura das águas pluviais, e em frontão triangular, composto por cornija de perfil biselado.
in scheme: Tesauro SIPA
preferred label: Doric order @en
preferred label: Ordre dorique @fr
preferred label: Ordine dorico @it
broader: Ordem arquitetónica

Ordem dórica-romana
type: Concept
scope note: Ordem arquitetónica que resulta de uma adaptação romana da ordem dórica, tornando-a mais exuberante, com colunas mais altas e podendo introduzir elementos decorativos adicionais, como os modilhões que sustentam a cornija.
in scheme: Tesauro SIPA
preferred label: Doric-roman order @en
broader: Ordem arquitetónica

Ordem colossal
type: Concept
scope note: Ordem arquitetónica em que os elementos estruturais (colunas, pilares ou pilastras) evoluem por dois ou mais pisos, tendo sido divulgada no Maneirismo e Barroco.
in scheme: Tesauro SIPA
preferred label: Colossal order @en
preferred label: Ordre colossal @fr
preferred label: Ordine colossale @it
broader: Ordem arquitetónica

Ordem compósita
type: Concept
scope note: Ordem arquitetónica criada no séc. I a.C., no mundo romano, utilizando os elementos da Ordem Coríntia, variando na decoração do capitel, que alia as duas fiadas de folhas de acanto, encimadas por duas volutas, típicas do capitel jónico.
in scheme: Tesauro SIPA
preferred label: Composite order @en
preferred label: Ordre composite @fr
preferred label: Ordine composito @it
broader: Ordem arquitetónica

Ordem coríntia
type: Concept
scope note: Ordem arquitetónica mais recente, utilizada a partir do séc. V e IV a.C. É composta por uma plataforma de três degraus, o estereóbato e o estilóbato, onde assentam as bases das colunas, compostas por vários toros e escócias, de onde evolui o fuste, estriado, e o capitel composto por duas fiadas de folhas de acanto, encimadas por quatro volutas e uma palmeta central, surgindo, ainda, quatro volutas, uma em cada ângulo, que sustentam o ábaco. Neste apoia-se o entablamento, composto por arquitrave tripla, encimada por pequeno friso de óvulos e dardos, que sustenta um alto friso, decorado com figuras relevadas ou pintadas, que suportam um friso de dentículos e a cornija ou frontão triangular.
in scheme: Tesauro SIPA
preferred label: Corinthian order @en
preferred label: Ordre corinthien @fr
preferred label: Ordine corinzio @it
broader: Ordem arquitetónica

Ordem jónica
type: Concept
scope note: Ordem arquitetónica contemporânea da dórica, utilizada a partir do séc. V a.C.. É composta por uma plataforma de três degraus, o estereóbato e o estilóbato, onde assentam as bases das colunas, compostas por vários toros e escócias, de onde evolui o fuste, estriado, composto por 24 estrias, separadas por estreitos listéis, e o capitel composto por duas amplas volutas, que sustentam o ábaco. Neste apoia-se o entablamento, composto por arquitrave dupla, encimada por pequeno friso ornado por elementos geométricos, que sustenta um alto friso, decorado com figuras relevadas ou pintadas, que suportam um friso de dentículos e a cornija ou frontão triangular.
in scheme: Tesauro SIPA
preferred label: Ionic order @en
preferred label: Ordre ionique @fr
preferred label: Ordine ionico @it
alternative label: Ordem iónica
broader: Ordem arquitetónica

Ordem romano-coríntia
type: Concept
scope note: Ordem arquitetónica semelhante à coríntia, mas com alterações na base, ricamente decorada com elementos fitomórficos, com o fuste canelado apenas a partir do segundo terço, possuindo um capitel com três ordens de folhas de acanto. O entablamento é semelhante ao da Ordem Coríntia, sobrepujado por frios denteado e cornija muito saliente, sustentada por modilhão ou consola.
in scheme: Tesauro SIPA
preferred label: Roman-corinthian order @en
broader: Ordem arquitetónica

Ordem sobreposta
type: Concept
scope note: Composição de uma fachada de um edifício, utilizando mais que uma ordem arquitetónica, surgindo, normalmente, por ordem cronológica, com o primeiro piso utilizando a Ordem Dórica, o segundo a Ordem Jónica e o terceiro a Ordem Coríntia, podendo surgir, um quarto piso, com a Ordem Toscana, de que é exemplo o Coliseu de Roma.
in scheme: Tesauro SIPA
preferred label: Superimposed; Overlapped order @en
broader: Ordem arquitetónica

Ordem toscana
type: Concept
scope note: Ordem arquitetónica desenvolvida pelos etruscos e aperfeiçoada no mundo romano, composta por uma plataforma de três degraus, o estereóbato e o estilóbato, onde assentam as bases das colunas, composta por pequeno plinto e um toro, de onde evolui um fuste liso, com anel no topo, apresentando um capitel ornado por óvulos e dardos e por pequena cornija saliente. Sobre esta, desenvolve-se o entablamento, composto por arquitrave dupla e lisa, encimada por um friso do tipo dórico, com friso de mútulos ou pingentes e cornija ou frontão triangular.
in scheme: Tesauro SIPA
preferred label: Tuscan order @en
preferred label: Ordre toscan @fr
preferred label: Ordine tuscanico @it
broader: Ordem arquitetónica

Elementos arquitetónicos estruturais simples segundo a função
type: Concept
in scheme: Tesauro SIPA
preferred label: Simple structural elements by function @en
preferred label: Éléments structurels simples selon la fonction @fr
preferred label: Elementi strutturali semplici secondo la funzione @it
hidden label: Elementos arquitectónicos estruturais simples segundo a função
broader: Elementos arquitetónicos estruturais simples
narrower: Elementos arquitetónicos estruturais simples de remate
narrower: Elementos arquitetónicos estruturais simples sustentados
narrower: Elementos arquitetónicos estruturais simples sustentantes

Elementos arquitetónicos estruturais simples de remate
type: Concept
in scheme: Tesauro SIPA
preferred label: Simple crowning structural elements @en
preferred label: Éléments structurels simples de couronnement @fr
preferred label: Elementi strutturali semplici di coronamento @it
hidden label: Elementos arquitectónicos estruturais simples de remate
broader: Elementos arquitetónicos estruturais simples segundo a função
narrower: Elementos arquitetónicos estruturais simples de remate genéricos
narrower: Gablete
narrower: Pináculo
narrower: Platibanda (Elementos arquitetónicos estruturais de remate)
narrower: Vaso (Elementos arquitetónicos estruturais simples de remate)
narrower: Elementos arquitetónicos estruturais simples de remate específicos

Elementos arquitetónicos estruturais simples de remate genéricos
type: Concept
in scheme: Tesauro SIPA
preferred label: Generic crowning structural elements @en
preferred label: Éléments de couronnement génériques @fr
preferred label: Elementi generici di coronamento @it
hidden label: Elementos arquitectónicos estruturais simples de remate genéricos
broader: Elementos arquitetónicos estruturais simples de remate
narrower: Ameia decorativa
narrower: Baldaquino
narrower: Frontão

Ameia decorativa
type: Concept
in scheme: Tesauro SIPA
preferred label: Decorative merlon @en
broader: Elementos arquitetónicos estruturais simples de remate genéricos

Baldaquino
type: Concept
scope note: Remate arquitetónico ou escultórico que resguarda um portal, um altar, um retábulo ou uma escultura.
in scheme: Tesauro SIPA
preferred label: Baldachin @en
preferred label: Baldaquin @fr
preferred label: Baldacchino @it
broader: Elementos arquitetónicos estruturais simples de remate genéricos

Frontão
type: Concept
scope note: Elemento de remate constituído por uma zona maciça, o tímpano, ostentando ou não elementos decorativos, envolvida por uma cornija. Assume várias formas -triangular, semicircular, etc. -, tendo, no primeiro caso, a possibilidade de variar, consoante opta por uma das ordens arquitetónicas clássicas. Pode surgir a rematar um edifício, estrutura ou elemento arquitetónico.
in scheme: Tesauro SIPA
preferred label: Pediment; Gable @en
preferred label: Fronton @fr
preferred label: Frontone @it
broader: Elementos arquitetónicos estruturais simples de remate genéricos
narrower: Componentes do frontão
narrower: Frontão segundo o tipo

Componentes do frontão
type: Concept
in scheme: Tesauro SIPA
preferred label: Pediment; Gable components @en
preferred label: Composants du fronton @fr
preferred label: Componenti del frontone @it
broader: Frontão
narrower: Cornija (Frontão)
narrower: Tímpano

Cornija (Frontão)
type: Concept
scope note: Conjunto de molduras em ressalto que serve de moldura ao frontão, podendo apresentar vários tipos de perfis.
in scheme: Tesauro SIPA
preferred label: Cornice (Pediment; Gable) @en
preferred label: Corniche (Fronton) @fr
preferred label: Cornice (Frontone) @it
broader: Componentes do frontão

Tímpano
type: Concept
scope note: Espaço compreendido entre a cornija de um frontão, podendo surgir pleno ou vazado, com elementos decorativos variados.
in scheme: Tesauro SIPA
preferred label: Tympanum @en
broader: Componentes do frontão

Frontão segundo o tipo
type: Concept
in scheme: Tesauro SIPA
preferred label: Pediment by type @en
preferred label: Fronton selon le type @fr
preferred label: Frontone per tipologia @it
broader: Frontão
narrower: Frontão com enrolamento
narrower: Frontão duplo
narrower: Frontão interrompido
narrower: Frontão semicircular
narrower: Frontão triangular
narrower: Frontão vazado

Frontão com enrolamento
type: Concept
scope note: Tipo de frontão, em que os lados inclinados assumem formas contracurvadas.
in scheme: Tesauro SIPA
preferred label: Pediment with windings @en
broader: Frontão segundo o tipo

Frontão duplo
type: Concept
scope note: Tipo de frontão que integra no seu tímpano um segundo frontão, de tipologia semelhante ou distinta.
in scheme: Tesauro SIPA
preferred label: Double pediment @en
broader: Frontão segundo o tipo

Frontão interrompido
type: Concept
scope note: Tipo de frontão, em que os lados não se unem no vértice ou nos ângulos da base.
in scheme: Tesauro SIPA
preferred label: Broken pediment @en
alternative label: Frontão cortado
broader: Frontão segundo o tipo
narrower: Frontão de lanços
narrower: Frontão entrecortado
narrower: Frontão ondulado
narrower: Frontão sem retorno

Frontão de lanços
type: Concept
scope note: Tipo de frontão interrompido, em que o vértice é substituído por um elemento ornamental.
in scheme: Tesauro SIPA
preferred label: Broken pediment @en
broader: Frontão interrompido

Frontão entrecortado
type: Concept
scope note: Tipo de frontão sem base e com os lados inclinados em perfil contracurvado e com molduras quebradas.
in scheme: Tesauro SIPA
preferred label: Broken pediment @en
broader: Frontão interrompido

Frontão ondulado
type: Concept
scope note: Tipo de frontão, desenvolvido em várias secções sobrepostas e contracurvadas.
in scheme: Tesauro SIPA
preferred label: Curved pediment @en
broader: Frontão interrompido

Frontão sem retorno
type: Concept
scope note: Tipo de frontão, interrompido nos vértices inferiores.
in scheme: Tesauro SIPA
preferred label: Broken pediment @en
broader: Frontão interrompido

Frontão semicircular
type: Concept
scope note: Tipo de frontão com a base plana e com perfil curvo.
in scheme: Tesauro SIPA
preferred label: Semicircular pediment @en
broader: Frontão segundo o tipo

Frontão triangular
type: Concept
scope note: Tipo de frontão com três lados todos iguais.
in scheme: Tesauro SIPA
preferred label: Triangular pediment @en
broader: Frontão segundo o tipo
narrower: Frontão abaixado
narrower: Frontão agudo

Frontão abaixado
type: Concept
in scheme: Tesauro SIPA
preferred label: Lowered pediment @en
broader: Frontão triangular

Frontão agudo
type: Concept
scope note: Tipo de frontão triangular com os segmentos laterais maiores do que a base.
in scheme: Tesauro SIPA
preferred label: Triangular pediment @en
broader: Frontão triangular

Frontão vazado
type: Concept
scope note: Tipo de frontão com o tímpano rasgado por elemento vazado, na forma de óculo ou pequena janela.
in scheme: Tesauro SIPA
preferred label: Hollow pediment @en
alternative label: Frontão aberto
broader: Frontão segundo o tipo

Gablete
type: Concept
scope note: Remate superior de um arco ou portal, apresentando uma moldura triangular, que pode ostentar decoração ou nichos com imagens.
in scheme: Tesauro SIPA
preferred label: Gablet @en
preferred label: Pignon @fr
preferred label: Timpano @it
broader: Elementos arquitetónicos estruturais simples de remate

Pináculo
type: Concept
scope note: Elemento que remata um contraforte, arcobotante ou cunhal de um edifício ou estrutura.
in scheme: Tesauro SIPA
preferred label: Pinnacle @en
preferred label: Pinacle @fr
preferred label: Pinnacolo @it
broader: Elementos arquitetónicos estruturais simples de remate
narrower: Fogaréu
narrower: Pináculo bolboso
narrower: Pináculo de bola
narrower: Pináculo de pera
narrower: Pináculo piramidal
narrower: Pináculo tipo balaústre

Fogaréu
type: Concept
scope note: Tipo de pináculo, constituído por uma base e por elementos ondulados, a imitar labaredas.
in scheme: Tesauro SIPA
preferred label: Flame-shape ornament @en
broader: Pináculo

Pináculo bolboso
type: Concept
in scheme: Tesauro SIPA
preferred label: Bulbous pinnacle @en
broader: Pináculo

Pináculo de bola
type: Concept
scope note: Tipo de pináculo com o elemento de remate formado por um corpo esférico.
in scheme: Tesauro SIPA
preferred label: Ball pinnacle @en
broader: Pináculo

Pináculo de pera
type: Concept
in scheme: Tesauro SIPA
preferred label: Pear-shape pinnacle @en
broader: Pináculo

Pináculo piramidal
type: Concept
scope note: Tipo de pináculo em forma de pirâmide.
in scheme: Tesauro SIPA
preferred label: Pyramidal pinnacle @en
broader: Pináculo
narrower: Pináculo piramidal com bola

Pináculo piramidal com bola
type: Concept
scope note: Tipo de pináculo em forma de pirâmide, rematado por uma esfera.
in scheme: Tesauro SIPA
preferred label: Pyramidal pinnacle with ball @en
broader: Pináculo piramidal

Pináculo tipo balaústre
type: Concept
in scheme: Tesauro SIPA
preferred label: Baluster pinnacle @en
broader: Pináculo

Platibanda (Elementos arquitetónicos estruturais de remate)
type: Concept
scope note: Elemento de resguardo de um imóvel, construído no topo da fachada ou sobre o beirado com uma função decorativa, escondendo a cobertura (telhado ou terraço) e contribuindo esteticamente para o conjunto da fachada. Pode assumir diversas formas decorativas e conter elementos como frontões, grades, balaústres, pedras de armas ou troféus coroando as esquinas.
in scheme: Tesauro SIPA
preferred label: Platband (Generic trimming structural elements) @en
preferred label: Platebande (Éléments structurels simples de couronnement) @fr
preferred label: Platibanda (Elementi strutturali semplici di coronamento) @it
broader: Elementos arquitetónicos estruturais simples de remate
narrower: Componentes da platibanda
narrower: Platibanda segundo o tipo

Componentes da platibanda
type: Concept
in scheme: Tesauro SIPA
preferred label: Platband components @en
preferred label: Composants de la plate-bande @fr
preferred label: Componenti della platibanda @it
broader: Platibanda (Elementos arquitetónicos estruturais de remate)
narrower: Cimalhete

Cimalhete
type: Concept
scope note: Parte superior da platibanda.
in scheme: Tesauro SIPA
preferred label: Cyma @en
broader: Componentes da platibanda

Platibanda segundo o tipo
type: Concept
in scheme: Tesauro SIPA
preferred label: Platband by type @en
preferred label: Plate-bande selon le type @fr
preferred label: Platibanda per tipologia @it
broader: Platibanda (Elementos arquitetónicos estruturais de remate)
narrower: Platibanda plena
narrower: Platibanda vazada

Platibanda plena
type: Concept
scope note: Tipo de platibanda com a superfície cheia.
in scheme: Tesauro SIPA
preferred label: Full platband @en
broader: Platibanda segundo o tipo

Platibanda vazada
type: Concept
scope note: Tipo de platibanda com a superfície vazada.
in scheme: Tesauro SIPA
preferred label: Hollow platband @en
broader: Platibanda segundo o tipo

Vaso (Elementos arquitetónicos estruturais simples de remate)
type: Concept
scope note: Peça em forma de vaso colocada no remate de um edifício ou estrutura, sobre um soco ou pedestal, feita em vários materiais, como barro, pedra ou bronze, ostentando ou não decoração.
in scheme: Tesauro SIPA
preferred label: Vase (Simple crowning structural elements) @en
broader: Elementos arquitetónicos estruturais simples de remate
narrower: Urna

Urna
type: Concept
scope note: Peça em forma de urna bojuda colocada no remate de um edifício ou estrutura, sobre um soco ou pedestal, feita em vários materiais, como barro, pedra ou bronze, ostentando ou não decoração.
in scheme: Tesauro SIPA
preferred label: Vessel @en
broader: Vaso (Elementos arquitetónicos estruturais simples de remate)
narrower: Urna tipo Médicis

Urna tipo Médicis
type: Concept
in scheme: Tesauro SIPA
preferred label: Gourd-shaped vessel (Medici style) @en
broader: Urna

Elementos arquitetónicos estruturais simples de remate específicos
type: Concept
in scheme: Tesauro SIPA
preferred label: Specific simple crowning structural elements @en
preferred label: Éléments structurels simples de couronnement spécifiques @fr
preferred label: Elementi strutturali semplici di coronamento specifici @it
hidden label: Elementos arquitectónicos estruturais simples de remate específicos
broader: Elementos arquitetónicos estruturais simples de remate
narrower: Elementos arquitetónicos simples de remate segundo o tipo arquitetónico

Elementos arquitetónicos simples de remate segundo o tipo arquitetónico
type: Concept
in scheme: Tesauro SIPA
preferred label: Simple crowning elements by architectural type @en
preferred label: Éléments simples de couronnement selon le type architectural @fr
preferred label: Elementi semplici di coronamento secondo tipo architettonico @it
hidden label: Elementos arquitectónicos simples de remate segundo o tipo arquitectónico
broader: Elementos arquitetónicos estruturais simples de remate específicos
narrower: Parapeito (Elementos arquitetónicos de remate)

Parapeito (Elementos arquitetónicos de remate)
type: Concept
scope note: Muro que remata os edifícios e estruturas de uma fortificação medieval ou moderna, para proteção dos seus defensores, no último caso surgindo acima do reparo e disposto, normalmente, sobre o cordão.
in scheme: Tesauro SIPA
preferred label: Parapet (Architectural trim elements) @en
preferred label: Parapet (Éléments architecturaux de finition) @fr
preferred label: Parapetto (Elementi architettonici di finitura) @it
broader: Elementos arquitetónicos simples de remate segundo o tipo arquitetónico
narrower: Parapeito ameado
narrower: Parapeito coberto
narrower: Parapeito liso
narrower: Parapeito de merlões
modified: 2025-09-23T13:42:54

Parapeito ameado
type: Concept
scope note: Parapeito de uma fortificação medieval ou de transição que remata em ameias e abertas.
in scheme: Tesauro SIPA
preferred label: Crenellated parapet @en
broader: Parapeito (Elementos arquitetónicos de remate)
narrower: Aberta
narrower: Ameia

Aberta
type: Concept
scope note: Acesso numa fortificação medieval em que a entrada no recinto se faz entre muros construídos paralelamente, de modo a criar um percurso em ângulo reto até à porta principal, evitando o enfiamento dos vãos. O cotovelo pode ser simples ou duplo, conformo o número de ângulos.
in scheme: Tesauro SIPA
preferred label: Passageway @en
broader: Parapeito ameado
narrower: Aberta a alargar para o interior
narrower: Aberta com esbarro

Aberta a alargar para o interior
type: Concept
scope note: Aberta que alarga para o interior, permitindo maior abrangência de arremesso.
in scheme: Tesauro SIPA
preferred label: Passageway widening inward @en
broader: Aberta

Aberta com esbarro
type: Concept
scope note: Aberta com esbarro para o exterior dos muros, de modo a favorecer o tiro mergulhante.
in scheme: Tesauro SIPA
preferred label: Back gauge passageway @en
broader: Aberta

Ameia
type: Concept
scope note: Elemento maciço disposto sobre o parapeito que remata os edifícios e estruturas da fortificação medieval, servindo de proteção aos seus defensores colocados nos adarves, e que intercala com a aberta.
in scheme: Tesauro SIPA
preferred label: Bastione @it
preferred label: Crenel @en
preferred label: Créneau @fr
broader: Parapeito ameado
narrower: Ameia de corpo estreito
narrower: Ameia de corpo largo

Ameia de corpo estreito
type: Concept
scope note: Elemento maciço do parapeito de uma fortificação medieval com largura sensivelmente igual à da aberta.
in scheme: Tesauro SIPA
preferred label: Narrow-bodied battlement @en
broader: Ameia

Ameia de corpo largo
type: Concept
scope note: Elemento maciço do parapeito de uma fortificação medieval nitidamente mais larga do que a aberta. Começou a ser construída no final do século XIV, sobretudo a rematar as barbacãs, tornando-se característica do século XV, visto oferecer maior segurança e proteção ao defensor.
in scheme: Tesauro SIPA
preferred label: Wide-bodied battlement @en
broader: Ameia

Parapeito coberto
type: Concept
scope note: Parapeito construído numa fortificação moderna com grande espessura, de modo a criar espaço interior, o qual pode ser rasgado por frestas de tiro.
in scheme: Tesauro SIPA
preferred label: Covered parapet @en
preferred label: Parapet couvert @fr
preferred label: Parapetto coperto @it
broader: Parapeito (Elementos arquitetónicos de remate)

Parapeito liso
type: Concept
scope note: Muro simples e baixo que remata os edifícios e estruturas de uma fortificação medieval ou moderna, no último caso permitindo fazer tiro a barbete, ou seja, em várias direções.
in scheme: Tesauro SIPA
preferred label: Flat parapet @en
broader: Parapeito (Elementos arquitetónicos de remate)

Parapeito de merlões
type: Concept
scope note: Parapeito numa fortificação moderna composto por merlões e canhoneiras, onde o campo de tiro é mais limitado do que no parapeito liso.
in scheme: Tesauro SIPA
preferred label: Crenellated parapet @en
preferred label: Parapet à merlon @fr
preferred label: Parapetto a merli @it
broader: Parapeito (Elementos arquitetónicos de remate)
narrower: Canhoneira (Parapeito de merlões)
narrower: Merlão
narrower: Parapeito de rondas

Canhoneira (Parapeito de merlões)
type: Concept
scope note: Vão retangular no parapeito da fortificação de transição e moderna, entre os merlões, por onde disparavam as armas de artilharia. Na fortificação moderna, são compostas por três partes: a boca interior, do lado do terrapleno, a gola, na grossura do parapeito, e a boca exterior, ou saída do lado da campanha.
in scheme: Tesauro SIPA
preferred label: Embrasure (Crenellated parapet) @en
preferred label: Canonnière (Parapet à merlon) @fr
preferred label: Cannoniere (Parapetto a merli) @it
broader: Parapeito de merlões
narrower: Canhoneira coberta (Parapeito de merlões)

Canhoneira coberta (Parapeito de merlões)
type: Concept
scope note: Canhoneira rasgada no parapeito da fortificação moderna com o vão coberto superiormente, de modo a garantir maior segurança da artilharia, ou para dificultar que a mesma fosse vista pelo inimigo.
in scheme: Tesauro SIPA
preferred label: Covered embrasure (Crenellated parapet) @en
preferred label: Canonnière couverte (Parapet à merlon) @fr
preferred label: Cannoniere coperta (Parapetto a merli) @it
broader: Canhoneira (Parapeito de merlões)

Merlão
type: Concept
scope note: Elemento maciço do parapeito de uma fortificação moderna entre cada uma das canhoneiras.
in scheme: Tesauro SIPA
preferred label: Merlon @en
preferred label: Merlone @it
broader: Parapeito de merlões

Parapeito de rondas
type: Concept
in scheme: Tesauro SIPA
preferred label: Wall-walk parapet @en
preferred label: Parapet de chemin de ronde @fr
preferred label: Parapetto della ronda @it
broader: Parapeito de merlões

Elementos arquitetónicos estruturais simples sustentados
type: Concept
in scheme: Tesauro SIPA
preferred label: Simple supported structural elements @en
preferred label: Éléments structurels simples portés @fr
preferred label: Elementi strutturali semplici sostenuti @it
hidden label: Elementos arquitectónicos estruturais simples sustentados
broader: Elementos arquitetónicos estruturais simples segundo a função
narrower: Arco
narrower: Entablamento

Arco
type: Concept
scope note: Elemento constituído por uma série de aduelas talhadas em cunha, que emoldura um vão, apoiadas umas nas outras lateralmente e sujeitas a esforços de compressão, tendo por função transmitir as cargas verticais ao longo do seu eixo, para os pontos de apoio em que se sustenta. É executado em vários materiais (pedra, tijolo, ferro, madeira) e apresenta várias formas, podendo assumir um mero carácter decorativo.
in scheme: Tesauro SIPA
preferred label: Arch @en
preferred label: Arc @fr
broader: Elementos arquitetónicos estruturais simples sustentados
narrower: Componentes do arco
narrower: Arco segundo a forma
narrower: Arco segundo a função

Componentes do arco
type: Concept
in scheme: Tesauro SIPA
preferred label: Arch components @en
preferred label: Composants de l’arc @fr
preferred label: Componenti dell'arco @it
broader: Arco
narrower: Aduela
narrower: Arquivolta
narrower: Enjunta
narrower: Espelho (Arco)
narrower: Imposta
narrower: Linha de arranque
narrower: Lóbulo
narrower: Represa (Componentes do arco)
narrower: Rim (Arco)

Aduela
type: Concept
scope note: Cada um dos silhares que forma o arco. São talhados em cunha, para permitir a formatura da secção curva. Podem apresentar-se simples ou decoradas.
in scheme: Tesauro SIPA
preferred label: Voussoir @en
preferred label: Claveaux (Voussoir) @fr
preferred label: Cuneo @it
alternative label: Balsor
alternative label: Cunha
broader: Componentes do arco
narrower: Aduela em ressalto
narrower: Contrafecho
narrower: Pedra de fecho

Aduela em ressalto
type: Concept
scope note: Aduela que se prolonga horizontalmente, imbrincando-se no aparelho do muro.
in scheme: Tesauro SIPA
preferred label: Rebound; Shoulder voussoir @en
broader: Aduela

Contrafecho
type: Concept
scope note: Cada uma das aduelas que ladeiam a de fecho, no topo de um arco.
in scheme: Tesauro SIPA
preferred label: Voussoir on either side of a keystone @en
alternative label: Ada
broader: Aduela

Pedra de fecho
type: Concept
scope note: Aduela que fecha o vértice do arco, podendo ser saliente ou decorada.
in scheme: Tesauro SIPA
preferred label: Headstone; Archstone @en
preferred label: Clé de voûte @fr
preferred label: Chiave di volta @it
alternative label: Chave (Aduela)
broader: Aduela

Arquivolta
type: Concept
scope note: Conjunto de arcos sobrepostos num vão ou, por extensão, o conjunto de molduras que se salientam nas aduelas do arco.
in scheme: Tesauro SIPA
preferred label: Archivolt @en
preferred label: Archivolte @fr
preferred label: Archivolto @it
broader: Componentes do arco

Enjunta
type: Concept
scope note: Pano de muro existente entre o arco e o alfiz.
in scheme: Tesauro SIPA
preferred label: Sprandel @en
alternative label: Seguintes (Arco)
broader: Componentes do arco

Espelho (Arco)
type: Concept
scope note: Superfície decorada e vazada que orna o interior de um arco.
in scheme: Tesauro SIPA
preferred label: Mirror-clad (Arch) @en
broader: Componentes do arco

Imposta
type: Concept
scope note: Silhar de onde arranca o arco, assente na parede ou capitéis, podendo apresentar-se saliente e decorado.
in scheme: Tesauro SIPA
preferred label: Impost (Crossbeams) @en
preferred label: Imposte @fr
preferred label: Piedritto @it
alternative label: Cimásio
broader: Componentes do arco
narrower: Capitel de imposta

Capitel de imposta
type: Concept
scope note: Imposta em forma de capitel, assente diretamente na ombreira do vão.
in scheme: Tesauro SIPA
preferred label: Impost capital @en
broader: Imposta

Linha de arranque
type: Concept
scope note: Parte superior do elemento de onde arranca o arco.
in scheme: Tesauro SIPA
preferred label: Starting line @en
broader: Componentes do arco

Lóbulo
type: Concept
scope note: Cada segmento de círculo que forma um arco polilobulado.
in scheme: Tesauro SIPA
preferred label: Foil @en
alternative label: Lobélio
broader: Componentes do arco

Represa (Componentes do arco)
type: Concept
scope note: Silhar de onde arrancam dois arcos ultrapassados.
in scheme: Tesauro SIPA
preferred label: Bracket (Arch components) @en
broader: Componentes do arco

Rim (Arco)
type: Concept
scope note: Aduela do arco situada a meia distância, entre a linha de arranque e a pedra de fecho do mesmo.
in scheme: Tesauro SIPA
preferred label: Sprandel (Arch) @en
broader: Componentes do arco

Arco segundo a forma
type: Concept
in scheme: Tesauro SIPA
preferred label: Arch by shape @en
preferred label: Arc selon la forme @fr
preferred label: Arco per forma @it
broader: Arco
narrower: Arco abatido
narrower: Arco achatado
narrower: Arco angular
narrower: Arco aviajado
narrower: Arco campanulado
narrower: Arco canopial
narrower: Arco de volta perfeita
narrower: Arco dobrado
narrower: Arco em cortina
narrower: Arco em ferradura
narrower: Arco polilobado
narrower: Arco apontado
narrower: Arco parabólico

Arco abatido
type: Concept
scope note: Arco com curvatura inferior à de uma circunferência.
in scheme: Tesauro SIPA
preferred label: Depressed arch @en
alternative label: Arco em sarapanel
alternative label: Arco rebaixado
broader: Arco segundo a forma
narrower: Arco abaulado
narrower: Arco em asa de cesto
narrower: Arco tudor

Arco abaulado
type: Concept
scope note: Arco com o fecho situado num nível mais baixo que o dos seus arranques.
in scheme: Tesauro SIPA
preferred label: Tented arch @en
broader: Arco abatido

Arco em asa de cesto
type: Concept
scope note: Arco formado pela interceção de dois círculos com raios diferentes, criando o perfil de uma asa de cesto.
in scheme: Tesauro SIPA
preferred label: Depressed arch; Surbased arch @en
alternative label: Arco de escarção
broader: Arco abatido

Arco tudor
type: Concept
scope note: Arco abatido, de quatro centros e rematado em ângulo, característico do gótico inglês.
in scheme: Tesauro SIPA
preferred label: Tudor arch @en
preferred label: Arc Tudor @fr
broader: Arco abatido

Arco achatado
type: Concept
scope note: Arco com o intradorso plano, mas formado por aduelas radiantes.
in scheme: Tesauro SIPA
preferred label: Flattened arch @en
alternative label: Arco plano
broader: Arco segundo a forma

Arco angular
type: Concept
scope note: Arco com o intradorso a formar dois segmentos de reta, com ângulo no topo.
in scheme: Tesauro SIPA
preferred label: Angular arch @en
alternative label: Arco de mitra
alternative label: Arco em frontão
alternative label: Arco falso
broader: Arco segundo a forma
narrower: Arco angular truncado
narrower: Arco em ziguezague

Arco angular truncado
type: Concept
scope note: Arco com o intradorso a formar dois segmentos de reta, truncado no topo, com o perfil de um trapézio.
in scheme: Tesauro SIPA
preferred label: Truncated angular arch @en
preferred label: Arc angulaire tronquée @fr
preferred label: Arco angolare troncato @it
broader: Arco angular

Arco em ziguezague
type: Concept
scope note: Arco falso com o intradorso em dentes de serra.
in scheme: Tesauro SIPA
preferred label: Zigzag arch @en
preferred label: Arc en zigzag @fr
preferred label: Arco a zigzag @it
broader: Arco angular

Arco aviajado
type: Concept
scope note: Arco em que as linhas de arranque estão situadas em planos diferentes.
in scheme: Tesauro SIPA
preferred label: Bow sent arch @en
alternative label: Arco montante
broader: Arco segundo a forma
narrower: Arco em talude

Arco em talude
type: Concept
scope note: Arco aviajado, em que o extradorso forma um plano oblíquo.
in scheme: Tesauro SIPA
preferred label: Talus arch @en
preferred label: Arc en talus @fr
preferred label: Arco a talù @it
broader: Arco aviajado

Arco campanulado
type: Concept
scope note: Arco semelhante a um sino.
in scheme: Tesauro SIPA
preferred label: Bell-shaped arch @en
preferred label: Arc campaniforme @fr
preferred label: Arco a campana @it
broader: Arco segundo a forma

Arco canopial
type: Concept
scope note: Arco composto por curva e contracurva, desenvolvidas em sentidos opostos.
in scheme: Tesauro SIPA
preferred label: Ogee arch; Flamboyant arch @en
alternative label: Arco contracurvado
alternative label: Arco de colchete
broader: Arco segundo a forma

Arco de volta perfeita
type: Concept
scope note: Arco que forma uma semicircunferência.
in scheme: Tesauro SIPA
preferred label: Round arch @en
alternative label: Arco a pleno centro
alternative label: Arco de meio ponto
alternative label: Arco de volta inteira
alternative label: Arco de volta redonda
alternative label: Arco pleno
alternative label: Arco redondo
broader: Arco segundo a forma
narrower: Arco alteado

Arco alteado
type: Concept
scope note: Arco com a curvatura mais alta que a do arco de volta perfeita.
in scheme: Tesauro SIPA
preferred label: Stilted arch @en
alternative label: Arco peraltado
broader: Arco de volta perfeita

Arco dobrado
type: Concept
scope note: Arco formado por duas filas de aduelas sobrepostas, sendo as superiores mais largas.
in scheme: Tesauro SIPA
preferred label: Bended arch @en
broader: Arco segundo a forma

Arco em cortina
type: Concept
scope note: Arco que forma um ou vários segmentos de círculo com o centro exterior ao vão, assemelhando-se a uma cortina.
in scheme: Tesauro SIPA
preferred label: Segmental arch @en
preferred label: Arc en segment de cercle @fr
preferred label: Arco segmentale @it
broader: Arco segundo a forma

Arco em ferradura
type: Concept
scope note: Arco formado por um segmento de círculo superior a 180º.
in scheme: Tesauro SIPA
preferred label: Horseshoe arch @en
alternative label: Arco mourisco
alternative label: Arco ultrapassado
broader: Arco segundo a forma
narrower: Arco em ferradura apontada

Arco em ferradura apontada
type: Concept
scope note: Tipo de arco em ferradura constituído por dois segmentos circulares, levemente apontados.
in scheme: Tesauro SIPA
preferred label: Pointed horseshoe arch @en
broader: Arco em ferradura

Arco polilobado
type: Concept
scope note: Arco que apresenta vários segmentos de círculo, com o centro interior ao vão.
in scheme: Tesauro SIPA
preferred label: Lobed arch @en
alternative label: Arco recortado
broader: Arco segundo a forma
narrower: Arco quadrilobado
narrower: Arco trilobado

Arco quadrilobado
type: Concept
scope note: Arco formado por quatro segmentos de círculo.
in scheme: Tesauro SIPA
preferred label: Quadrifoil arch @en
broader: Arco polilobado

Arco trilobado
type: Concept
scope note: Arco formado por três segmentos de círculo.
in scheme: Tesauro SIPA
preferred label: Trefoil arch @en
broader: Arco polilobado

Arco apontado
type: Concept
scope note: Arco constituído por dois segmentos de círculo que se intercetam, criando um ângulo de amplitude variável.
in scheme: Tesauro SIPA
preferred label: Pointed arch @en
preferred label: Arc en ogive @fr
preferred label: Arco a sesto acuto @it
alternative label: Arco ogival
alternative label: Arco quebrado
broader: Arco segundo a forma
narrower: Arco agudo
narrower: Arco lanceolado

Arco agudo
type: Concept
scope note: Arco formado por dois segmentos de reta, com ângulo no fecho.
in scheme: Tesauro SIPA
preferred label: Acute arch @en
broader: Arco apontado

Arco lanceolado
type: Concept
scope note: Arco quebrado ultrapassado, tendo a forma de uma lança aguçada.
in scheme: Tesauro SIPA
preferred label: Lanceolate arch @en
broader: Arco apontado

Arco parabólico
type: Concept
scope note: Arco em forma de parábola.
in scheme: Tesauro SIPA
preferred label: Parabolic arch @en
preferred label: Arc parabolique @fr
preferred label: Arco parabolico @it
broader: Arco segundo a forma

Arco segundo a função
type: Concept
in scheme: Tesauro SIPA
preferred label: Arch by function @en
preferred label: Arc selon la fonction @fr
preferred label: Arco per funzione @it
broader: Arco
narrower: Arco de reforço
narrower: Arco diafragma
narrower: Arco formeiro
narrower: Arco toral
narrower: Arcobotante

Arco de reforço
type: Concept
scope note: Arco visível no intradorso dos pés-direitos de uma abóbada, servindo-lhe de esteio ou apenas como elemento decorativo.
in scheme: Tesauro SIPA
preferred label: Reinforcement arch @en
alternative label: Arco de abóbada
broader: Arco segundo a função

Arco diafragma
type: Concept
scope note: Arco que atravessa transversalmente uma abóbada, tendo o extradorso prolongado em pano de muro, escorando-a mais eficazmente; pode ser aplicado num espaço não abobadado, servindo para escorar um muro ou parede.
in scheme: Tesauro SIPA
preferred label: Diaphragm arch @en
broader: Arco segundo a função

Arco formeiro
type: Concept
scope note: Arco situado nos flancos de uma abóbada, ao nível do seu arranque e paralelo ao seu eixo, permitindo minorar e transportar o peso que esta exerce.
in scheme: Tesauro SIPA
preferred label: Semicircular arch; Chancel arch @en
broader: Arco segundo a função

Arco toral
type: Concept
scope note: Arco que corta transversalmente uma abóbada, escorando os muros, e que descarrega, normalmente, em colunas ou pilastras embebidas no muro. Num edifício de culto religioso, pode determinar o número de tramos de cada um dos espaços que o compõem.
in scheme: Tesauro SIPA
preferred label: Transverse arch @en
broader: Arco segundo a função

Arcobotante
type: Concept
scope note: Arco em talude que partindo de um contraforte exterior vence um vão ou distância descarregando num arco, abóbada ou pilar. É muito comum em grandes estruturas de pedra como igrejas e catedrais.
in scheme: Tesauro SIPA
preferred label: Flying buttress @en
preferred label: Arc-boutant @fr
preferred label: Arco rampante @it
broader: Arco segundo a função
narrower: Botaréu

Botaréu
type: Concept
scope note: Contraforte que ajuda a descarregar o peso transportado por um arcobotante.
in scheme: Tesauro SIPA
preferred label: Abutment @en
alternative label: Estribo (Arcobotante)
broader: Arcobotante

Entablamento
type: Concept
scope note: Elemento predominantemente horizontal, que suporta uma cobertura ou um remate nos edifícios clássicos ou de influência clássica, assente em colunas, pilares ou pilastras, resultando da junção de três componentes, a arquitrave, o friso e a cornija.
in scheme: Tesauro SIPA
preferred label: Entablature @en
preferred label: Entablement @fr
preferred label: Trabeazione @it
broader: Elementos arquitetónicos estruturais simples sustentados
narrower: Arquitrave
narrower: Cornija (Entablamento)
narrower: Friso (Entablamento)

Arquitrave
type: Concept
scope note: Parte inferior do entablamento, assente sobre os capitéis das colunas, pilares ou pilastras, e apresentando dimensões distintas consoante a ordem arquitetónica em que se inscreve. Na ordem dórica, a arquitrave é bastante larga, assumindo a sua maior amplitude, apresentando-se seccionada em dois níveis escalonados, na jónica, e em três, na coríntia.
in scheme: Tesauro SIPA
preferred label: Architrave @en
broader: Entablamento

Cornija (Entablamento)
type: Concept
scope note: Parte superior do entablamento, saliente, permitindo que as águas pluviais não danifiquem as estruturas inferiores, com vários tipos de molduras, consoante a ordem arquitetónica em que se inscreve.
in scheme: Tesauro SIPA
preferred label: Cornice (Entablature) @en
broader: Entablamento
narrower: Cornija arquitravada
narrower: Mútulo

Cornija arquitravada
type: Concept
scope note: Cornija que assenta diretamente numa arquitrave.
in scheme: Tesauro SIPA
preferred label: Architraved cornice @en
broader: Cornija (Entablamento)

Mútulo
type: Concept
scope note: Espécie de mísula existente na base da cornija da ordem dórica e toscana, sob o tríglifo e, por vezes, com a mesma dimensão deste.
in scheme: Tesauro SIPA
preferred label: Mutule @en
broader: Cornija (Entablamento)

Friso (Entablamento)
type: Concept
scope note: Elemento do entablamento situado entre a arquitrave e a cornija, apresentando elementos decorativos distintos consoante a ordem arquitetónica em que se inscreve.
in scheme: Tesauro SIPA
preferred label: Fregio @it
preferred label: Frize (Entablature) @en
preferred label: Frise (Entablement) @fr
broader: Entablamento
narrower: Métopa
narrower: Triglifo

Métopa
type: Concept
scope note: Elemento liso, podendo possuir alguma decoração num friso dórico.
in scheme: Tesauro SIPA
preferred label: Metope @en
preferred label: Métope @fr
preferred label: Metopa @it
alternative label: Ditríglifo
broader: Friso (Entablamento)

Triglifo
type: Concept
scope note: Elemento decorado por dois sulcos e três ressaltos, que compõe um friso dórico.
in scheme: Tesauro SIPA
preferred label: Triglyph @en
broader: Friso (Entablamento)
narrower: Base do triglifo
narrower: Gifo
narrower: Gota
narrower: Meios
narrower: Régula

Base do triglifo
type: Concept
in scheme: Tesauro SIPA
preferred label: Triglyph base @en
broader: Triglifo

Gifo
type: Concept
in scheme: Tesauro SIPA
preferred label: Teniae; Fillet @en
broader: Triglifo

Gota
type: Concept
scope note: Elementos esféricos que prolongam o tríglifo na área da arquitrave na ordem dórica.
in scheme: Tesauro SIPA
preferred label: Guttae @en
broader: Triglifo

Meios
type: Concept
in scheme: Tesauro SIPA
preferred label: ____ @en
broader: Triglifo

Régula
type: Concept
in scheme: Tesauro SIPA
preferred label: Regula @en
broader: Triglifo

Elementos arquitetónicos estruturais simples sustentantes
type: Concept
in scheme: Tesauro SIPA
preferred label: Simple supporting structural elements @en
preferred label: Éléments structurels simples porteurs @fr
preferred label: Elementi strutturali semplici portanti @it
hidden label: Elementos arquitectónicos estruturais simples sustentantes
broader: Elementos arquitetónicos estruturais simples segundo a função
narrower: Acropódio
narrower: Acrotério
narrower: Atlante
narrower: Balaústre
narrower: Cariátide
narrower: Coluna
narrower: Colunelo
narrower: Coluneta
narrower: Contraforte
narrower: Embasamento
narrower: Enxalço
narrower: Esteio (Elementos arquitetónicos estruturais simples sustentantes)
narrower: Estípite
narrower: Estribo (Elementos arquitetónicos estruturais sustentantes)
narrower: Laje (Elementos arquitetónicos estruturais sustentantes)
narrower: Mainel
narrower: Mísula
narrower: Peanha
narrower: Pilar
narrower: Pilastra
narrower: Piloti (Elementos arquitetónicos estruturais sustentantes)
narrower: Plataforma (Elementos arquitetónicos estruturais simples sustentantes)
narrower: Plinto
narrower: Pódio
narrower: Quarteirão (Elementos arquitetónicos estruturais sustentantes)
narrower: Talo
narrower: Tirante

Acropódio
type: Concept
scope note: Pedestal de secção quadrangular e altura diminuta, onde assenta uma estátua.
in scheme: Tesauro SIPA
preferred label: Acropodium @en
broader: Elementos arquitetónicos estruturais simples sustentantes

Acrotério
type: Concept
scope note: Pedestal de pequena dimensão colocado no vértice de um frontão para sustentar estatuária ou um elemento decorativo ou evocativo.
in scheme: Tesauro SIPA
preferred label: Acroterion; Acroterium @en
preferred label: Acrotere @fr
preferred label: Acroterio @it
broader: Elementos arquitetónicos estruturais simples sustentantes

Atlante
type: Concept
scope note: Figura ou meia figura masculina de vulto ou em relevo, que substitui qualquer elemento arquitetónico, como a coluna, o pilar, a mísula, etc.
in scheme: Tesauro SIPA
preferred label: Atlas pillar @en
preferred label: Atlante; Telamon @fr
broader: Elementos arquitetónicos estruturais simples sustentantes

Balaústre
type: Concept
scope note: Pequena coluna de pedra, metal, cerâmica ou madeira, com o fuste percorrido por vários perfis, compondo-se de pedestal, fuste e capitel.
in scheme: Tesauro SIPA
preferred label: Baluster; Stanchion @en
broader: Elementos arquitetónicos estruturais simples sustentantes
narrower: Balaustrino

Balaustrino
type: Concept
scope note: Balaústre de pequenas dimensões.
in scheme: Tesauro SIPA
preferred label: Baluster @en
broader: Balaústre

Cariátide
type: Concept
scope note: Figura feminina de vulto ou em relevo, que substitui qualquer elemento arquitetónico, como coluna, pilar, mísula, etc.
in scheme: Tesauro SIPA
preferred label: Caryatid @en
preferred label: Cariatide @fr
broader: Elementos arquitetónicos estruturais simples sustentantes
narrower: Canéfora

Canéfora
type: Concept
scope note: Figura feminina de vulto ou em relevo com um cesto à cabeça, que substitui qualquer elemento arquitetónico, como coluna, pilar, mísula, etc.
in scheme: Tesauro SIPA
preferred label: Canephorus; Canephor @en
broader: Cariátide

Coluna
type: Concept
scope note: Elemento de suporte vertical e com o corpo de secção curva, com uma função estrutural de suporte de cargas ao longo do seu eixo, funcionando à compressão, embora com menor poder de sustentação que um pilar. É composta por base, fuste, podendo este formar um cilindro perfeito ou apresentar uma ligeira convexidade (entase), e capitel.
in scheme: Tesauro SIPA
preferred label: Column @en
preferred label: Colonne @fr
preferred label: Colonna @it
broader: Elementos arquitetónicos estruturais simples sustentantes
narrower: Coluna segundo a forma do capitel
narrower: Coluna segundo a forma do fuste
narrower: Coluna segundo a implantação
related: Atributos formais segundo o posicionamento
related: Colunata
related: Ordem arquitetónica
modified: 2025-09-23T13:43:20

Coluna segundo a forma do capitel
type: Concept
in scheme: Tesauro SIPA
preferred label: Column according to capital shape @en
preferred label: Colonne selon la forme du chapiteau @fr
preferred label: Colonna secondo la forma del capitello @it
broader: Coluna
narrower: Coluna acantonada
narrower: Coluna campaniforme
narrower: Coluna eólica
narrower: Coluna lotiforme
narrower: Coluna palmiforme
narrower: Coluna papiriforme

Coluna acantonada
type: Concept
scope note: Coluna que possui o capitel ornado por acantos.
in scheme: Tesauro SIPA
preferred label: Ornamented column @en
broader: Coluna segundo a forma do capitel

Coluna campaniforme
type: Concept
scope note: Coluna que possui o capitel em forma de sino invertido.
in scheme: Tesauro SIPA
preferred label: Bell-shaped column @en
broader: Coluna segundo a forma do capitel

Coluna eólica
type: Concept
scope note: Coluna que possui o capitel formado por duas folhas de acanto.
in scheme: Tesauro SIPA
preferred label: Aeolian column @en
broader: Coluna segundo a forma do capitel

Coluna lotiforme
type: Concept
scope note: Coluna que possui o capitel em forma de folha de lótus. Muito utilizada e difundido na arte pré-clássica, voltaria a ser retomada na arte neoclássica.
in scheme: Tesauro SIPA
preferred label: Lotiform column @en
broader: Coluna segundo a forma do capitel

Coluna palmiforme
type: Concept
scope note: Coluna que possui o capitel em forma de palmeira.
in scheme: Tesauro SIPA
preferred label: Palm-shaped column @en
broader: Coluna segundo a forma do capitel

Coluna papiriforme
type: Concept
scope note: Coluna que possui o capitel em forma de papiro estilizado. Utilizada na arte pré-clássica, seria retomada na arte neoclássica.
in scheme: Tesauro SIPA
preferred label: Papyriform column @en
broader: Coluna segundo a forma do capitel

Coluna segundo a forma do fuste
type: Concept
in scheme: Tesauro SIPA
preferred label: Column according to shaft shape @en
preferred label: Colonne selon la forme du fût @fr
preferred label: Colonna in base alla forma del fusto @it
broader: Coluna
narrower: Coluna almofadada
narrower: Coluna anelada
narrower: Coluna canelada
narrower: Coluna embastonada
narrower: Coluna cilíndrica
narrower: Coluna cóclida
narrower: Coluna colossal
narrower: Coluna corolítica
narrower: Coluna delgada
narrower: Coluna em contratura
narrower: Coluna em entase
narrower: Coluna ensamblada
narrower: Coluna estriada
narrower: Coluna facetada
narrower: Coluna fasciculada
narrower: Coluna fuselada
narrower: Coluna galbada
narrower: Coluna manubial
narrower: Coluna monolítica
narrower: Coluna rostral
narrower: Coluna rusticada
narrower: Coluna tipo balaústre
narrower: Coluna torsa

Coluna almofadada
type: Concept
scope note: Coluna que possui um fuste composto por tambores irregulares ou se encontra revestido por cubos ou almofadas intervaladas.
in scheme: Tesauro SIPA
preferred label: Padded column @en
broader: Coluna segundo a forma do fuste

Coluna anelada
type: Concept
scope note: Coluna que possui um fuste ornado por anéis.
in scheme: Tesauro SIPA
preferred label: Ringed column @en
broader: Coluna segundo a forma do fuste

Coluna canelada
type: Concept
scope note: Coluna que possui um fuste ornado por caneluras na sua totalidade ou nos dois terços superiores.
in scheme: Tesauro SIPA
preferred label: Fluted column @en
preferred label: Colonne cannelée @fr
preferred label: Colonna scalanata @it
broader: Coluna segundo a forma do fuste

Coluna embastonada
type: Concept
scope note: Coluna com o fuste canelado, apresentando, no terço ou metade inferior, as caneluras preenchidas por bastonetes.
in scheme: Tesauro SIPA
preferred label: Battered column @en
broader: Coluna segundo a forma do fuste

Coluna cilíndrica
type: Concept
scope note: Coluna que possui um fuste sem entase, sendo frequentemente usada na arquitetura religiosa românica e nas igrejas maneiristas, em Portugal.
in scheme: Tesauro SIPA
preferred label: Cylindrical column @en
broader: Coluna segundo a forma do fuste

Coluna cóclida
type: Concept
scope note: Coluna oca, tendo no seu interior uma escada ou ascensor.
in scheme: Tesauro SIPA
preferred label: Spiral column @en
preferred label: Colonne torsadée @fr
preferred label: Colonna tortile @it
broader: Coluna segundo a forma do fuste

Coluna colossal
type: Concept
scope note: Coluna com um fuste de grandes dimensões, permitindo acompanhar dois ou mais pisos de um edifício ou estrutura.
in scheme: Tesauro SIPA
preferred label: Colossal column @en
broader: Coluna segundo a forma do fuste

Coluna corolítica
type: Concept
scope note: Coluna que possui um fuste ornado por elementos espiralados de folhas ou flores.
in scheme: Tesauro SIPA
preferred label: Corollitic column @en
broader: Coluna segundo a forma do fuste

Coluna delgada
type: Concept
scope note: Coluna que possui um fuste demasiado fino e alto, desproporcional ao cânone da ordem arquitetónica a que pertence.
in scheme: Tesauro SIPA
preferred label: Slender column @en
broader: Coluna segundo a forma do fuste

Coluna em contratura
type: Concept
scope note: Coluna que possui um fuste cujo diâmetro vai diminuindo a partir do seu terço inferior.
in scheme: Tesauro SIPA
preferred label: Contracture column @en
broader: Coluna segundo a forma do fuste

Coluna em entase
type: Concept
scope note: Coluna com o fuste ligeiramente convexo, corrigindo a ilusão ótica de concavidade.
in scheme: Tesauro SIPA
preferred label: Entasis column @en
alternative label: Coluna barriguda
alternative label: Coluna em entasis
broader: Coluna segundo a forma do fuste

Coluna ensamblada
type: Concept
scope note: Coluna que possui um fuste de madeira, feito de várias peças ligadas entre si.
in scheme: Tesauro SIPA
preferred label: Imbedded column @en
broader: Coluna segundo a forma do fuste

Coluna estriada
type: Concept
scope note: Coluna que possui um fuste ornado por estrias na sua totalidade ou nos dois terços superiores.
in scheme: Tesauro SIPA
preferred label: Grooved column @en
broader: Coluna segundo a forma do fuste

Coluna facetada
type: Concept
scope note: Coluna que possui um fuste inscrito num círculo, mas com várias faces.
in scheme: Tesauro SIPA
preferred label: Faceted column @en
broader: Coluna segundo a forma do fuste

Coluna fasciculada
type: Concept
scope note: Coluna que possui um fuste em forma de feixes.
in scheme: Tesauro SIPA
preferred label: Fascicled column @en
broader: Coluna segundo a forma do fuste

Coluna fuselada
type: Concept
scope note: Coluna que possui um fuste com as extremidades muito estreitas em relação ao centro, por um exagero da entase.
in scheme: Tesauro SIPA
preferred label: Spindle-shaped column @en
broader: Coluna segundo a forma do fuste

Coluna galbada
type: Concept
scope note: Coluna que possui um fuste que forma uma ampla barriga sensivelmente a meio.
in scheme: Tesauro SIPA
preferred label: Swelled column @en
preferred label: Colonne galbée @fr
preferred label: Colonna galbata @it
broader: Coluna segundo a forma do fuste

Coluna manubial
type: Concept
scope note: Coluna que possui um fuste decorado com troféus ou despojos de guerra.
in scheme: Tesauro SIPA
preferred label: Manubial column @en
broader: Coluna segundo a forma do fuste

Coluna monolítica
type: Concept
scope note: Coluna que possui um fuste feito de uma só peça.
in scheme: Tesauro SIPA
preferred label: Monolithic column @en
broader: Coluna segundo a forma do fuste

Coluna rostral
type: Concept
scope note: Coluna que possui um fuste ornado por motivos náuticos.
in scheme: Tesauro SIPA
preferred label: Rostral column @en
broader: Coluna segundo a forma do fuste

Coluna rusticada
type: Concept
scope note: Tipo de coluna que possui uma superfície irregular, com aparência de pedra bruta.
in scheme: Tesauro SIPA
preferred label: Rusticated column @en
preferred label: Colonne rustiquée @fr
preferred label: Colonna bugnata @it
broader: Coluna segundo a forma do fuste

Coluna tipo balaústre
type: Concept
scope note: Coluna que possui um fuste em forma de balaústre.
in scheme: Tesauro SIPA
preferred label: Baluster column @en
broader: Coluna segundo a forma do fuste

Coluna torsa
type: Concept
scope note: Coluna que possui um fuste a evoluir em várias espiras.
in scheme: Tesauro SIPA
preferred label: Spiral column @en
broader: Coluna segundo a forma do fuste
narrower: Coluna pseudo-salomónica
narrower: Coluna salomónica

Coluna pseudo-salomónica
type: Concept
scope note: Coluna que possui um fuste em espiral.
in scheme: Tesauro SIPA
preferred label: Pseudo-Solomonic column @en
broader: Coluna torsa

Coluna salomónica
type: Concept
scope note: Coluna que possui um fuste a evoluir em espiras, mas sendo as do terço inferior de maiores dimensões.
in scheme: Tesauro SIPA
preferred label: Solomonic column @en
preferred label: Colonne salomonique @fr
preferred label: Colonna tortile/ salomonica @it
broader: Coluna torsa

Coluna segundo a implantação
type: Concept
in scheme: Tesauro SIPA
preferred label: Column according to establishment @en
preferred label: Colonne selon l'implantation @fr
preferred label: Colonna secondo l'impianto @it
broader: Coluna
narrower: Coluna angular
narrower: Coluna ática
narrower: Coluna de nicho
narrower: Coluna embebida
narrower: Coluna geminada
narrower: Colunas grupadas

Coluna angular
type: Concept
scope note: Coluna colocada num ângulo de um edifício ou estrutura.
in scheme: Tesauro SIPA
preferred label: Angular column @en
broader: Coluna segundo a implantação

Coluna ática
type: Concept
scope note: Associação de uma coluna e de um pilar, colocados no ângulo de uma fachada.
in scheme: Tesauro SIPA
preferred label: Attica column @en
broader: Coluna segundo a implantação

Coluna de nicho
type: Concept
in scheme: Tesauro SIPA
preferred label: Colonna bugnata @it
preferred label: Niche column @en
preferred label: Colonne nichée @fr
broader: Coluna segundo a implantação

Coluna embebida
type: Concept
scope note: Coluna parcialmente integrada numa parede, projetando-se parcialmente da superfície desta.
in scheme: Tesauro SIPA
preferred label: Embedded column @en
preferred label: Colonne engagée @fr
preferred label: Colonna addossata @it
broader: Coluna segundo a implantação

Coluna geminada
type: Concept
scope note: Conjunto de duas colunas dispostas lado a lado, geralmente com um espaço mínimo entre elas ou com um elemento de ligação comum, mas possuindo bases autónomas.
in scheme: Tesauro SIPA
preferred label: Coupled column @en
preferred label: Colonne jumelée @fr
preferred label: Colonna geminata @it
broader: Coluna segundo a implantação

Colunas grupadas
type: Concept
scope note: Conjunto de duas colunas que partilham a mesma base.
in scheme: Tesauro SIPA
preferred label: Grouped columns @en
broader: Coluna segundo a implantação

Colunelo
type: Concept
scope note: Coluna pequena e com fuste delgado.
in scheme: Tesauro SIPA
preferred label: Narrow column @en
broader: Elementos arquitetónicos estruturais simples sustentantes

Coluneta
type: Concept
scope note: Coluna de fuste largo e pequena dimensão, normalmente utilizada como elemento decorativo.
in scheme: Tesauro SIPA
preferred label: Narrow column @en
broader: Elementos arquitetónicos estruturais simples sustentantes

Contraforte
type: Concept
scope note: Elemento predominantemente vertical, adossado a uma parede ou muro para lhe certificar solidez, estabilidade ou sustentar o empuxo de um arco ou peso de uma viga, resistindo às pressões ou cargas superiores vindas do peso próprio das paredes e da estrutura da cobertura. É muito comum em construções de pedra e de taipa.
in scheme: Tesauro SIPA
preferred label: Buttress (Counterfort) @en
preferred label: Contrefort (Contre-boutant) @fr
preferred label: Contrafforte @it
alternative label: Encoste
alternative label: Gigante
alternative label: Pegão (Elementos arquitetónicos estruturais sustentantes)
broader: Elementos arquitetónicos estruturais simples sustentantes
narrower: Componentes do contraforte
narrower: Contraforte segundo a forma
narrower: Contraforte segundo a implantação

Componentes do contraforte
type: Concept
in scheme: Tesauro SIPA
preferred label: Buttress components @en
preferred label: Composants du contrefort @fr
preferred label: Componenti del contrafforte @it
broader: Contraforte
narrower: Cauda
narrower: Raiz

Cauda
type: Concept
scope note: Zona do contraforte que encosta ao muro ou à parede.
in scheme: Tesauro SIPA
preferred label: Tail (Rear) @en
broader: Componentes do contraforte

Raiz
type: Concept
scope note: Zona saliente do contraforte.
in scheme: Tesauro SIPA
preferred label: Base @en
broader: Componentes do contraforte

Contraforte segundo a forma
type: Concept
in scheme: Tesauro SIPA
preferred label: Buttress by shape @en
preferred label: Contrefort selon la forme @fr
preferred label: Contrafforte per forma @it
broader: Contraforte
narrower: Contraforte de esbarro

Contraforte de esbarro
type: Concept
scope note: Contraforte seccionado por um ressalto inclinado, permitindo o transporte do empuxo de um arco até ao pavimento.
in scheme: Tesauro SIPA
preferred label: Back gauge counterfort @en
broader: Contraforte segundo a forma

Contraforte segundo a implantação
type: Concept
in scheme: Tesauro SIPA
preferred label: Buttress by placement @en
preferred label: Contrefort selon l’implantation @fr
preferred label: Contrafforte secondo l'impianto @it
broader: Contraforte
narrower: Contraforte cunhal
narrower: Contraforte de ângulo
narrower: Contraforte diagonal
narrower: Contraforte recuado

Contraforte cunhal
type: Concept
scope note: Tipo de contraforte que se adossa e embebe na aresta do cunhal, envolvendo ambos os muros.
in scheme: Tesauro SIPA
preferred label: Corner counterfort @en
broader: Contraforte segundo a implantação

Contraforte de ângulo
type: Concept
scope note: Tipo de contraforte que reforça um cunhal, adossado a um dos seus panos e implantado ao mesmo nível que a sua aresta. Podem surgir dois, um em cada um dos lados do cunhal.
in scheme: Tesauro SIPA
preferred label: Angled counterfort @en
broader: Contraforte segundo a implantação

Contraforte diagonal
type: Concept
scope note: Tipo de contraforte, colocado a reforçar um cunhal, adossado à aresta do mesmo.
in scheme: Tesauro SIPA
preferred label: Diagonal buttress @en
broader: Contraforte segundo a implantação

Contraforte recuado
type: Concept
scope note: Tipo de contraforte que reforça um cunhal, adossado a um dos seus panos e implantado a alguma distância da sua aresta. Podem surgir dois, um em cada um dos lados do cunhal.
in scheme: Tesauro SIPA
preferred label: Recessed buttress @en
broader: Contraforte segundo a implantação

Embasamento
type: Concept
scope note: Base de um edifício ou estrutura, normalmente composto por três degraus escalonados, podendo, contudo, ter um único nível contínuo.
in scheme: Tesauro SIPA
preferred label: Basement; Foundation @en
alternative label: Emvasamento
broader: Elementos arquitetónicos estruturais simples sustentantes
narrower: Envasadura

Envasadura
type: Concept
scope note: Elemento saliente na base de um cunhal e que serve para reforçar aquela zona da parede.
in scheme: Tesauro SIPA
preferred label: Basement; Foundation @en
broader: Embasamento

Enxalço
type: Concept
scope note: Arco cego construído na espessura de um muro, sobre um vão, permitindo aliviar o peso que se exerce sobre este.
in scheme: Tesauro SIPA
preferred label: Shoulder; Projection @en
alternative label: Archete
alternative label: Arco de descarga
alternative label: Contrapadieira
alternative label: Sobrearco
broader: Elementos arquitetónicos estruturais simples sustentantes

Esteio (Elementos arquitetónicos estruturais simples sustentantes)
type: Concept
scope note: Elemento em forma de estaca, que sustenta uma parede ou um teto. Designa, ainda, cada um dos elementos verticais que constitui uma anta.
in scheme: Tesauro SIPA
preferred label: Shore; Prop (Simple supporting structural elements) @en
alternative label: Espeque (Elementos arquitetónicos estruturais simples sustentantes)
broader: Elementos arquitetónicos estruturais simples sustentantes

Estípite
type: Concept
scope note: Elemento de suporte, em forma de pilar ou pilastra invertida, tendo a zona inferior mais estreita que a superior.
in scheme: Tesauro SIPA
preferred label: Estipite column @en
broader: Elementos arquitetónicos estruturais simples sustentantes

Estribo (Elementos arquitetónicos estruturais sustentantes)
type: Concept
scope note: Elemento de aço que reforça os elementos de ferro ou aço que formam a ossatura de um edifício.
in scheme: Tesauro SIPA
preferred label: Coulter clamp Simple supporting structural elements ) @en
preferred label: Sabot (Éléments structurels simples porteurs) @fr
preferred label: Predella (Elementi strutturali semplici portanti) @it
broader: Elementos arquitetónicos estruturais simples sustentantes

Laje (Elementos arquitetónicos estruturais sustentantes)
type: Concept
scope note: Elemento predominantemente horizontal, executado em betão, que forma o pavimento ou o teto de um piso.
in scheme: Tesauro SIPA
preferred label: Flagstone (Simple supporting structural elements ) @en
preferred label: Dalle (Éléments structurels simples porteurs) @fr
preferred label: Lastra (Elementi strutturali semplici portanti) @it
broader: Elementos arquitetónicos estruturais simples sustentantes
narrower: Laje aligeirada
narrower: Laje maciça
narrower: Laje mista
narrower: Laje nervurada
narrower: Laje pré-esforçada

Laje aligeirada
type: Concept
scope note: Tipo de laje que utiliza elementos pré-fabricados, como vigotas de betão e blocos de cofragem, para reduzir o peso total da estrutura e facilitar a instalação.
in scheme: Tesauro SIPA
preferred label: Light flagstone @en
broader: Laje (Elementos arquitetónicos estruturais sustentantes)

Laje maciça
type: Concept
scope note: Tipo de laje homogénea, em betão armado, executada no próprio local, em simultâneo com o sistema de pórticos, pilar – viga, que a sustentam.
in scheme: Tesauro SIPA
preferred label: Solid slab @en
broader: Laje (Elementos arquitetónicos estruturais sustentantes)

Laje mista
type: Concept
scope note: Tipo de laje que combina uma chapa perfilada de aço com uma camada de concreto.
in scheme: Tesauro SIPA
preferred label: Mixed slab @en
broader: Laje (Elementos arquitetónicos estruturais sustentantes)

Laje nervurada
type: Concept
scope note: Tipo de laje de betão armado reforçado por nervuras, que são vigas embutidas na estrutura, espaçadas regularmente.
in scheme: Tesauro SIPA
preferred label: Ribbed slab @en
alternative label: Laje fungiforme
broader: Laje (Elementos arquitetónicos estruturais sustentantes)

Laje pré-esforçada
type: Concept
scope note: Tipo de laje que utiliza cabos de aço de alta resistência para introduzir forças de compressão na estrutura, antes mesmo de a carga ser aplicada.
in scheme: Tesauro SIPA
preferred label: Pre-stressed slab @en
broader: Laje (Elementos arquitetónicos estruturais sustentantes)
narrower: Abobadilha (Laje pré-esforçada)

Abobadilha (Laje pré-esforçada)
type: Concept
scope note: Elemento de perfil curvilíneo, constituído por blocos cerâmicos ou de cimento, formando a estrutura de uma laje pré-esforçada.
in scheme: Tesauro SIPA
preferred label: Semi-vault (Pre-stressed slab) @en
broader: Laje pré-esforçada

Mainel
type: Concept
scope note: Elemento de suporte, predominantemente vertical, em forma de pilar ou colunelo, que divide verticalmente um vão, servindo para apoiar o seu lintel ou a imposta de um arco.
in scheme: Tesauro SIPA
preferred label: Mullion @en
preferred label: Meneau @fr
preferred label: Bifora (Montante) @it
alternative label: Estanfico
alternative label: Parte-luz
broader: Elementos arquitetónicos estruturais simples sustentantes

Mísula
type: Concept
scope note: Elemento de suporte saliente de uma parede, destinado a sustentar vários elementos arquitetónicos. Podem surgir em alinhamento, sustentando um elemento de maiores dimensões.
in scheme: Tesauro SIPA
preferred label: Corbel @en
preferred label: Corbeau @fr
preferred label: Mensola @it
broader: Elementos arquitetónicos estruturais simples sustentantes
narrower: Cachorro
narrower: Consola (Mísula)
narrower: Modilhão
narrower: Quartela

Cachorro
type: Concept
scope note: Elemento de suporte em pedra ou madeira, saliente de um muro e que serve para sustentar cornijas, sacadas e linhas de asna. Pode ostentar decoração, sendo exemplo disso, os cachorros da arte românica, com elementos zoomórficos, fitomórficos, antropomórficos, fantásticos e mesmo historiados.
in scheme: Tesauro SIPA
preferred label: Figurative corbel @en
preferred label: Corbeau sculpté @fr
preferred label: Mensola figurata @it
alternative label: Canovão
alternative label: Cão
broader: Mísula
narrower: Cachorro racial
related: Cachorrada
modified: 2025-09-23T13:43:53

Cachorro racial
type: Concept
scope note: Elemento de suporte em madeira, que sustenta a extremidade de uma linha de asna.
in scheme: Tesauro SIPA
preferred label: Racialized figurative corbel @en
broader: Cachorro

Consola (Mísula)
type: Concept
scope note: Elemento de suporte saliente de uma parede, com maior altura que avançamento e ornado por volutas e acantos, destinado a sustentar vários elementos arquitetónicos.
in scheme: Tesauro SIPA
preferred label: Console (Corbel) @en
alternative label: Quartelão
broader: Mísula

Modilhão
type: Concept
scope note: Elemento de suporte saliente de uma parede, com maior avançamento que altura e ornado por volutas e acantos, destinado a sustentar vários elementos arquitetónicos.
in scheme: Tesauro SIPA
preferred label: Modillion @en
preferred label: Modillon @fr
preferred label: Modiglione @it
alternative label: Corvo
broader: Mísula

Quartela
type: Concept
scope note: Mísula em forma de pirâmide invertida e ornada por folhas de acanto. Designa, ainda, uma mísula ornada por folhas de acanto.
in scheme: Tesauro SIPA
preferred label: Bracket; Corbel @en
broader: Mísula

Peanha
type: Concept
scope note: Elemento que sustenta uma estátua, de secção quadrangular e de pequena altura.
in scheme: Tesauro SIPA
preferred label: Plinth; Pedestal @en
alternative label: Chapim
broader: Elementos arquitetónicos estruturais simples sustentantes

Pilar
type: Concept
scope note: Elemento de suporte predominantemente vertical, isolado ou adossado, de secção poligonal ou quadrangular, com uma função estrutural de suporte de cargas ao longo do seu eixo, funcionando à compressão. Possui um elevado poder de sustentação um elevado poder de sustentação e pode ser construído em pedra, tijolo, metal ou betão armado, normalmente assente sobre uma base ou soco e rematado por capitel. Pode ser utilizado na construção das fundações.
in scheme: Tesauro SIPA
preferred label: Pillar; Pier @en
preferred label: Pilier @fr
preferred label: Pilare @it
broader: Elementos arquitetónicos estruturais simples sustentantes
narrower: Macaco
narrower: Pilar cruciforme
narrower: Pilar fasciculado
narrower: Pilarete
related: Ordem arquitetónica

Macaco
type: Concept
scope note: Tipo de pilar, executado em tijolo, apresentando dois silhares em cada fiada.
in scheme: Tesauro SIPA
preferred label: Jack @en
broader: Pilar

Pilar cruciforme
type: Concept
scope note: Pilar cuja secção forma uma cruz, por ter, em cada face, meias-colunas embebidas.
in scheme: Tesauro SIPA
preferred label: Cruciform pillar @en
broader: Pilar

Pilar fasciculado
type: Concept
scope note: Pilar constituído pela junção de vários colunelos.
in scheme: Tesauro SIPA
preferred label: Fascicular pillar @en
broader: Pilar
narrower: Percha

Percha
type: Concept
scope note: Cada um dos colunelos associados num pilar fasciculado.
in scheme: Tesauro SIPA
preferred label: Perch @en
preferred label: Perche @fr
preferred label: Pertica @it
broader: Pilar fasciculado

Pilarete
type: Concept
scope note: Elemento de suporte em forma de pilar de pequenas dimensões.
in scheme: Tesauro SIPA
preferred label: Pilaster; Little pillar @en
broader: Pilar

Pilastra
type: Concept
scope note: Elemento de suporte, predominantemente vertical, de perfil quadrangular, adossado ou embebido numa parede. Pode assumir todas as formas das ordens arquitetónicas clássicas.
in scheme: Tesauro SIPA
preferred label: Pilaster @en
preferred label: Pilastre @fr
preferred label: Parasta @it
alternative label: Meio-pegão
broader: Elementos arquitetónicos estruturais simples sustentantes
narrower: Parastática
related: Ordem arquitetónica

Parastática
type: Concept
scope note: Pilastra colocada nos ângulos dos edifícios clássicos ou atrás de uma coluna.
in scheme: Tesauro SIPA
preferred label: Parastas @en
alternative label: Anta (Pilastra)
broader: Pilastra

Piloti (Elementos arquitetónicos estruturais sustentantes)
type: Concept
scope note: Elemento de suporte em forma de pilar de betão armado, que sustentam o edifício, elevando-o ao nível do solo, deixando um piso de circulação pelo exterior.
in scheme: Tesauro SIPA
preferred label: Pier (Simple supporting structural elements) @en
preferred label: Pilotis (Éléments structurels simples porteurs) @fr
preferred label: Palafitta (Elementi strutturali semplici portanti) @it
alternative label: Alaque
broader: Elementos arquitetónicos estruturais simples sustentantes

Plataforma (Elementos arquitetónicos estruturais simples sustentantes)
type: Concept
in scheme: Tesauro SIPA
preferred label: Platform (Simple supporting structural elements) @en
preferred label: Plate-forme (Éléments structurels simples porteurs) @fr
preferred label: Piattaforma (Elementi strutturali semplici portanti) @it
broader: Elementos arquitetónicos estruturais simples sustentantes

Plinto
type: Concept
scope note: Elemento de suporte, elevado e, normalmente, escalonado, onde assentam cruzeiros, pelourinhos, imaginárias, colunas, etc.
in scheme: Tesauro SIPA
preferred label: Plinth @en
preferred label: Plinthe @fr
broader: Elementos arquitetónicos estruturais simples sustentantes
narrower: Dado

Dado
type: Concept
scope note: Elemento que suporta uma escultura, estátua ou coluna em forma de cubo.
in scheme: Tesauro SIPA
broader: Plinto

Pódio
type: Concept
in scheme: Tesauro SIPA
preferred label: Podium @en
preferred label: Podio @it
broader: Elementos arquitetónicos estruturais simples sustentantes
narrower: Estereóbato
narrower: Estilóbato

Estereóbato
type: Concept
scope note: Base contínua e elevada onde assentam as colunas de um edifício, podendo ser escalonada.
in scheme: Tesauro SIPA
preferred label: Stereobate @en
preferred label: Stéréobate @fr
broader: Pódio
narrower: Crepidoma

Crepidoma
type: Concept
scope note: Base do templo grego, onde assentam as colunas do mesmo.
in scheme: Tesauro SIPA
broader: Estereóbato

Estilóbato
type: Concept
scope note: Degrau superior do estereóbato, onde assenta a estrutura do edifício.
in scheme: Tesauro SIPA
preferred label: Stylobate @en
broader: Pódio

Quarteirão (Elementos arquitetónicos estruturais sustentantes)
type: Concept
scope note: Tipo de pilastra interrompida por mísulas, imagens e elementos decorativos.
in scheme: Tesauro SIPA
preferred label: Quarter-round (Simple supporting structural elements) @en
broader: Elementos arquitetónicos estruturais simples sustentantes

Talo
type: Concept
scope note: Elemento de suporte com forma de fuste de coluna, mas sem base nem capitel.
in scheme: Tesauro SIPA
preferred label: Shaft @en
broader: Elementos arquitetónicos estruturais simples sustentantes

Tirante
type: Concept
scope note: Elemento de ferro, colocado nas abóbadas para lhes dar estabilidade.
in scheme: Tesauro SIPA
preferred label: Beam @en
alternative label: Linhote
broader: Elementos arquitetónicos estruturais simples sustentantes
narrower: Âncora (Tirante)

Âncora (Tirante)
type: Concept
scope note: Peça de ferro, em forma de I, S, T, disco ou prato, que passa no olhal do tirante, permitindo a sua ligação ao elemento arquitetónico.
in scheme: Tesauro SIPA
preferred label: Anchor (Beam) @en
broader: Tirante

Elementos arquitetónicos estruturantes
type: Concept
scope note: Elementos que estruturam um imóvel, compreendendo as escadas e vãos.
in scheme: Tesauro SIPA
preferred label: Structuring architectural elements @en
preferred label: Éléments architecturaux structurants @fr
preferred label: Elementi architettonici strutturanti @it
alternative label: Elementos arquitetónicos funcionais
hidden label: Elementos arquitectónicos estruturantes
broader: Elementos arquitetónicos
narrower: Elementos arquitetónicos estruturantes de articulação

Elementos arquitetónicos estruturantes de articulação
type: Concept
in scheme: Tesauro SIPA
preferred label: Articulating structuring elements @en
preferred label: Éléments structurants d’articulation @fr
preferred label: Elementi strutturanti di articolazione @it
hidden label: Elementos arquitectónicos estruturantes de articulação
broader: Elementos arquitetónicos estruturantes
narrower: Elementos arquitetónicos de acesso e transição em desnível

Elementos arquitetónicos de acesso e transição em desnível
type: Concept
in scheme: Tesauro SIPA
preferred label: Access and level-transition architectural elements @en
preferred label: Éléments architecturaux d’accès et de transition de niveau @fr
preferred label: Elementi architettonici di accesso e transizione di livello @it
hidden label: Elementos arquitectónicos de acesso e transição em desnível
broader: Elementos arquitetónicos estruturantes de articulação
narrower: Componentes genéricos dos elementos arquitetónicos de acesso e transição em desnível
narrower: Escada
narrower: Escada segundo a forma
narrower: Escada segundo o contexto
narrower: Escada segundo o processo construtivo
narrower: Rampa
narrower: Elementos arquitetónicos de acesso, comunicação, iluminação, transição e ventilação

Componentes genéricos dos elementos arquitetónicos de acesso e transição em desnível
type: Concept
in scheme: Tesauro SIPA
preferred label: Generic components of access and level-transition elements @en
preferred label: Composants génériques des éléments d’accès et de transition de niveau @fr
preferred label: Componenti generici degli elementi di accesso e transizione di livello @it
hidden label: Componentes genéricos dos elementos arquitectónicos de acesso e transição em desnível
broader: Elementos arquitetónicos de acesso e transição em desnível
narrower: Banzo
narrower: Guarda-corpo
narrower: Lanço
narrower: Patamar (Componentes genéricos dos elementos arquitetónicos de acesso e transição em desnível)
narrower: Patim

Banzo
type: Concept
scope note: Elemento estruturante de uma escada ou rampa, constituindo duas peças retilíneas e paralelas, uma inferior e outra superior, onde se encaixam os degraus.
in scheme: Tesauro SIPA
preferred label: Flange @en
broader: Componentes genéricos dos elementos arquitetónicos de acesso e transição em desnível
narrower: Folha de reforço

Folha de reforço
type: Concept
in scheme: Tesauro SIPA
preferred label: Reinforcing sheet @en
broader: Banzo

Guarda-corpo
type: Concept
scope note: Elemento que corre paralelo à escada e que permite proteger o utilizador do perigo de queda, separando-o da bomba. Executada em vários materiais pode ser plena ou vazada, neste caso apresentando, normalmente, grande profusão decorativa.
in scheme: Tesauro SIPA
preferred label: Parapet @en
broader: Componentes genéricos dos elementos arquitetónicos de acesso e transição em desnível
narrower: Coluna de arranque
narrower: Corrimão

Coluna de arranque
type: Concept
scope note: Elemento que surge na base de um guarda-corpo e que se apresenta, frequentemente, decorado, sendo comum, nos séculos XVII e XVIII, o recurso a ampla voluta e vários elementos recortados ou concheados. Pode-se apresentar na forma de elemento arquitetónico, como uma coluna, pilar, etc.
in scheme: Tesauro SIPA
preferred label: Bracket; Overspan @en
broader: Guarda-corpo

Corrimão
type: Concept
scope note: Componente de remate do guarda-corpo, funcionando como uma peça de apoio, que corre paralela a uma escada, permitindo ao utilizador uma maior segurança no processo ascendente ou descendente.
in scheme: Tesauro SIPA
preferred label: Handrail @en
preferred label: Main courante @fr
preferred label: Ringhiera; Corrimano @it
broader: Guarda-corpo

Lanço
type: Concept
scope note: Sucessão de planos horizontais equidistantes, os degraus, compreendida entre dois patamares ou patins. As escadas são constituídas por lanços e cada lanço é constituído por um determinado número de degraus. Geralmente o número de degraus de cada lanço não deve ultrapassar os 15 ou 16 degraus, para não fatigar o utente. O comprimento dos lanços é variável consoante o número de degraus, a medida do cobertor e o desenho geral da escada. Nas escadas de lanços sobrepostos deve ter-se em atenção a altura necessária à circulação do utente, estudando-se para isso o número de degraus necessários dentro da sua altura e do espaço que se dispõe. As escadas de lanços mais usadas são as de lanços paralelos e as de lanços perpendiculares.
in scheme: Tesauro SIPA
preferred label: Flight @en
broader: Componentes genéricos dos elementos arquitetónicos de acesso e transição em desnível

Patamar (Componentes genéricos dos elementos arquitetónicos de acesso e transição em desnível)
type: Concept
scope note: Espaço plano, mais ou menos amplo, situado no fim de um ou mais lanços de uma escada, marcando o acesso a um piso.
in scheme: Tesauro SIPA
preferred label: Landing tread (Generic components of access and level-transition elements) @en
broader: Componentes genéricos dos elementos arquitetónicos de acesso e transição em desnível

Patim
type: Concept
scope note: Pequeno patamar ou superfície plana que interrompe os lanços e se destina a servir de repouso às pessoas que sobem. Serve também para mudar a direção dos lanços e permitir o acesso aos diversos pavimentos do edifício. Os executados em madeira são constituídos por pequenas vigotas assentes entre as cadeias que sustentam as pernas das escadas, e o seu pavimento nivelado com o último degrau do lanço que o alcança é feito com tábuas ou réguas de solho. Os patins têm várias designações, consoante os lugares onde são construídos. Se se localizam a meio de dois lanços retos são de repouso ou de descanso; se estão construídos na ligação de dois lanços paralelos entre si, ou perpendiculares são de volta; se ligam a escada com o pavimento dos andares do edifício, dando acesso às habitações dos moradores, são os patamares. Geralmente o número de patamares é igual ao número de andares do edifício em causa. O comprimento dos patamares é igual às larguras dos lanços da escada e mais à da bomba conjuntamente, e a sua largura, como em todos os patins, é igual à de cada lanço de escada. Um patim nunca poderá ser mais estreito que os lanços da escada.
in scheme: Tesauro SIPA
preferred label: Board @en
broader: Componentes genéricos dos elementos arquitetónicos de acesso e transição em desnível

Escada
type: Concept
scope note: Elemento arquitetónico que permite a transição entre pisos ou o acesso a um ponto elevado, sendo composta por um ou vários lanços, ou por um conjunto de degraus. Pode ser executada em vários materiais, como a pedra, madeira, betão ou metal.
in scheme: Tesauro SIPA
preferred label: Scala @it
preferred label: Stair; Stairway @en
preferred label: Escalier @fr
broader: Elementos arquitetónicos de acesso e transição em desnível
narrower: Componentes da escada

Componentes da escada
type: Concept
in scheme: Tesauro SIPA
preferred label: Stairs components @en
preferred label: Composants des escaliers @fr
preferred label: Componenti della scala @it
broader: Escada
narrower: Bomba de escada
narrower: Caixa de escada
narrower: Degrau

Bomba de escada
type: Concept
scope note: Vão existente entre os elementos que compõem uma escada ou rampa.
in scheme: Tesauro SIPA
preferred label: Well (Stairs) @en
broader: Componentes da escada

Caixa de escada
type: Concept
scope note: Espaço definido pelas paredes ou estrutura circundante das escadas, normalmente uma comunicação vertical ao longo dos vários pisos sem interrupção física, onde a estrutura da escada se apoia e descarrega as cargas a que está sujeita.
in scheme: Tesauro SIPA
preferred label: Stairway @en
broader: Componentes da escada

Degrau
type: Concept
scope note: Cada um dos elementos onde assenta o pé numa escada.
in scheme: Tesauro SIPA
preferred label: Step @en
preferred label: Marche @fr
preferred label: Gradino @it
broader: Componentes da escada
narrower: Componentes do degrau
narrower: Tipo de degrau

Componentes do degrau
type: Concept
in scheme: Tesauro SIPA
preferred label: Step components @en
preferred label: Composants de la marche @fr
preferred label: Componenti del gradino @it
broader: Degrau
narrower: Cobertor
narrower: Espelho (Degrau)
narrower: Focinho

Cobertor
type: Concept
scope note: Elemento horizontal do degrau, onde assenta o pé.
in scheme: Tesauro SIPA
preferred label: Tread @en
broader: Componentes do degrau

Espelho (Degrau)
type: Concept
scope note: Componente vertical de um degrau, que permite a elevação da escada, podendo ser simples ou decorado.
in scheme: Tesauro SIPA
preferred label: Riser (Step) @en
broader: Componentes do degrau

Focinho
type: Concept
scope note: Componente saliente do cobertor, permitindo uma maior segurança para o pé do utilizador e possuindo perfis de remate de várias formas.
in scheme: Tesauro SIPA
preferred label: Outer stringer @en
broader: Componentes do degrau

Tipo de degrau
type: Concept
in scheme: Tesauro SIPA
preferred label: Type of step @en
preferred label: Type de marche @fr
preferred label: Tipo di gradino @it
broader: Degrau
narrower: Degrau de arranque
narrower: Degrau de espera
narrower: Degrau ingrauxido
narrower: Gaveto (Degrau)

Degrau de arranque
type: Concept
scope note: O primeiro degrau de um lanço de uma escada.
in scheme: Tesauro SIPA
preferred label: Commode step @en
broader: Tipo de degrau

Degrau de espera
type: Concept
scope note: Último degrau de um lanço no sentido da subida, saliente em relação ao limite lateral do patamar ou patim, cuja localização resulta de uma questão de segurança. Por vezes, quando não há espaço suficiente, este degrau é suprimido.
in scheme: Tesauro SIPA
preferred label: Balancing step @en
broader: Tipo de degrau

Degrau ingrauxido
type: Concept
scope note: Degrau com uma das extremidades de menores dimensões, sendo comum na escada de caracol ou na escada compensada.
in scheme: Tesauro SIPA
preferred label: Winder tread @en
broader: Tipo de degrau

Gaveto (Degrau)
type: Concept
scope note: Degrau em madeira, com o cobertor de menores dimensões num dos lados, adequando-se à bomba da escada.
in scheme: Tesauro SIPA
preferred label: Winder (Step) @en
alternative label: Rabo de leque
broader: Tipo de degrau

Escada segundo a forma
type: Concept
in scheme: Tesauro SIPA
preferred label: Ladder according to shape @en
preferred label: Escalier en fonction de la forme @fr
preferred label: Scala in funzione della forma @it
broader: Elementos arquitetónicos de acesso e transição em desnível
narrower: Escada à imperial
narrower: Escada com bomba
narrower: Escada compensada
narrower: Escada de caracol
narrower: Escada de lanços opostos
narrower: Escada de leque
narrower: Escada de tiro
narrower: Escadaria
narrower: Escalinata
narrower: Subideiro

Escada à imperial
type: Concept
scope note: Escadaria de aparato, composta por três lanços, o primeiro com degraus comuns, que leva a amplo patim, de onde partem dois lanços divergentes, em sentido oposto ao do primeiro. Utilizada, frequentemente, em espaços públicos ou na arquitetura residencial de maiores dimensões, como casas nobres.
in scheme: Tesauro SIPA
preferred label: Imperial staircase; Bifurcated stairs @en
broader: Escada segundo a forma

Escada com bomba
type: Concept
scope note: Escada em que os lanços se dispõem à volta de um amplo espaço central, permitindo a iluminação direta da mesma, normalmente através da existência de uma claraboia no topo.
in scheme: Tesauro SIPA
preferred label: Open well stairs; Open newel stairs @en
broader: Escada segundo a forma

Escada compensada
type: Concept
scope note: Escada de dois ou mais lanços, sem patim intermédio, sendo este, por uma questão de economia de espaço, substituído por degraus em gaveto.
in scheme: Tesauro SIPA
preferred label: Compensated stairs @en
broader: Escada segundo a forma

Escada de caracol
type: Concept
scope note: Escada que se desenvolve em espiral, em torno de um eixo ou de uma caixa, com os degraus desenvolvidos em gaveto.
in scheme: Tesauro SIPA
preferred label: Spiral stairs @en
preferred label: Escalier en spirale @fr
preferred label: Scale a spirale @it
broader: Escada segundo a forma
narrower: Pião

Pião
type: Concept
scope note: Elemento central, de madeira, pedra ou metal, podendo apresentar elementos decorativos, a partir do qual se desenvolve uma escada em caracol.
in scheme: Tesauro SIPA
preferred label: Spinning top @en
broader: Escada de caracol

Escada de lanços opostos
type: Concept
scope note: Escada em que os vários lanços se desenvolvem em sentidos divergentes, sem a existência de bomba entre eles.
in scheme: Tesauro SIPA
preferred label: Switchback stairs @en
broader: Escada segundo a forma
narrower: Escada de lanços convergentes
narrower: Escada de lanços divergentes

Escada de lanços convergentes
type: Concept
scope note: Escada que se desenvolve em dois ou mais lanços, tendo dois braços que convergem para um patamar ou para um lanço de degraus comuns.
in scheme: Tesauro SIPA
preferred label: Converging flight stairs @en
broader: Escada de lanços opostos

Escada de lanços divergentes
type: Concept
scope note: Escada que se desenvolve em vários lanços, partindo de um patamar ou de um lanço comum, dando origem a dois lanços divergentes.
in scheme: Tesauro SIPA
preferred label: Diverging flight stairs @en
broader: Escada de lanços opostos

Escada de leque
type: Concept
scope note: Escada de um só lanço, em que os degraus se dispõem em forma semicircular ou poligonal, lembrando um leque aberto. Pode ainda designar uma escada compensada, com forma curvilínea.
in scheme: Tesauro SIPA
preferred label: Fan stairs @en
broader: Escada segundo a forma

Escada de tiro
type: Concept
scope note: Escada de um só lanço que faz a ligação entre dois pisos, bastante íngreme e estreita.
in scheme: Tesauro SIPA
preferred label: Straight stairs; Shot ladder @en
broader: Escada segundo a forma

Escadaria
type: Concept
scope note: Escada de grandes dimensões, normalmente com vários lanços divergentes e convergentes, possuindo vários patins e patamares intermédios, possibilitando o repouso durante a ascensão, e ostentando grande aparato decorativo.
in scheme: Tesauro SIPA
preferred label: Staircase @en
preferred label: Perron @fr
preferred label: Scalone @it
broader: Escada segundo a forma

Escalinata
type: Concept
scope note: Escada de lanço único.
in scheme: Tesauro SIPA
preferred label: Flight of stairs @en
preferred label: Scalinata @it
broader: Escada segundo a forma

Subideiro
type: Concept
scope note: Escada de um ou mais lanços, muito estreita.
in scheme: Tesauro SIPA
preferred label: Gradient @en
broader: Escada segundo a forma

Escada segundo o contexto
type: Concept
in scheme: Tesauro SIPA
preferred label: Stairs according to context @en
preferred label: Escalier selon le contexte @fr
preferred label: Scala secondo il contesto @it
broader: Elementos arquitetónicos de acesso e transição em desnível
narrower: Escada salta cão

Escada salta cão
type: Concept
scope note: Escadas de interligação dos socalcos na Região Demarcada do Douro Tipo de escada, de construção muito antiga, constituída por lajes salientes e isoladas, colocadas transversalmente ao paramento dos muros, deixando parte saliente de modo a formar cada degrau. A altura dos degraus e o nível de saliência era previamente estabelecido, sendo adicionado cada um dos degraus à medida que se ia construindo o muro. Cada laje ficava com uma superfície maior no interior do muro para formar um contrabalanço que dava estabilidade à escada.
in scheme: Tesauro SIPA
preferred label: Cantilevered recessed stair @en
preferred label: Escalier en encorbellement (à palier reculé) @fr
preferred label: Scala esterna a sbalzo (con pianerottolo arretrato) @it
broader: Escada segundo o contexto

Escada segundo o processo construtivo
type: Concept
in scheme: Tesauro SIPA
preferred label: Stairs according to buiding process @en
broader: Elementos arquitetónicos de acesso e transição em desnível
narrower: Escada de rebordo aberto
narrower: Escada de rebordo fechado
narrower: Escada mista
narrower: Escada rolante

Escada de rebordo aberto
type: Concept
scope note: Escada onde a zona do espelho é aberta, dando a ideia dos degraus estarem a flutuar.
in scheme: Tesauro SIPA
preferred label: Open edge stairs; Cut string stairs @en
alternative label: Escada à inglesa
broader: Escada segundo o processo construtivo

Escada de rebordo fechado
type: Concept
scope note: Escada onde a zona do espelho é fechada.
in scheme: Tesauro SIPA
preferred label: Closed edge stairs; Closed string stairs @en
alternative label: Escada à francesa
broader: Escada segundo o processo construtivo

Escada mista
type: Concept
in scheme: Tesauro SIPA
preferred label: Mixed stairs @en
broader: Escada segundo o processo construtivo

Escada rolante
type: Concept
scope note: Escada com um dispositivo mecânico, que permite vencer desníveis, pela formação de degraus de forma contínua.
in scheme: Tesauro SIPA
preferred label: Escalator @en
preferred label: Escalier mécanique @fr
preferred label: Scala mobile @it
broader: Escada segundo o processo construtivo

Rampa
type: Concept
scope note: Elemento arquitetónico em plano inclinado, que permite a transição entre pisos ou o acesso a um edifício ou estrutura, sendo composta por um ou vários lanços, podendo apresentar o mesmo tipo de formas e de processos construtivos das escadas. Executada em vários materiais, como a pedra, madeira, betão ou metal.
in scheme: Tesauro SIPA
preferred label: Ramp @en
broader: Elementos arquitetónicos de acesso e transição em desnível

Elementos arquitetónicos de acesso, comunicação, iluminação, transição e ventilação
type: Concept
in scheme: Tesauro SIPA
preferred label: Access, communication, lighting, transition, and ventilation elements @en
preferred label: Éléments d’accès, de communication, d’éclairage, de transition et de ventilation @fr
preferred label: Elementi di accesso, comunicazione, illuminazione, transizione e ventilazione @it
hidden label: Elementos arquitectónicos de acesso, comunicação, iluminação, transição e ventilação
broader: Elementos arquitetónicos de acesso e transição em desnível
narrower: Vão

Vão
type: Concept
scope note: Elemento rasgado num maciço (parede, muro ou cobertura), permitindo a iluminação, ventilação ou circulação. É delimitado por elementos ou superfícies arquitetónicas, assumindo várias formas e podendo ostentar elementos decorativos. Forma portas, janelas, óculos, entre outros.
in scheme: Tesauro SIPA
preferred label: Span @en
preferred label: Portée d'accès @fr
preferred label: Vano @it
alternative label: Abertura
broader: Elementos arquitetónicos de acesso, comunicação, iluminação, transição e ventilação
narrower: Ventana
narrower: Vão segundo a disposição
narrower: Vão segundo a função

Ventana
type: Concept
scope note: Vão de grandes dimensões, podendo servir para iluminação, arejamento ou para a colocação de sinos num campanário ou torre sineira.
in scheme: Tesauro SIPA
preferred label: Window @en
broader: Vão

Vão segundo a disposição
type: Concept
in scheme: Tesauro SIPA
preferred label: Opening according to location @en
preferred label: Portée d'accès selon la disposicion @fr
preferred label: Vano secondo la disposizione @it
broader: Vão
narrower: Clerestório

Clerestório
type: Concept
scope note: Alinhamento de janelas sucessivas, permitindo a iluminação da nave de uma igreja, sendo especialmente utilizado no período gótico. Neste período podia apresentar-se duplo, com dois níveis de janelas.
in scheme: Tesauro SIPA
preferred label: Clerestory @en
preferred label: Cleristorio @it
broader: Vão segundo a disposição

Vão segundo a função
type: Concept
in scheme: Tesauro SIPA
preferred label: Span according to function @en
preferred label: Portée d'accès selon la fonction @fr
preferred label: Vano secondo la funzione @it
broader: Vão
narrower: Vão de acesso e transição
narrower: Vão de comunicação
narrower: Vão de defesa
narrower: Vão de exposição
narrower: Vão de iluminação e ventilação
narrower: Vão de separação

Vão de acesso e transição
type: Concept
scope note: Elemento arquitetónico vazado, que permite aceder a compartimentos e espaços ou transitar entre dois.
in scheme: Tesauro SIPA
preferred label: Access and transition span @en
preferred label: Portée d'accès et de transition @fr
preferred label: Porta di accesso e di transizione @it
broader: Vão segundo a função
narrower: Componentes do vão de acesso e transição
narrower: Vão de acesso e transição segundo o tipo

Componentes do vão de acesso e transição
type: Concept
in scheme: Tesauro SIPA
preferred label: Components of the access and transition opening @en
preferred label: Composants de la baie d’accès et de transition @fr
preferred label: Componenti dell’apertura di accesso e transizione @it
broader: Vão de acesso e transição
narrower: Gateira (Porta)
narrower: Mola
narrower: Ombreira
narrower: Poste (Porta)
narrower: Recrava
narrower: Sobreporta
narrower: Soleira
narrower: Tambor (Porta)
narrower: Verga

Gateira (Porta)
type: Concept
scope note: Vão de pequenas dimensões, rasgado na folha de uma porta, permitindo a circulação de animais domésticos (cão ou gato).
in scheme: Tesauro SIPA
preferred label: Cat door (Door) @en
preferred label: Chatière (Porte) @fr
preferred label: Gattaiola (Porta) @it
broader: Componentes do vão de acesso e transição

Mola
type: Concept
in scheme: Tesauro SIPA
preferred label: Spring @en
broader: Componentes do vão de acesso e transição

Ombreira
type: Concept
scope note: Cada uma das peças laterais de guarnição de uma porta ou janela, colocadas na superfície da parede.
in scheme: Tesauro SIPA
preferred label: Shoulder pad @en
preferred label: Épaulière @fr
preferred label: Stipite @it
alternative label: Umbral
alternative label: Umbreira
broader: Componentes do vão de acesso e transição
narrower: Jamba

Jamba
type: Concept
scope note: Elemento que constitui a moldura lateral de um vão, quando assume a forma de coluna ou colunelo.
in scheme: Tesauro SIPA
preferred label: Jamb @en
broader: Ombreira

Poste (Porta)
type: Concept
in scheme: Tesauro SIPA
preferred label: Pole (Door) @en
broader: Componentes do vão de acesso e transição

Recrava
type: Concept
scope note: Elemento de encaixe de uma porta numa moldura de cantaria.
in scheme: Tesauro SIPA
preferred label: Groove @en
broader: Componentes do vão de acesso e transição

Sobreporta
type: Concept
scope note: Elemento de encaixe, rasgado nas molduras de uma porta, permitindo a colocação das ferragens.
in scheme: Tesauro SIPA
preferred label: Fanlight @en
broader: Componentes do vão de acesso e transição

Soleira
type: Concept
scope note: Elemento que constitui a moldura inferior de uma porta, nivelada com o pavimento interior e, normalmente de pedra, metal ou madeira.
in scheme: Tesauro SIPA
preferred label: Threshold (Doorsill) @en
preferred label: Seuil @fr
preferred label: Soglia @it
broader: Componentes do vão de acesso e transição
narrower: Envaziado
narrower: Limiar
narrower: Sobressoleira

Envaziado
type: Concept
scope note: Ranhura ou sulco feito na face estreita de uma peça de madeira, como a couceira de uma porta ou janela, onde se encaixa a almofada.
in scheme: Tesauro SIPA
preferred label: Groove; Spline @en
broader: Soleira

Limiar
type: Concept
in scheme: Tesauro SIPA
preferred label: Threshold @en
broader: Soleira

Sobressoleira
type: Concept
scope note: Elemento que assenta sobre a soleira, rematando-a.
in scheme: Tesauro SIPA
preferred label: Lintel (Piece over a doorway) @en
broader: Soleira

Tambor (Porta)
type: Concept
scope note: Elemento circular e fixo, normalmente envidraçado, que protege o acesso de uma porta giratória.
in scheme: Tesauro SIPA
preferred label: Spool; Reel (Door) @en
broader: Componentes do vão de acesso e transição

Verga
type: Concept
scope note: Elemento de pedra, madeira ou betão, que constitui a moldura superior de um vão (janela ou porta).
in scheme: Tesauro SIPA
preferred label: Lath (Rod) @en
alternative label: Padieira
alternative label: Torça
broader: Componentes do vão de acesso e transição
narrower: Lintel

Lintel
type: Concept
scope note: Elemento em madeira, pedra ou ferro, que assenta nas ombreiras ou jambas e forma a moldura superior de um vão, ultrapassando a dimensão do mesmo. No caso de ser em pedra, pode ser monolítico.
in scheme: Tesauro SIPA
preferred label: Architrave @it
preferred label: Linteau @fr
alternative label: Dintel
broader: Verga
narrower: Someiro (Lintel)

Someiro (Lintel)
type: Concept
in scheme: Tesauro SIPA
preferred label: Summer (Lintel) @en
broader: Lintel

Vão de acesso e transição segundo o tipo
type: Concept
in scheme: Tesauro SIPA
preferred label: Access and transition span according to type @en
preferred label: Portée d'accès et de transition selon le type @fr
preferred label: Portata di accesso e di transizione secondo la tipologia @it
broader: Vão de acesso e transição
narrower: Alçapão (Vão de acesso e transição)
narrower: Porta (Vão de acesso e transição segundo o tipo)

Alçapão (Vão de acesso e transição)
type: Concept
scope note: Elemento nivelado com o teto ou pavimento de um edifício ou estrutura, que pode ser aberto e permitir o acesso a zonas normalmente não frequentadas.
in scheme: Tesauro SIPA
preferred label: Trapdoor; Hatch @en
preferred label: Trappe @fr
preferred label: Botola @it
broader: Vão de acesso e transição segundo o tipo
narrower: Bomba (Alçapão)

Bomba (Alçapão)
type: Concept
in scheme: Tesauro SIPA
preferred label: Hatch (Trapdoor) @en
broader: Alçapão (Vão de acesso e transição)

Porta (Vão de acesso e transição segundo o tipo)
type: Concept
scope note: Elemento vazado numa parede ou muro, de dimensões variadas que permite o acesso a um edifício ou estrutura ou a circulação no seu interior.
in scheme: Tesauro SIPA
preferred label: Door (Access and transition span) @en
preferred label: Porte @fr
preferred label: Porta @it
broader: Vão de acesso e transição segundo o tipo
narrower: Porta carral
narrower: Porta corta-fogo
narrower: Portal
narrower: Portão
narrower: Porta segundo a localização
narrower: Porta segundo o tipo
narrower: Porta cega

Porta carral
type: Concept
scope note: Porta de grandes dimensões, destinada ao acesso de carros em quintas, casas senhoriais, conventos e mosteiros, constituindo, normalmente, um acesso secundário, rasgado no muro que envolve o perímetro circundante de um imóvel.
in scheme: Tesauro SIPA
preferred label: Carriage door @en
alternative label: Porta cocheira
broader: Porta (Vão de acesso e transição segundo o tipo)

Porta corta-fogo
type: Concept
scope note: Porta metálica que impede a passagem, em caso de incêndio, das chamas de um compartimento para outro.
in scheme: Tesauro SIPA
preferred label: Fire door @en
preferred label: Porte coupe-feu @fr
preferred label: Porta antincendio; Porta tagliafuoco @it
broader: Porta (Vão de acesso e transição segundo o tipo)

Portal
type: Concept
scope note: Porta monumental de um edifício ou de um muro, ostentando, frequentemente, decoração.
in scheme: Tesauro SIPA
preferred label: Gateway @en
preferred label: Front @fr
preferred label: Portale @it
alternative label: Pórtico
broader: Porta (Vão de acesso e transição segundo o tipo)

Portão
type: Concept
scope note: Porta de grandes dimensões, sem qualquer ostentação decorativa ou arquitetónica.
in scheme: Tesauro SIPA
preferred label: Portone @it
preferred label: Gate @en
preferred label: Portail @fr
broader: Porta (Vão de acesso e transição segundo o tipo)

Porta segundo a localização
type: Concept
in scheme: Tesauro SIPA
preferred label: Door according to placement @en
preferred label: Porte en fonction de l'emplacement @fr
preferred label: Porta in base alla posizione @it
broader: Porta (Vão de acesso e transição segundo o tipo)
narrower: Anteporta
narrower: Porta axial
narrower: Porta principal
narrower: Porta travessa

Anteporta
type: Concept
scope note: Porta que precede uma segunda.
in scheme: Tesauro SIPA
preferred label: Outer door; Anteport @en
broader: Porta segundo a localização

Porta axial
type: Concept
in scheme: Tesauro SIPA
preferred label: Axial door @en
broader: Porta segundo a localização

Porta principal
type: Concept
scope note: Porta que constitui o principal acesso a um edifício, normalmente situado na fachada principal, podendo ser monumental e decorado, constituindo um portal.
in scheme: Tesauro SIPA
preferred label: Main door @en
broader: Porta segundo a localização

Porta travessa
type: Concept
scope note: Porta situada numa fachada lateral de um edifício religioso.
in scheme: Tesauro SIPA
preferred label: Back door; Carrier @en
broader: Porta segundo a localização

Porta segundo o tipo
type: Concept
in scheme: Tesauro SIPA
preferred label: Door according to type @en
preferred label: Porte selon le type @fr
preferred label: Porta secondo il tipo @it
broader: Porta (Vão de acesso e transição segundo o tipo)
narrower: Porta basculante

Porta basculante
type: Concept
scope note: Porta que abre a partir de um eixo horizontal, situado na zona superior.
in scheme: Tesauro SIPA
preferred label: Tilting door @en
preferred label: Porte basculante @fr
preferred label: Porta a battente @it
broader: Porta segundo o tipo

Porta cega
type: Concept
scope note: Porta cujo vão se encontra entaipado.
in scheme: Tesauro SIPA
preferred label: Blind door @en
broader: Porta (Vão de acesso e transição segundo o tipo)
narrower: Porta de carrossel
narrower: Porta de correr
narrower: Porta de lagartas
narrower: Porta de pião central
narrower: Porta de travessas
narrower: Porta de vai-e-vém
narrower: Porta engradada
narrower: Porta envidraçada
narrower: Porta flexível

Porta de carrossel
type: Concept
scope note: Porta de madeira ou metal, que enrola verticalmente, ficando estacionada junto à verga quando aberta.
in scheme: Tesauro SIPA
preferred label: Carousel door @en
alternative label: Porta de enrolar
broader: Porta cega

Porta de correr
type: Concept
scope note: Porta que se movimenta lateralmente, deslizando sobre trilhos.
in scheme: Tesauro SIPA
preferred label: Sliding door; French door @en
broader: Porta cega
narrower: Porta de correr em caixa

Porta de correr em caixa
type: Concept
in scheme: Tesauro SIPA
preferred label: Box sliding door @en
broader: Porta de correr

Porta de lagartas
type: Concept
scope note: Porta constituída por uma folha, formada por várias lâminas articuladas, normalmente em metal e utilizada, frequentemente, para acesso a um estacionamento, elevador, etc.
in scheme: Tesauro SIPA
preferred label: Tressiled door; Crawler door; Caterpillar door @en
broader: Porta cega

Porta de pião central
type: Concept
scope note: Porta que abre para ambos os lados, a partir de um eixo vertical.
in scheme: Tesauro SIPA
preferred label: Central top door @en
broader: Porta cega

Porta de travessas
type: Concept
scope note: Porta com folha de madeira, em que as tábuas verticais são consolidadas com travessas, ou seja, tábuas dispostas na horizontal, pregadas ou aparafusadas.
in scheme: Tesauro SIPA
preferred label: Slat door @en
broader: Porta cega
narrower: Porta de travessas de calha
narrower: Porta entaleirada

Porta de travessas de calha
type: Concept
scope note: Porta em que as travessas que constituem a folha não são pregadas às tábuas verticais, mas ensambladas em malhete.
in scheme: Tesauro SIPA
preferred label: Track rail slat door @en
broader: Porta de travessas

Porta entaleirada
type: Concept
scope note: Porta constituída por tábuas grossas verticais, consolidada por travessas em cunha.
in scheme: Tesauro SIPA
preferred label: Slined door @en
broader: Porta de travessas

Porta de vai-e-vém
type: Concept
scope note: Porta que se abre para ambos os lados e fecha automaticamente.
in scheme: Tesauro SIPA
preferred label: Swing doors @en
broader: Porta cega

Porta engradada
type: Concept
scope note: Porta cuja folha é vazada, constituindo uma grade de metal ou madeira.
in scheme: Tesauro SIPA
preferred label: Grilled door @en
broader: Porta cega

Porta envidraçada
type: Concept
scope note: Porta cuja folha é total ou parcialmente composta por vidro.
in scheme: Tesauro SIPA
preferred label: Glassed door @en
preferred label: Porte vitrée @fr
preferred label: Porta vetrata @it
broader: Porta cega

Porta flexível
type: Concept
scope note: Porta que pode ser dobrada ou articulada, permitindo aumentar a abertura e economizar espaço.
in scheme: Tesauro SIPA
preferred label: Flexible door @en
broader: Porta cega
narrower: Porta giratória
narrower: Porta pivotante
narrower: Porta simples
narrower: Porta telescópica

Porta giratória
type: Concept
in scheme: Tesauro SIPA
preferred label: Revolving door @en
broader: Porta flexível

Porta pivotante
type: Concept
scope note: Porta que se abre girando em torno de um eixo vertical, o pivô, em vez de usar dobradiças tradicionais.
in scheme: Tesauro SIPA
preferred label: Pivot door @en
broader: Porta flexível

Porta simples
type: Concept
scope note: Porta que abre numa direção, a partir de um eixo vertical, fixo à moldura do vão.
in scheme: Tesauro SIPA
preferred label: Simple door @en
alternative label: Porta de bater
broader: Porta flexível
narrower: Porta de varrer à direita
narrower: Porta de varrer à esquerda

Porta de varrer à direita
type: Concept
scope note: Porta em que o puxador está situado no lado direito.
in scheme: Tesauro SIPA
preferred label: Sweeping door to the right @en
broader: Porta simples

Porta de varrer à esquerda
type: Concept
scope note: Porta em que o puxador está situado no lado esquerdo.
in scheme: Tesauro SIPA
preferred label: Sweeping door to the left @en
broader: Porta simples

Porta telescópica
type: Concept
scope note: Porta de madeira ou metal, que abre verticalmente, ficando estacionada no interior do lintel.
in scheme: Tesauro SIPA
preferred label: Telescopic door @en
broader: Porta flexível

Vão de comunicação
type: Concept
scope note: Elemento arquitetónico vazado, que permite comunicar verbalmente ou passar objetos entre dois compartimentos e espaços.
in scheme: Tesauro SIPA
preferred label: Access span @en
broader: Vão segundo a função
narrower: Ministra
narrower: Postigo comungatório
narrower: Postigo confessionário
narrower: Roda
narrower: Roda de expostos

Ministra
type: Concept
scope note: Vão existente num núcleo monástico ou numa casa particular que liga a cozinha à sala de refeições, permitindo a passagem dos alimentos.
in scheme: Tesauro SIPA
preferred label: Revolving food compartment @en
alternative label: Passa pratos
broader: Vão de comunicação

Postigo comungatório
type: Concept
scope note: Pequeno vão, rasgado numa porta ou, mais frequentemente, na grade do coro-baixo, que permitia às freiras ou monjas de clausura comungarem durante as celebrações litúrgicas. Podia ser utilizado, também, em casas de recolhimento femininas.
in scheme: Tesauro SIPA
preferred label: Communion hatch @en
broader: Vão de comunicação

Postigo confessionário
type: Concept
in scheme: Tesauro SIPA
preferred label: Confessional hatch @en
broader: Vão de comunicação

Roda
type: Concept
scope note: Vão que contém um mecanismo giratório, normalmente de madeira, que permite passar objetos através de um muro, surgindo nas portarias e locutórios dos conventos e mosteiros.
in scheme: Tesauro SIPA
preferred label: Turnstile (Revolving hatch) @en
preferred label: Tour tournante (Guichet rotatif) @fr
preferred label: Ruota girevole @it
broader: Vão de comunicação

Roda de expostos
type: Concept
scope note: Roda que servia para colocar as crianças abandonadas numa misericórdia, hospício ou em edifício patrocinado pelo município.
in scheme: Tesauro SIPA
preferred label: Baby hatch (Foudling wheel) @en
preferred label: Tour d’abandon @fr
preferred label: Ruota degli esposti @it
broader: Vão de comunicação

Vão de defesa
type: Concept
scope note: Vão rasgado nas estruturas de uma fortificação por onde se podia, a partir do interior, proceder à defesa da mesma.
in scheme: Tesauro SIPA
preferred label: Defence span @en
broader: Vão segundo a função
narrower: Fojo (Vão de defesa)
narrower: Órgão (Vão de defesa)
narrower: Poterna
narrower: Rastrilho
narrower: Vão de defesa horizontal
narrower: Vão de defesa vertical

Fojo (Vão de defesa)
type: Concept
scope note: Buraco aberto no pavimento do trânsito, próximo da porta exterior, no fundo do qual se cravavam estacas ferradas com pontas agudas de ferro, ou com três pontas, denominadas de lírios, onde pudessem cair e espetar-se os inimigos na sua entrada impetuosa. O fojo era fechado com portas levadiças, que se levantavam de noite ou em caso de perigo.
in scheme: Tesauro SIPA
preferred label: Pitfall (Defence span) @en
preferred label: Fosse (Ouverture défensive) @fr
preferred label: Fossa (Apertura difensiva) @it
broader: Vão de defesa

Órgão (Vão de defesa)
type: Concept
scope note: Porta de madeira de uma fortificação medieval ou moderna, formada por vários prumos paralelos, terminados em pontas e desligados entre si, podendo, por isso, cair autonomamente dos orifícios abertos na cobertura, encaixando em buracos no chão, abrindo ou fechando o trânsito entre as portas exterior e interior.
in scheme: Tesauro SIPA
preferred label: Organ loop (Defence span) @en
preferred label: Meurtrière verticale (Ouverture défensive) @fr
preferred label: Feritoia verticale (Apertura difensiva) @it
broader: Vão de defesa

Poterna
type: Concept
scope note: Porta da fortificação moderna de menores dimensões que a magistral ou a do revelim, com estrutura simples e dissimulada, conduzindo para o exterior e usada exclusivamente por militares para sortidas e defesa das obras exteriores e receber socorro.
in scheme: Tesauro SIPA
preferred label: Postern; Sally port @en
broader: Vão de defesa

Rastrilho
type: Concept
scope note: Porta tipo grade, feita de ferro, de madeira ou de madeira reforçada com tirantes de ferro, terminada inferiormente em bicos, com movimento vertical acionado por cordas ou cadeias, pelas quais se podia levantar ou baixar, abrindo ou fechando o trânsito entre as portas exterior e interior.
in scheme: Tesauro SIPA
preferred label: Portcullis @en
preferred label: Herse de défense @fr
preferred label: Cataratta (Porta fortificata) @it
broader: Vão de defesa

Vão de defesa horizontal
type: Concept
scope note: Vão rasgado nas estruturas de uma fortificação paralelo ao horizonte por onde se podia, a partir do interior, proceder à defesa da mesma. Entre os principais vãos de defesa horizontal constam as canhoneiras, frestas de tiro, seteiras e troneiras.
in scheme: Tesauro SIPA
preferred label: Horizontal defence span @en
preferred label: Ouverture défensive horizontale @fr
broader: Vão de defesa
narrower: Canhoneira (Vão de defesa horizontal)
narrower: Fresta de tiro
narrower: Seteira
narrower: Troneira
narrower: Vão de tiro mergulhante

Canhoneira (Vão de defesa horizontal)
type: Concept
scope note: Vão retangular aberto no corpo da fortificação de transição por onde disparavam as armas de artilharia, podendo surgir em vários níveis de tiro.
in scheme: Tesauro SIPA
preferred label: Cannon embrasure (Horizontal defence span) @en
preferred label: Canonnière (Ouverture défensive horizontale) @fr
broader: Vão de defesa horizontal

Fresta de tiro
type: Concept
scope note: Vão de defesa horizontal com formato retangular estreito, rasgado nas fortificações modernas e contemporâneas, por onde se lançavam projéteis de armas de fogo. Podia surgir nos parapeitos, guaritas ou nos trânsitos das portas.
in scheme: Tesauro SIPA
preferred label: Shot embrasure @en
broader: Vão de defesa horizontal

Seteira
type: Concept
scope note: Vão vertical estreito rasgado nas muralhas, torres e outras estruturas da fortificação medieval ou ainda, mais raramente e de cronologia mais antiga, nas ameias do parapeito, por onde se lançavam projéteis de armas neurobalísticas. Normalmente, a seteira abria para o interior da fortificação, formando como que um nicho, o qual poderia alcançar diferentes dimensões.
in scheme: Tesauro SIPA
preferred label: Embrasure @en
broader: Vão de defesa horizontal

Troneira
type: Concept
scope note: Vão redondo e largo rasgado nas muralhas, torres ou barbacãs das fortificações medievais, ao nível inferior do parapeito, sob as abertas, no corpo do muro ou simultaneamente em ambos os níveis, e de diâmetro apropriado ao calibre dos trons. As troneiras começaram a surgir nas fortificações em finais do século XV e desenvolveram-se ao longo da centúria seguinte. Inicialmente rasgava-se apenas o buraco, mas, posteriormente, esse passou a ser encimado por fenda vertical, para facilitar a observação do tiro e a utilização de outro tipo de armamento mais ligeiro. Normalmente, as troneiras abriam para o interior da fortificação, formando como que um nicho, de diferentes dimensões.
in scheme: Tesauro SIPA
preferred label: Crenel @en
broader: Vão de defesa horizontal
narrower: Troneira cruzetada
narrower: Troneira de dupla cruz

Troneira cruzetada
type: Concept
scope note: Troneira composta por orifício circular encimado por fenda vertical, cortada por rasgo transversal, em forma de cruz. A fenda vertical da cruz destinava-se à observação em alcance e a horizontal à observação em direção.
in scheme: Tesauro SIPA
preferred label: Cross crenel @en
broader: Troneira

Troneira de dupla cruz
type: Concept
scope note: Troneira composta por orifício circular e fenda vertical com dois ou mais rasgos transversais para observação.
in scheme: Tesauro SIPA
preferred label: Double cross crenel @en
alternative label: Troneira recruzetada
broader: Troneira

Vão de tiro mergulhante
type: Concept
scope note: Vão que permite o lançamento de projéteis com trajetória “mergulhante”, ou seja, o lançamento de projéteis de modo a alcançarem o melhor compromisso entre a altura e o alcance, como setas a cerca de 45º. A trajetória “mergulhante” possui componente vertical superior à componente horizontal.
in scheme: Tesauro SIPA
preferred label: Vertical defence span @en
broader: Vão de defesa horizontal

Vão de defesa vertical
type: Concept
scope note: Vão de defesa imediata, rasgado numa fortificação medieval de modo a permitir atingir verticalmente a base das muralhas e os elementos mais sensíveis da defesa, como as portas, ou na cobertura dos trânsitos das portas duma fortificação moderna, de modo a atingir os sitiantes. Constituem vãos de defesa vertical as bueiras rasgadas nos corredores de entrada ou trânsito, e os matacães nos balcões, simples ou corridos, e nas ladroneiras.
in scheme: Tesauro SIPA
preferred label: Vertical defence span @en
broader: Vão de defesa
narrower: Bueira
narrower: Matacão

Bueira
type: Concept
scope note: Vão circular ou angular para a defesa vertical das entradas das fortificações medievais e modernas, rasgado na cobertura, nomeadamente nas abóbadas do trânsito, pelos quais se lançavam pedras ou “artifícios do fogo” contra o inimigo.
in scheme: Tesauro SIPA
preferred label: Plughole @en
broader: Vão de defesa vertical

Matacão
type: Concept
scope note: Vão arredondado de defesa vertical, rasgado no pavimento do balcão de uma torre ou muralha medieval, por onde se lançavam líquidos, pedras ou outros projéteis para atingir a base da fortificação ou para fazer ricochete no talude.
in scheme: Tesauro SIPA
preferred label: Machicoulis; Machocolation @en
preferred label: Machicoulis @fr
broader: Vão de defesa vertical

Vão de exposição
type: Concept
in scheme: Tesauro SIPA
preferred label: Exhibition span @en
broader: Vão segundo a função
narrower: Montra

Montra
type: Concept
scope note: Vão, protegido por vidraça, permitindo expor ao público vários géneros de bens.
in scheme: Tesauro SIPA
preferred label: Shop window @en
broader: Vão de exposição

Vão de iluminação e ventilação
type: Concept
scope note: Elemento arquitetónico vazado que permite iluminar ou arejar compartimentos e espaços.
in scheme: Tesauro SIPA
preferred label: Lighting and ventilation span @en
broader: Vão segundo a função
narrower: Componentes do vão de iluminação e ventilação
narrower: Vão de iluminação e ventilação segundo o tipo

Componentes do vão de iluminação e ventilação
type: Concept
in scheme: Tesauro SIPA
preferred label: Lighting and ventilation span components @en
preferred label: Composans de la portée de l'éclairage et de la ventilation @fr
preferred label: Componenti della portata di illuminazione e ventilazione @it
broader: Vão de iluminação e ventilação
narrower: Alhete
narrower: Lume
narrower: Parapeito (Componentes do vão de iluminação e ventilação)

Alhete
type: Concept
in scheme: Tesauro SIPA
preferred label: Rib; Fin @en
alternative label: Rebaixo
broader: Componentes do vão de iluminação e ventilação

Lume
type: Concept
scope note: Cada um dos elementos vazados numa janela.
in scheme: Tesauro SIPA
preferred label: Light shaft @en
broader: Componentes do vão de iluminação e ventilação
narrower: Cruzeta (Componentes do vão de iluminação e ventilação)
narrower: Pinázio
narrower: Travessão

Cruzeta (Componentes do vão de iluminação e ventilação)
type: Concept
scope note: Elemento em forma de cruz que divide uma janela, executado em cantaria, metal ou madeira, servindo de caixilharia aos vidros que protegem a mesma.
in scheme: Tesauro SIPA
preferred label: Crosshead; Double tee juction @en
broader: Lume

Pinázio
type: Concept
scope note: Elemento que divide uma janela em quatro lumes, executado em cantaria ou madeira.
in scheme: Tesauro SIPA
preferred label: Mullion @en
broader: Lume

Travessão
type: Concept
scope note: Elemento em cantaria que divide, horizontalmente, um vão em dois lumes.
in scheme: Tesauro SIPA
preferred label: Crossbar @en
broader: Lume

Parapeito (Componentes do vão de iluminação e ventilação)
type: Concept
scope note: Componente que forma a base ou a moldura inferior de uma janela.
in scheme: Tesauro SIPA
preferred label: Parapet @en
preferred label: Parapetto @it
broader: Componentes do vão de iluminação e ventilação
narrower: Peitoril

Peitoril
type: Concept
scope note: Parte superior do parapeito da janela, normalmente saliente, servindo, simultaneamente, de apoio ao utilizador.
in scheme: Tesauro SIPA
preferred label: Windonwsill; Parapet @en
alternative label: Banqueta (Parapeito)
alternative label: Patamar (Parapeito)
broader: Parapeito (Componentes do vão de iluminação e ventilação)

Vão de iluminação e ventilação segundo o tipo
type: Concept
in scheme: Tesauro SIPA
preferred label: Lighting and ventilation span according to type @en
preferred label: Portée de l'éclairage et de la ventilation selon le type @fr
preferred label: Portata di illuminazione e ventilazione secondo la tipologia @it
broader: Vão de iluminação e ventilação
narrower: Bomba (Vão de iluminação e ventilação)
narrower: Claraboia
narrower: Janela
narrower: Lucarna
narrower: Óculo
narrower: Respiradouro
narrower: Rosácea
narrower: Tragaluz
narrower: Trapeira

Bomba (Vão de iluminação e ventilação)
type: Concept
scope note: Vão entre os lanços de uma escada. As bombas das escadas têm várias serventias, quer como meio de passagem das mangueiras dos bombeiros em caso de incêndio, como meio de ventilação e desenfumagem ou como iluminação (geralmente correspondendo a uma claraboia ou “shed” na cobertura). Nos prédios mais antigos permitiam a passagem de mobiliário e de cargas volumosas. Durante muitos anos as bombas de escadas eram utilizadas para colocar os elevadores, quer em edifícios antigos, em que a determinada altura se instalou um elevador, quer em edifícios mais recentes (anos 70 e 80) em que as escadas, por vezes com três lanços, rodeavam o elevador, não deixando qualquer espaço vertical livre.
in scheme: Tesauro SIPA
preferred label: Well (Lighting and ventilation span) @en
broader: Vão de iluminação e ventilação segundo o tipo

Claraboia
type: Concept
scope note: Vão existente numa cobertura, permitindo que a luz possa iluminar os lanços de uma escada.
in scheme: Tesauro SIPA
preferred label: Skylight @en
preferred label: Lucarne @fr
preferred label: Lucernario @it
alternative label: Lucerna
broader: Vão de iluminação e ventilação segundo o tipo

Janela
type: Concept
scope note: Vão numa parede ou muro, permitindo a iluminação e arejamento do interior.
in scheme: Tesauro SIPA
preferred label: Window @en
preferred label: Fenêtre @fr
preferred label: Finestra @it
alternative label: Lumieira
broader: Vão de iluminação e ventilação segundo o tipo
narrower: Janela de ângulo
narrower: Janela segundo a forma
narrower: Janela segundo o tipo

Janela de ângulo
type: Concept
scope note: Janela situada no ângulo de um muro ou parede, normalmente ostentando uma coluna divisória.
in scheme: Tesauro SIPA
preferred label: Corner window @en
broader: Janela

Janela segundo a forma
type: Concept
in scheme: Tesauro SIPA
preferred label: Window according to form @en
preferred label: Fenêtre selon la forme @fr
preferred label: Finestra secondo la forma @it
broader: Janela
narrower: Bífora
narrower: Fresta
narrower: Janela de peitoril

Bífora
type: Concept
scope note: Conjunto de dois vãos que partilham a mesma moldura.
in scheme: Tesauro SIPA
preferred label: Bifora @en
broader: Janela segundo a forma
narrower: Janela geminada
narrower: Janela mainelada

Janela geminada
type: Concept
scope note: Janela de dois lumes, divididos por uma coluna ou pilar.
in scheme: Tesauro SIPA
preferred label: Twin window @en
broader: Bífora

Janela mainelada
type: Concept
scope note: Janela que possui um mainel, ou seja, uma coluna ou pilar estreito de pedra que divide o vão da janela em duas ou mais partes.
in scheme: Tesauro SIPA
preferred label: Mullioned window @en
broader: Bífora
narrower: Ajimez

Ajimez
type: Concept
scope note: Janela de dois lumes divididos por um colunelo ou elemento de alvenaria, onde assentam dois arcos de ferradura.
in scheme: Tesauro SIPA
preferred label: Mullioned window @en
preferred label: Fenêtre a meneaux @fr
alternative label: Aximez
broader: Janela mainelada

Fresta
type: Concept
scope note: Vão estreito num muro ou cobertura, permitindo a iluminação ou arejamento de um espaço.
in scheme: Tesauro SIPA
preferred label: Crevice; Breach @en
alternative label: Fresteira
broader: Janela segundo a forma
narrower: Agulheiro

Agulheiro
type: Concept
scope note: Fresta pequena e estreita permitindo a entrada de luz, normalmente localizados em zonas inferiores dos muros.
in scheme: Tesauro SIPA
preferred label: Scaffolding hole @en
broader: Fresta

Janela de peitoril
type: Concept
scope note: Vão rasgado numa parede ou muro, acima do nível do pavimento interno e protegido por parapeito.
in scheme: Tesauro SIPA
preferred label: Height windows @en
broader: Janela segundo a forma
narrower: Avental
narrower: Pano de peito

Avental
type: Concept
scope note: Elemento decorado, mais ou menos amplo, sob uma janela de peitoril.
in scheme: Tesauro SIPA
preferred label: Apron windows @en
broader: Janela de peitoril

Pano de peito
type: Concept
scope note: Elemento maciço de parede, sob uma janela de peitoril, normalmente com 90cm de altura.
in scheme: Tesauro SIPA
preferred label: Window infill panel @en
broader: Janela de peitoril
narrower: Janela de sacada
narrower: Janela de varandim
narrower: Janela jacente
narrower: Janela termal
narrower: Janelão
narrower: Janelo
narrower: Trífora

Janela de sacada
type: Concept
scope note: Vão rasgado numa parede ou muro, ao nível do pavimento interno e possuindo um avançamento exterior.
in scheme: Tesauro SIPA
preferred label: Bay window @en
broader: Pano de peito
narrower: Componentes da janela de sacada
narrower: Janela de sacada segundo o tipo

Componentes da janela de sacada
type: Concept
in scheme: Tesauro SIPA
preferred label: Bay window components @en
broader: Janela de sacada
narrower: Bacia (Janela de sacada)
narrower: Guarda (Janela de sacada)
narrower: Papagaio

Bacia (Janela de sacada)
type: Concept
scope note: Elemento que constitui o avançamento de uma sacada, construído em cantaria, betão ou ferro, apresentando-se simples ou em forma de cornija.
in scheme: Tesauro SIPA
preferred label: Preattached seat board (Bay window) @en
broader: Componentes da janela de sacada

Guarda (Janela de sacada)
type: Concept
scope note: Elemento que protege o avançamento da sacada, pleno ou vazado, podendo ser executado em variadíssimos materiais.
in scheme: Tesauro SIPA
preferred label: Guard (Bay window) @en
broader: Componentes da janela de sacada
narrower: Guarda em colo de cisne

Guarda em colo de cisne
type: Concept
scope note: Guarda que forma uma barriga inferior, muito utilizada na Arte Nova.
in scheme: Tesauro SIPA
preferred label: Swan-neck guard @en
broader: Guarda (Janela de sacada)

Papagaio
type: Concept
scope note: Elemento que divide transversalmente uma sacada.
in scheme: Tesauro SIPA
preferred label: Parrot @en
broader: Componentes da janela de sacada

Janela de sacada segundo o tipo
type: Concept
in scheme: Tesauro SIPA
preferred label: Bay window according to type @en
preferred label: Fenêtre en baie selon le type @fr
preferred label: Finestra a golfo secondo la tipologia @it
broader: Janela de sacada
narrower: Bay window
narrower: Bow window
narrower: Janela de púlpito
narrower: Janela de sacada corrida

Bay window
type: Concept
scope note: Janela de perfil poligonal, que se projeta da fachada, podendo prolongar-se por um ou mais andares.
in scheme: Tesauro SIPA
preferred label: Fenêtre en baie @fr
preferred label: Finestra a golfo (Bay window) @it
broader: Janela de sacada segundo o tipo

Bow window
type: Concept
scope note: Janela de perfil semicircular, que se projeta da fachada, podendo prolongar-se por um ou mais andares.
in scheme: Tesauro SIPA
preferred label: Finestra ad arco (Bow window) @it
broader: Janela de sacada segundo o tipo

Janela de púlpito
type: Concept
in scheme: Tesauro SIPA
preferred label: Pulpit window @en
broader: Janela de sacada segundo o tipo

Janela de sacada corrida
type: Concept
scope note: Conjunto de vãos rasgados numa parede ou muro, ao nível do pavimento interno, que abrem para um avançamento exterior, o qual pode percorrer toda uma fachada.
in scheme: Tesauro SIPA
preferred label: Bay window @en
broader: Janela de sacada segundo o tipo

Janela de varandim
type: Concept
scope note: Vão rasgado numa parede ou muro, ao nível do pavimento interno, provido de uma guarda colocada à face da superfície onde se implanta.
in scheme: Tesauro SIPA
preferred label: Parapet @en
broader: Pano de peito

Janela jacente
type: Concept
scope note: Vão rasgado numa parede ou muro, em que a altura é menor que a largura, evoluindo na horizontal.
in scheme: Tesauro SIPA
preferred label: Lying window @en
broader: Pano de peito

Janela termal
type: Concept
scope note: Janela com três lumes, em que o central é mais alto e formado por um arco, sendo os laterais retilíneos, dando origem a uma serliana.
in scheme: Tesauro SIPA
preferred label: Thermal window @en
broader: Pano de peito

Janelão
type: Concept
scope note: Vão rasgado numa parede ou muro, de grandes dimensões.
in scheme: Tesauro SIPA
preferred label: Large window @en
broader: Pano de peito
narrower: Frestão

Frestão
type: Concept
scope note: Vão de grandes dimensões, dividido em vários lumes, normalmente apresentando um perfil apontado.
in scheme: Tesauro SIPA
preferred label: Large crevice @en
alternative label: Lanceta
broader: Janelão

Janelo
type: Concept
scope note: Vão rasgado na parede ou muro, de pequenas dimensões.
in scheme: Tesauro SIPA
preferred label: Hatch; Shutter @en
alternative label: Postigo (Janela)
broader: Pano de peito

Trífora
type: Concept
scope note: Conjunto de três janelas que partilham a mesma moldura.
in scheme: Tesauro SIPA
preferred label: Trifora @en
broader: Pano de peito
narrower: Janela tripla
narrower: Janela veneziana

Janela tripla
type: Concept
scope note: Janela com três lumes, que podem ser divididos por colunelos.
in scheme: Tesauro SIPA
preferred label: Trifora @en
broader: Trífora

Janela veneziana
type: Concept
in scheme: Tesauro SIPA
preferred label: Venetian window @en
broader: Trífora

Janela segundo o tipo
type: Concept
in scheme: Tesauro SIPA
preferred label: Window according to type @en
preferred label: Fenêtre selon le type @fr
preferred label: Finestra secondo il tipo @it
broader: Janela
narrower: Janela de correr
narrower: Janela fixa
narrower: Janela giratória
narrower: Janela mista

Janela de correr
type: Concept
scope note: Janela cujo caixilho desliza em calhas, no sentido vertical ou horizontal.
in scheme: Tesauro SIPA
preferred label: Sliding window @en
alternative label: Janela de translação
broader: Janela segundo o tipo
narrower: Janela de guilhotina

Janela de guilhotina
type: Concept
scope note: Janela composta por duas folhas que deslizam (uma ou ambas), verticalmente, em ranhuras dispostas no aro, em prumos distintos, permitindo, quando abertas, a sua sobreposição.
in scheme: Tesauro SIPA
preferred label: Guillotine window; Sash window @en
broader: Janela de correr

Janela fixa
type: Concept
scope note: Janela cuja folha não se pode abrir, tendo apenas a função de iluminação.
in scheme: Tesauro SIPA
preferred label: Fixed window @en
broader: Janela segundo o tipo

Janela giratória
type: Concept
scope note: Janela que abre a partir de um eixo fixo, vertical ou horizontal.
in scheme: Tesauro SIPA
preferred label: Swing window @en
broader: Janela segundo o tipo
narrower: Janela basculante
narrower: Janela giratória de eixo vertical
narrower: Janela pivotante

Janela basculante
type: Concept
scope note: Janela com folha móvel a partir de um eixo horizontal, na base, topo ou centro da mesma.
in scheme: Tesauro SIPA
preferred label: Pivot window @en
broader: Janela giratória

Janela giratória de eixo vertical
type: Concept
scope note: Janela que gira em torno de um eixo vertical.
in scheme: Tesauro SIPA
preferred label: Swivel window with vertical axis @en
broader: Janela giratória

Janela pivotante
type: Concept
scope note: Janela que gira em torno de um eixo vertical ou horizontal, colocado no centro do vão.
in scheme: Tesauro SIPA
preferred label: Slide window @en
broader: Janela giratória

Janela mista
type: Concept
in scheme: Tesauro SIPA
preferred label: Mixed window @en
broader: Janela segundo o tipo

Lucarna
type: Concept
scope note: Vão rasgado num teto para iluminação de um sótão ou rasgado na calote de uma cúpula.
in scheme: Tesauro SIPA
preferred label: Lucarne @fr
preferred label: Lucernario @it
preferred label: Dormer window; Lucarne @en
broader: Vão de iluminação e ventilação segundo o tipo

Óculo
type: Concept
scope note: Vão de perfil circular, ovalado, elíptico ou poligonal rasgado numa parede ou muro.
in scheme: Tesauro SIPA
preferred label: Eye glass @en
broader: Vão de iluminação e ventilação segundo o tipo
narrower: Olho de boi

Olho de boi
type: Concept
scope note: Óculo circular ou elíptico, rematado por cornija.
in scheme: Tesauro SIPA
preferred label: Spyhole @en
broader: Óculo

Respiradouro
type: Concept
scope note: Vão rasgado numa parede, cobertura ou pano de abóbada, permitindo a ventilação do interior de um edifício ou estrutura.
in scheme: Tesauro SIPA
preferred label: Vent @en
preferred label: Soupirail @fr
preferred label: Sfiatatoio (Spiraglio) @it
broader: Vão de iluminação e ventilação segundo o tipo
narrower: Respiradouro jacente

Respiradouro jacente
type: Concept
scope note: Vão de ventilação, estreito e evoluindo na horizontal.
in scheme: Tesauro SIPA
preferred label: Lying vent @en
broader: Respiradouro

Rosácea
type: Concept
scope note: Grande óculo circular ou lobulado, em forma de pétala de flor, normalmente emoldurado e possuindo vários elementos decorativos em pedra, sendo os elementos vazados protegidos por vitral ou vidro colorido.
in scheme: Tesauro SIPA
preferred label: Rosace (Marigold window) @en
preferred label: Rosace @fr
preferred label: Rosone @it
broader: Vão de iluminação e ventilação segundo o tipo

Tragaluz
type: Concept
scope note: Vão rasgado na base de um edifício e que permite iluminar e/ou arejar uma dependência situada abaixo do nível do solo.
in scheme: Tesauro SIPA
preferred label: Skylight @en
broader: Vão de iluminação e ventilação segundo o tipo

Trapeira
type: Concept
scope note: Vão rasgado numa parede, muro ou cobertura amansardada, permitindo a iluminação e arejamento de um espaço.
in scheme: Tesauro SIPA
preferred label: Attic window @en
preferred label: Soupente (Faitière) @fr
preferred label: Soffitta (Mansarda) @it
broader: Vão de iluminação e ventilação segundo o tipo

Vão de separação
type: Concept
in scheme: Tesauro SIPA
preferred label: Partition span @en
broader: Vão segundo a função
narrower: Boca de cena

Boca de cena
type: Concept
scope note: Cortina suspensa na caixa de palco e que fecha à face a área de cena, constituindo, como equipamento cénico de um teatro, elemento de separação material e técnico entre palco e auditório.
in scheme: Tesauro SIPA
preferred label: Avant-scène @fr
preferred label: Downstage @en
preferred label: Boccascena @it
broader: Vão de separação

ENTIDADES
type: Collection
type: ConceptGroup
preferred label: ENTITIES @en
preferred label: ENTITÉS @fr
preferred label: ENTITÁ @it
member: Entidades
member: Pessoas coletivas
member: Associação
member: Associação cultural
member: Associação de moradores
member: Associação patronal
member: Associação profissional
member: Associação sindical
member: Pessoas coletivas segundo o contexto
member: Coroa (Pessoas coletivas segundo o contexto)
member: Couto
member: Senhorio
member: Reguengo
member: Pessoas coletivas segundo o setor de atividade
member: Pessoas coletivas do setor agrícola
member: Roga
member: Pessoas coletivas do setor financeiro
member: Pessoas coletivas do setor da justiça
member: Pessoas coletivas militares
member: Estado Maior da Armada
member: Estado Maior da Força Aérea
member: Estado Maior do Exército
member: Guarnição
member: Pessoas coletivas políticas e administrativas
member: Provedoria Geral da República
member: Tribunal Constitucional
member: Pessoas coletivas políticas e administrativas da administração central
member: Comissão de Coordenação e Desenvolvimento Regional (CCDR)
member: Direção geral
member: Direção regional
member: Governo civil
member: Instituto
member: Junta Distrital
member: Junta Geral da Província
member: Ministério
member: Vedoria
member: Pessoas coletivas políticas e administrativas da administração local
member: Associação municipal
member: Comenda (Pessoas coletivas políticas e administrativas da administração local)
member: Comunidade intermunicipal
member: Município (Pessoas coletivas políticas e administrativas da administração local)
member: Freguesia (Pessoas coletivas político e administrativas da administração local)
member: Pessoas coletivas políticas e administrativas da administração regional
member: Pessoas coletivas religiosas
member: Pessoas coletivas religiosas segundo o credo
member: Igreja Católica
member: Congregação religiosa
member: Apostolado da Oração
member: Congregação da Divina Providência e Sagrada Família
member: Congregação da Missão
member: Congregação das Criaditas dos Pobres
member: Congregação das Irmãs Franciscanas Hospitaleiras da Imaculada Conceição
member: Congregação das Missionárias dos Pobres
member: Congregação das Oblatas do Divino Coração
member: Congregação das Religiosas Reparadoras de Nossa Senhora das Dores de Fátima
member: Congregação das Servas Franciscanas de Nossa Senhora das Graças
member: Congregação das Ursulinas
member: Congregação do Oratório
member: Congregação dos Cónegos de São João Evangelista
member: Ordens militares
member: Ordem de Cristo
member: Ordem dos Hospitalários
member: Ordem do Hospital
member: Ordem de Malta
member: Ordem Militar de São João de Jerusalém – Crato
member: Ordem do Templo
member: Ordem de Santiago
member: Ordem de São Bento de Avis
member: Ordens religiosas
member: Ordens de cânones regulares
member: Companhia de Jesus
member: Ordem da Santíssima Trindade para a Redenção dos Cativos
member: Ordem de Nossa Senhora das Mercês
member: Ordem de São Salvador

Entidades
type: Concept
in scheme: Tesauro SIPA
top concept of: Tesauro SIPA
preferred label: Entities @en
preferred label: Entités @fr
preferred label: Entitá @it
narrower: Pessoas coletivas
narrower: Pessoas singulares

Pessoas coletivas
type: Concept
in scheme: Tesauro SIPA
preferred label: Juridical persons @en
preferred label: Personnes morales @fr
preferred label: Persone giuridiche @it
hidden label: Pessoas colectivas
broader: Entidades
narrower: Associação
narrower: Pessoas coletivas segundo o contexto
narrower: Pessoas coletivas segundo o setor de atividade
narrower: Pessoas coletivas segundo o tipo genérico

Associação
type: Concept
in scheme: Tesauro SIPA
preferred label: Association @en
preferred label: Associazione @it
broader: Pessoas coletivas
narrower: Associação cultural
narrower: Associação de moradores
narrower: Associação patronal
narrower: Associação profissional
narrower: Associação sindical

Associação cultural
type: Concept
in scheme: Tesauro SIPA
preferred label: Cultural association @en
preferred label: Association culturelle @fr
preferred label: Associazione culturale @it
broader: Associação

Associação de moradores
type: Concept
in scheme: Tesauro SIPA
preferred label: Residents' association @en
preferred label: Association de résidents @fr
preferred label: Associazione dei residenti @it
broader: Associação

Associação patronal
type: Concept
in scheme: Tesauro SIPA
preferred label: Employers' association @en
preferred label: Association patronale @fr
preferred label: Associazione dei datori di lavoro @it
broader: Associação

Associação profissional
type: Concept
in scheme: Tesauro SIPA
preferred label: Professional association @en
preferred label: Association professionnelle @fr
preferred label: Associazione professionale @it
broader: Associação

Associação sindical
type: Concept
in scheme: Tesauro SIPA
preferred label: Trade union association @en
preferred label: Association syndicale @fr
preferred label: Associazione sindacale @it
alternative label: Sindicato
broader: Associação

Pessoas coletivas segundo o contexto
type: Concept
in scheme: Tesauro SIPA
preferred label: Juridical persons according to context @en
preferred label: Personnes morales selon le contexte @fr
preferred label: Persone giuridiche secondo il contesto @it
hidden label: Pessoas colectivas segundo o contexto
broader: Pessoas coletivas
narrower: Coroa (Pessoas coletivas segundo o contexto)
narrower: Couto
narrower: Senhorio
narrower: Reguengo
narrower: Pessoas coletivas do setor financeiro
narrower: Pessoas coletivas do setor da justiça
narrower: Pessoas coletivas militares
narrower: Pessoas coletivas políticas e administrativas
narrower: Pessoas coletivas religiosas

Coroa (Pessoas coletivas segundo o contexto)
type: Concept
in scheme: Tesauro SIPA
preferred label: Crown (Juridical persons according to context) @en
preferred label: Couronne (Personnes morales selon le contexte) @fr
preferred label: Corona (Persone giuridiche secondo il contesto) @it
broader: Pessoas coletivas segundo o contexto

Couto
type: Concept
in scheme: Tesauro SIPA
preferred label: Hunting ground @en
preferred label: Riserva di caccia @it
preferred label: Garenne @fr
broader: Pessoas coletivas segundo o contexto

Senhorio
type: Concept
in scheme: Tesauro SIPA
preferred label: Lordship; Landlord @en
preferred label: Seigneurie @fr
preferred label: Signoria @it
broader: Pessoas coletivas segundo o contexto

Reguengo
type: Concept
in scheme: Tesauro SIPA
preferred label: Crown land @en
preferred label: Reale @it
broader: Pessoas coletivas segundo o contexto

Pessoas coletivas segundo o setor de atividade
type: Concept
in scheme: Tesauro SIPA
preferred label: Juridical persons according to activity sector @en
preferred label: Personnes morales par secteur d'activité @fr
preferred label: Persone giuridiche per settore di attività @it
hidden label: Pessoas colectivas segundo o sector de atividade
broader: Pessoas coletivas
narrower: Pessoas coletivas do setor agrícola

Pessoas coletivas do setor agrícola
type: Concept
in scheme: Tesauro SIPA
preferred label: Juridical persons in the agricultural sector @en
preferred label: Personnes morales dans le secteur agricole @fr
preferred label: Persone giuridiche nel settore agricolo @it
hidden label: Pessoas colectivas do sector agrícola
broader: Pessoas coletivas segundo o setor de atividade
narrower: Roga

Roga
type: Concept
scope note: Grupo de trabalhadores, muitas vezes vindos de outras regiões do país ou estrangeiro, que, na Região Demarcada do Douro, faziam a vindima e pisavam as uvas. Atualmente, são raras visto que a mecanização da vindima e as facilidades de comunicação exigem a contratação de um menor número de pessoas.
in scheme: Tesauro SIPA
preferred label: Vendangeurs @en
preferred label: Raccoglitori @fr
broader: Pessoas coletivas do setor agrícola

Pessoas coletivas do setor financeiro
type: Concept
in scheme: Tesauro SIPA
preferred label: Juridical persons in the finantial sector @en
preferred label: Personnes morales du secteur financier @fr
preferred label: Persone giuridiche nel settore finanziario @it
hidden label: Pessoas colectivas do sector financeiro
broader: Pessoas coletivas segundo o contexto

Pessoas coletivas do setor da justiça
type: Concept
in scheme: Tesauro SIPA
preferred label: Juridical persons in Justice @en
preferred label: Personnes morales du secteur de la justice @fr
preferred label: Persone giuridiche nel settore della giustizia @it
hidden label: Pessoas colectivas do sector da justiça
broader: Pessoas coletivas segundo o contexto

Pessoas coletivas militares
type: Concept
in scheme: Tesauro SIPA
preferred label: Military juridical persons @en
preferred label: Personnes morales militaires @fr
preferred label: Persone giuridiche militari @it
hidden label: Pessoas colectivas militares
broader: Pessoas coletivas segundo o contexto
narrower: Estado Maior da Armada
narrower: Estado Maior da Força Aérea
narrower: Estado Maior do Exército
narrower: Guarnição

Estado Maior da Armada
type: Concept
in scheme: Tesauro SIPA
preferred label: Armed Forced General Staff @en
preferred label: État-major de la marine @fr
preferred label: Stato Maggiore della Marina @it
broader: Pessoas coletivas militares

Estado Maior da Força Aérea
type: Concept
in scheme: Tesauro SIPA
preferred label: Air Force General Staff @en
preferred label: État-major de l'armée de l'air @fr
preferred label: Stato Maggiore dell'Aeronautica @it
broader: Pessoas coletivas militares

Estado Maior do Exército
type: Concept
in scheme: Tesauro SIPA
preferred label: Army General Staff @en
preferred label: État-major de l'armée de terre @fr
preferred label: Stato Maggiore dell'Esercito @it
broader: Pessoas coletivas militares

Guarnição
type: Concept
in scheme: Tesauro SIPA
preferred label: Garrison @en
preferred label: Garnison @fr
preferred label: Guarnigione @it
broader: Pessoas coletivas militares

Pessoas coletivas políticas e administrativas
type: Concept
in scheme: Tesauro SIPA
preferred label: Political and administrative juridical persons @en
preferred label: Personnes morales politiques et administratives @fr
preferred label: Persone giuridiche politiche e amministrative @it
hidden label: Pessoas colectivas políticas e administrativas
broader: Pessoas coletivas segundo o contexto
narrower: Provedoria Geral da República
narrower: Pessoas coletivas políticas e administrativas da administração central
narrower: Pessoas coletivas políticas e administrativas da administração local
narrower: Pessoas coletivas políticas e administrativas da administração regional

Provedoria Geral da República
type: Concept
in scheme: Tesauro SIPA
preferred label: Ombudsman of the Portuguese Republic @en
preferred label: Médiateur général de la république @fr
preferred label: Difensore civico generale della repubblica @it
broader: Pessoas coletivas políticas e administrativas
narrower: Tribunal Constitucional

Tribunal Constitucional
type: Concept
scope note: Tribunal especial que ocupa, na organização judiciária de um Estado democrático, uma posição particular, sobretudo pela capacidade de decidir da inconstitucionalidade e ilegalidade das normas jurídicas. Para além desta função que esteve na origem da sua criação em 1982, dispõe de várias outras competências, tais como as relativas ao Presidente da República (verificação da perda do cargo, por exemplo), ou aquelas que respeitam a matérias eleitorais ou à legalidade dos partidos políticos. Este órgão é responsável pela definição do limite da sua própria competência, usufruindo também de autonomia administrativa e financeira e de orçamento próprio. O Tribunal Constitucional tem sede em Lisboa.
in scheme: Tesauro SIPA
preferred label: Costitucional Court @en
preferred label: Tribunal constitutionnel @fr
preferred label: Tribunale costituzionale @it
broader: Provedoria Geral da República

Pessoas coletivas políticas e administrativas da administração central
type: Concept
in scheme: Tesauro SIPA
preferred label: Political and administrative juridical persons in central administration @en
preferred label: Personnes morales politiques et administratives de l'administration centrale @fr
preferred label: Persone giuridiche politiche e amministrative dell'amministrazione centrale @it
hidden label: Pessoas colectivas políticas e administrativas da administração central
broader: Pessoas coletivas políticas e administrativas
narrower: Comissão de Coordenação e Desenvolvimento Regional (CCDR)
narrower: Direção geral
narrower: Direção regional
narrower: Governo civil
narrower: Instituto
narrower: Junta Distrital
narrower: Junta Geral da Província
narrower: Ministério
narrower: Vedoria

Comissão de Coordenação e Desenvolvimento Regional (CCDR)
type: Concept
in scheme: Tesauro SIPA
preferred label: Commision for Coordination and Regional Development (CCDR) @en
preferred label: Commission de coordination et de développement régional (CCDR) @fr
preferred label: Commissione regionale di coordinamento e sviluppo (CCDR) @it
broader: Pessoas coletivas políticas e administrativas da administração central

Direção geral
type: Concept
in scheme: Tesauro SIPA
preferred label: Directorate-General @en
preferred label: Direction générale @fr
preferred label: Direzione generale @it
hidden label: Direcção geral
broader: Pessoas coletivas políticas e administrativas da administração central

Direção regional
type: Concept
in scheme: Tesauro SIPA
preferred label: Regional Directorate @en
preferred label: Direction régionale @fr
preferred label: Direzione regionale @it
hidden label: Direcção regional
broader: Pessoas coletivas políticas e administrativas da administração central

Governo civil
type: Concept
in scheme: Tesauro SIPA
preferred label: Civil Government @en
preferred label: Gouvernement civil @fr
preferred label: Governo civile @it
broader: Pessoas coletivas políticas e administrativas da administração central

Instituto
type: Concept
in scheme: Tesauro SIPA
preferred label: Institute @en
preferred label: Institut @fr
preferred label: Istituto @it
broader: Pessoas coletivas políticas e administrativas da administração central

Junta Distrital
type: Concept
in scheme: Tesauro SIPA
preferred label: District council @en
preferred label: Conseil de district @fr
preferred label: Consiglio distrettuale @it
broader: Pessoas coletivas políticas e administrativas da administração central

Junta Geral da Província
type: Concept
in scheme: Tesauro SIPA
preferred label: General Council of the Province @en
preferred label: Conseil général de la province @fr
preferred label: Consiglio generale della Provincia @it
broader: Pessoas coletivas políticas e administrativas da administração central

Ministério
type: Concept
in scheme: Tesauro SIPA
preferred label: Ministery @en
preferred label: Ministère @fr
preferred label: Ministero @it
broader: Pessoas coletivas políticas e administrativas da administração central

Vedoria
type: Concept
in scheme: Tesauro SIPA
preferred label: Inspectorat @fr
preferred label: Ispettorato @it
preferred label: Inspector office/ Controllership @en
broader: Pessoas coletivas políticas e administrativas da administração central

Pessoas coletivas políticas e administrativas da administração local
type: Concept
in scheme: Tesauro SIPA
preferred label: Political and administrative juridical persons in local administration @en
preferred label: Personnes morales politiques et administratifs des collectivités locales @fr
preferred label: Persone giuridiche politici e amministrativi del governo locale @it
hidden label: Pessoas colectivas políticas e administrativas da administração local
broader: Pessoas coletivas políticas e administrativas
narrower: Associação municipal
narrower: Comenda (Pessoas coletivas políticas e administrativas da administração local)
narrower: Comunidade intermunicipal
narrower: Município (Pessoas coletivas políticas e administrativas da administração local)
narrower: Freguesia (Pessoas coletivas político e administrativas da administração local)

Associação municipal
type: Concept
in scheme: Tesauro SIPA
preferred label: Municipal association @en
preferred label: Association municipale @fr
preferred label: Associazione comunale @it
broader: Pessoas coletivas políticas e administrativas da administração local

Comenda (Pessoas coletivas políticas e administrativas da administração local)
type: Concept
in scheme: Tesauro SIPA
preferred label: Commandery (Political and administrative juridical persons in local administration) @en
preferred label: Commanderie (Personnes morales politiques et administratives des collectivités locales) @fr
preferred label: Commenda (Persone giuridiche politiche e amministrative del governo locale) @it
broader: Pessoas coletivas políticas e administrativas da administração local

Comunidade intermunicipal
type: Concept
in scheme: Tesauro SIPA
preferred label: Communauté intercommunale @fr
preferred label: Comunità intercomunale @it
preferred label: Mancomonidad; Commonwealth of municipalities @en
broader: Pessoas coletivas políticas e administrativas da administração local

Município (Pessoas coletivas políticas e administrativas da administração local)
type: Concept
in scheme: Tesauro SIPA
preferred label: Municipality (Political and administrative juridical persons in local administration) @en
preferred label: Municipalité (Personne morale politique et administrative du gouvernement local) @fr
preferred label: Comune (Persona giuridica politica e amministrativa del governo locale) @it
broader: Pessoas coletivas políticas e administrativas da administração local

Freguesia (Pessoas coletivas político e administrativas da administração local)
type: Concept
in scheme: Tesauro SIPA
preferred label: Parish (Political and administrative juridical persons in local administration) @en
preferred label: Paroisse (Personne morale politique et administrative du gouvernement local) @fr
preferred label: Parrocchia (Persona giuridica politica e amministrativa del governo locale) @it
broader: Pessoas coletivas políticas e administrativas da administração local

Pessoas coletivas políticas e administrativas da administração regional
type: Concept
in scheme: Tesauro SIPA
preferred label: Political and administrative juridical persons in regional administration @en
preferred label: Personnes morales politiques et administratifs des collectivités régionales @fr
preferred label: Persone giuridiche politici e amministrativi del governo regionale @it
hidden label: Pessoas colectivas políticas e administrativas da administração regional
broader: Pessoas coletivas políticas e administrativas

Pessoas coletivas religiosas
type: Concept
in scheme: Tesauro SIPA
preferred label: Religious juridical persons @en
preferred label: Personnes morales religieuses @fr
preferred label: Persone giuridiche religiose @it
hidden label: Pessoas colectivas religiosas
broader: Pessoas coletivas segundo o contexto
narrower: Pessoas coletivas religiosas segundo o credo

Pessoas coletivas religiosas segundo o credo
type: Concept
in scheme: Tesauro SIPA
preferred label: Religious juridical persons according to worship @en
preferred label: Personnes morales religieuses selon la croyance @fr
preferred label: Persone giuridiche religiose secondo il credo @it
hidden label: Pessoas colectivas religiosas segundo o credo
broader: Pessoas coletivas religiosas
narrower: Igreja Católica
narrower: Igreja protestante (Pessoas coletivas religiosas segundo o credo)

Igreja Católica
type: Concept
scope note: Grupos de religiosos com votos simples, de obediência, mantendo um poder temporal.
in scheme: Tesauro SIPA
preferred label: Catholic Church @en
preferred label: Église catholique @fr
preferred label: Chiesa cattolica @it
broader: Pessoas coletivas religiosas segundo o credo
narrower: Congregação religiosa
narrower: Ordens militares
narrower: Ordens religiosas
narrower: Pessoas coletivas religiosas de assistência

Congregação religiosa
type: Concept
in scheme: Tesauro SIPA
preferred label: Religious congregation @en
preferred label: Congrégation religieuse @fr
preferred label: Congregazione religiosa @it
broader: Igreja Católica
narrower: Apostolado da Oração
narrower: Congregação da Divina Providência e Sagrada Família
narrower: Congregação da Missão
narrower: Congregação das Criaditas dos Pobres
narrower: Congregação das Irmãs Franciscanas Hospitaleiras da Imaculada Conceição
narrower: Congregação das Missionárias dos Pobres
narrower: Congregação das Oblatas do Divino Coração
narrower: Congregação das Religiosas Reparadoras de Nossa Senhora das Dores de Fátima
narrower: Congregação das Servas Franciscanas de Nossa Senhora das Graças
narrower: Congregação das Ursulinas
narrower: Congregação do Oratório
narrower: Congregação dos Cónegos de São João Evangelista

Apostolado da Oração
type: Concept
scope note: Congregação criada a partir de um desafio lançado pelo Padre Gautrelet, em 03-12-1844, durante as festividades de São Francisco Xavier, aos estudantes da Companhia de Jesus, para que se unissem em oração pela salvação da Humanidade. Promovida pelos bispos e pelo Papa Pio IX, expandiu-se rapidamente, recebendo os seus fundamentos com o padre Henri Ramière, diretor-geral, em 1860, criando uma prática de sacrifício eucarístico diária. A sede está em Roma, junto do Geral da Companhia de Jesus, de quem depende, o qual nomeia um diretor-delegado e vários diretores diocesanos, responsáveis pelos diretores locais. A congregação entrou em Portugal em 1864, pela acção do padre italiano António Marcocci, com o primeiro centro inaugurado em 17 de Abril de 1864, na Capela de Nossa Senhora dos Milagres, à Estrela, em Lisboa. Receberia um grande impulso e difusão com o Padre Luís Prósperi, que se dedicou às missões populares, existindo, em 1887, 1074 centros. Estão associadas à Congregação a Liga da Santidade Sacerdotal, nascida em França, em 1900, e unida a esta em 1959, tendo por objetivo santificar todos os sacerdotes, a Cruzada Eucarística das Crianças, criada em 1916, a Liga Eucarística, com estatutos de 1962, a União dos Cristãos, com uma visão ecuménica, criada em 1959, o Apostolado do Sofrimento, que reúne os que sofrem e os que tratam dos doentes. A sua ação é divulgada por várias publicações periódicas.
in scheme: Tesauro SIPA
preferred label: Apostleship of Prayer @en
preferred label: Apostolat de la prière @fr
preferred label: Apostolato della Preghiera @it
broader: Congregação religiosa

Congregação da Divina Providência e Sagrada Família
type: Concept
scope note: Fundada pelo cónego Adão Salgado Vaz de Faria, apoiado por D. Maria Rosa Campos, em outubro de 1945, em Vila Nova de Famalicão, tendo como linha de ação o apoio em trabalhos domésticos e sociais, bem como orientação católica e ação pastoral, dirigida a elementos do sexo feminino. As comunidades, num total de 25, em 1996, recebem jovens ou senhoras que queiram viver em comunidade, sem professarem votos religiosos.
in scheme: Tesauro SIPA
preferred label: Congregation of Divine Providence and the Holy Family @en
preferred label: Congrégation de la Divine Providence et de la Sainte Famille @fr
preferred label: Congregazione della Divina Provvidenza e della Sacra Famiglia @it
broader: Congregação religiosa

Congregação da Missão
type: Concept
scope note: Criada em França, em 1625 por São Vicente de Paula, com aprovação papal de 1633, tinha, como objetivos, a formação do clero rural e o apoio pastoral e educativo a estas comunidades, tendo participado ativamente, no processo de missionação. A Congregação foi introduzida em Portugal pelo Padre José Gomes da Costa, com licença papal de 13-03-1716. Contudo, o monarca exigiu que a comunidade dependesse do Patriarcado, o que não foi aceite, uma vez que a Congregação tinha um superior-geral, a quem devia obediência, levando à saída de vários padres. Com a canonização de São Vicente de Paula, D. João V autorizou a autonomia Vicentina, a 26-06-1738, tendo contribuído monetariamente para a expansão da comunidade, que fundou casas em Lisboa, Coimbra, Leiria, Funchal, Évora, Miranda, bem como no Brasil, Índia e China. Extintos em 1834, um grupo de padres franceses instalou-se em Portugal em 1857, organizando a comunidade de padres portugueses, então dispersa, destacando-se pelo papel de difusão e de ação educativa em Portugal e no Brasil, o Padre Sena Freitas. A Revolução de 1910 levou à saída dos padres, alguns assassinados durante o processo, para o Brasil, França, Espanha e Itália. Em 1927, o provincial francês foi nomeado para capelão da Igreja de São Luís dos Franceses, em Lisboa, tendo iniciado o movimento de restauração da Congregação, que se instalou na Rua do Século. Possui uma via feminina, criada por São Vicente de Paula e Santa Luísa de Marillac, a Companhia das Filhas da Caridade, assistidas espiritualmente pelos padres Vicentinos. Possuem um seminário em Pombeiro (1928), o de São José, em Lagares (1938), o de São Vicente de Paula, em Mafra (1954), o de Nossa Senhora das Graças, em Braga (1960), tendo as casas de Santa Quitéria, em Felgueiras (1929), no Funchal (1930), em Chaves (1938). Em 1968, inauguraram dois lares para estudantes, um no Porto e outro em Lisboa. Fazem trabalho pastoral em Salvaterra de Magos (1976), em Almodôvar (1978), Santiago do Cacém (1991) …
in scheme: Tesauro SIPA
preferred label: Congrégation de la Mission @fr
preferred label: Congregazione della Missione @it
preferred label: Congregation of the Mission; Congegratio Missionis @en
alternative label: Vicentinos
broader: Congregação religiosa

Congregação das Criaditas dos Pobres
type: Concept
in scheme: Tesauro SIPA
preferred label: Congregazione delle Criadi dei poveri @it
preferred label: Congregation of Criaditas dos Pobres @en
preferred label: Congrégation des Criaditas des Pauvres @fr
broader: Congregação religiosa

Congregação das Irmãs Franciscanas Hospitaleiras da Imaculada Conceição
type: Concept
in scheme: Tesauro SIPA
preferred label: Franciscan Hospitaller Sisters of the Immaculate Conception @en
preferred label: Congrégation des Sœurs Franciscaines Hospitalières de l'Immaculée Conception @fr
preferred label: Congregazione delle Suore Francescane Ospedaliere dell'Immacolata Concezione @it
broader: Congregação religiosa

Congregação das Missionárias dos Pobres
type: Concept
in scheme: Tesauro SIPA
preferred label: Congregation Missionary of the Poor @en
preferred label: Congrégation des Missionnaires des Pauvres @fr
preferred label: Congregazione dei Missionari dei Poveri @it
broader: Congregação religiosa

Congregação das Oblatas do Divino Coração
type: Concept
in scheme: Tesauro SIPA
preferred label: Congregation of Oblate Sisters of the Sacred Heart @en
preferred label: Congrégation des Oblats du Divin Cœur @fr
preferred label: Congregazione degli Oblati del Divin Cuore @it
broader: Congregação religiosa

Congregação das Religiosas Reparadoras de Nossa Senhora das Dores de Fátima
type: Concept
in scheme: Tesauro SIPA
preferred label: Congregation of Reparative Sisters of Our Lady of Sorrows @en
preferred label: Congrégation des Religieuses de la Réparation de Notre-Dame des Douleurs de Fatima @fr
preferred label: Congregazione delle Religiose della Riparazione di Nostra Signora dei Dolori di Fatima @it
broader: Congregação religiosa

Congregação das Servas Franciscanas de Nossa Senhora das Graças
type: Concept
in scheme: Tesauro SIPA
preferred label: Congregation of Franciscan Sisters of Our Lady of Graces @en
preferred label: Congrégation des Franciscaines Servantes de Notre-Dame de Grâce @fr
preferred label: Congregazione delle Serve Francescane di Nostra Signora delle Grazie @it
broader: Congregação religiosa

Congregação das Ursulinas
type: Concept
scope note: Congregação fundada em Itália, em 1535, por Angèle Merici, adaptando uma forma de vida semelhante à franciscana, não vivendo em comunidade, mas com as suas famílias, fazendo, apenas, um voto de castidade, dedicando-se ao ensino da doutrina e tratamento dos doentes, trabalhando para obter dinheiro para as despesas quotidianas. Em 1566, estabelece-se uma via secular, em Milão, vivendo em comunidade, fundando colégios para educar jovens e órfãos, com uma regra aprovada em 1584 pelo Papa. Ficaram divididas em duas vias, as Ursulinas Congregadas, em Brescia, e as Ursulinas Seculares, circunscritas ao território italiano. Surgem em Portugal no século XVIII, pela ação de D. Miguel da Anunciação, bispo de Coimbra, instalando-se na vila de Pereira e seguindo os estatutos da Casa de Toulouse, reformados em 1616. Em 1753, o grupo professou a Regra de Santo Agostinho, tendo D. Maria Ana de Áustria deixado, por testamento, um legado para apoiar a atividade desta congregação, abrindo-se mais dois colégios, em Viana do Castelo (1778), um em Braga (1785), tendo vindo mestras de Pereira para um colégio que a Santa Casa da Misericórdia de Lisboa destinou para meninas órfãs, em 1788. Em 1848, as Ursulinas de Pereira pediram para mudar para o convento de Santa Ana de Coimbra, passando, em 1851, para o Convento de São José, onde permaneceram até 1910.
in scheme: Tesauro SIPA
preferred label: Congregation of the Ursulines @en
preferred label: Congrégation des Ursulines @fr
preferred label: Congregazione delle Orsoline @it
broader: Congregação religiosa

Congregação do Oratório
type: Concept
scope note: Congregação fundada em Itália por Filipe Néri, no século XVI, associando uma sociedade de padres seculares, que não professaram votos, com o fito de se dedicarem ao ensino, à leitura, à pregação e aos diálogos teológicos, de acolhimento dos pobres e peregrinos, de visitarem os hospitais e prisioneiros e, sobretudo, desenvolver o canto, estando na base da criação da Oratória, tipo de música religiosa, próxima da ópera. Cada casa formada era autónoma. Foi obrigada a formar-se em congregação secular pelo Papa Gregório XII, em 1524, com o objetivo de definir uma regra, o que era recusado pelo fundador. Acabam por criar constituições, em 1583, modificadas em 1588 e aprovadas pelo Papa apenas em 1612. Em Portugal, a congregação foi criada por Bartolomeu do Quental, no início do ano de 1668, apoiado pelo rei que ascendia ao poder, D. Pedro, e pelo cabido de Lisboa, em sede vacante. Após a extinção dos Jesuítas, em 1758, a Congregação torna-se a maior responsável pelo ensino em Portugal. Após a casa de Lisboa, patrocinada pelo monarca D. João V, erigida nas Necessidades, criaram uma em Freixo de Espada-à-Cinta (1673), o Colégio dos Órfãos, no Porto (1680), a igreja de Braga (1686). Foram extintos em 1834.
in scheme: Tesauro SIPA
preferred label: Congregation of thr Oratory of Saint Philip Neri @en
preferred label: Congrégation de l'Oratoire; Oratoire de Saint Philippe Néri @fr
preferred label: Congregazione dell'Oratorio; Confederazione dell'oratorio di San Filippo Neri @it
alternative label: Oratorianos
alternative label: Filipinos
alternative label: Néris
broader: Congregação religiosa

Congregação dos Cónegos de São João Evangelista
type: Concept
scope note: Congregação fundada em Portugal pelo bispo de Lisboa Domingos Jardo, no século XIII, que reunia em comunidade uma série de merceeiros, estudantes e clérigos, instalados numa casa entregue à congregação pelo papa Eugénio IV, a pedido do Infante-regente D. Pedro, seguindo estatutos semelhantes aos das casas hospitalares italianas. Tratavam os doentes, sendo os administradores dos hospitais de Lisboa, Caldas da Rainha, Coimbra, Santarém, Évora, Montemor-o-Novo, Vimieiro e Castanheira, bem como a de Portel e Arraiolos, a pedido de D. Teodósio de Bragança; hospedavam os peregrinos e dedicavam-se, ainda, ao ensino. As casas da congregação, são as de São Salvador de Vilar de Frades (séc. XV – 1834), São Jorge de Recião, próximo de Lamego (1435), Santo Elói, em Lisboa (1440), Convento de São João Evangelista de Évora (1487), Convento de Nossa Senhora da Assunção, em Arraiolos (1527), Santa Maria da Campanhã (1490), São João Evangelista de Xabregas (séc. XVI), o Colégio de Coimbra (1548) e o Convento da Vila da Feira (1549).
in scheme: Tesauro SIPA
preferred label: Secular Canons of St. John the Evangelist @en
preferred label: Congrégation des Chanoines de Saint Jean l'Evangéliste @fr
preferred label: Canonici regolari di San Giovanni Evangelista @it
alternative label: Loios
broader: Congregação religiosa

Ordens militares
type: Concept
in scheme: Tesauro SIPA
preferred label: Ordres militaires @fr
preferred label: Ordini militari @it
preferred label: Military order @en
broader: Igreja Católica
narrower: Ordem de Cristo
narrower: Ordem dos Hospitalários
narrower: Ordem do Hospital
narrower: Ordem de Malta
narrower: Ordem do Templo
narrower: Ordem de Santiago
narrower: Ordem de São Bento de Avis

Ordem de Cristo
type: Concept
in scheme: Tesauro SIPA
preferred label: Military Order of Christ @en
preferred label: Ordre du Christ @fr
preferred label: Ordine di Cristo @it
alternative label: Ordem militar de Jesus Cristo
broader: Ordens militares

Ordem dos Hospitalários
type: Concept
in scheme: Tesauro SIPA
preferred label: Order of the Hospitallers @en
preferred label: Ordre des Hospitaliers @fr
preferred label: Ordine degli Ospedalieri @it
broader: Ordens militares

Ordem do Hospital
type: Concept
in scheme: Tesauro SIPA
preferred label: Order of Knights Hospitaller @en
preferred label: Ordre de l'Hôpital @fr
preferred label: Ordine dell'Ospedale @it
broader: Ordens militares

Ordem de Malta
type: Concept
in scheme: Tesauro SIPA
preferred label: Ordre de Malte @fr
preferred label: Ordine di Malta @it
preferred label: Order of Malta; Knights of Malta @en
alternative label: Ordem Militar de São João de Jerusalém
broader: Ordens militares
narrower: Ordem Militar de São João de Jerusalém – Crato

Ordem Militar de São João de Jerusalém – Crato
type: Concept
in scheme: Tesauro SIPA
preferred label: Sovereign Military Hospitaller Order of Saint John of Jerusalem – Crato @en
preferred label: Ordre souverain militaire et hospitalier de Saint-Jean de Jérusalem, de Rhodes et de Malte - Crato @fr
preferred label: Ordine Militare di San Giovanni di Gerusalemme - Crato @it
alternative label: Ordem do Crato
broader: Ordem de Malta

Ordem do Templo
type: Concept
in scheme: Tesauro SIPA
preferred label: Order of the Templar Knights @en
preferred label: Ordre du Temple @fr
preferred label: Ordine del Tempio @it
alternative label: Templários
broader: Ordens militares

Ordem de Santiago
type: Concept
in scheme: Tesauro SIPA
preferred label: Order of Santiago @en
preferred label: Ordre de Saint-Jacques @fr
preferred label: Ordine di San Giacomo @it
broader: Ordens militares

Ordem de São Bento de Avis
type: Concept
in scheme: Tesauro SIPA
preferred label: Order of Saint Benedict of Aviz @en
preferred label: Ordre de Saint-Benoît d'Avis @fr
preferred label: Ordine di San Benedetto dell'Avis @it
alternative label: Ordem de Avis
broader: Ordens militares

Ordens religiosas
type: Concept
in scheme: Tesauro SIPA
preferred label: Religious orders @en
preferred label: Ordres religieux @fr
preferred label: Ordini religiosi @it
alternative label: Institutos de vida consagrada
broader: Igreja Católica
narrower: Ordens de cânones regulares
narrower: Ordens de clérigos regulares
narrower: Ordens monásticas

Ordens de cânones regulares
type: Concept
in scheme: Tesauro SIPA
preferred label: Canons regular orders @en
preferred label: Ordres de chanoines réguliers @fr
preferred label: Ordini di canonici regolari @it
broader: Ordens religiosas
narrower: Companhia de Jesus
narrower: Ordem da Santíssima Trindade para a Redenção dos Cativos
narrower: Ordem de Nossa Senhora das Mercês
narrower: Ordem de São Salvador
narrower: Ordens mendicantes

Companhia de Jesus
type: Concept
scope note: A Ordem nasceu da iniciativa de um grupo de seis estudantes da Universidade de Paris, liderados por Santo Inácio de Loiola, entre os quais se encontravam São Francisco Xavier e o português Simão Rodrigues, os quais fizeram votos de castidade e pobreza, na Capela de São Dinis, em Paris, tendo como objetivo irem em peregrinação a Jerusalém ou a Roma; devido a problemas com o Oriente, dirigiram-se a Roma, onde pediram ao Papa autorização para se constituírem em cenóbio e predispondo-se a serem enviados em missão para onde o Pontífice, na altura, Paulo III desejasse, objetivos aprovados por aquele em 27-09-1540, após uma aprovação anterior, que permitiu esboçar um ideário do grupo, aprovada, definitivamente, em 1558, por Júlio III. Tinham como objetivo principal a missionação e a propagação da palavra de Deus, pelo que defendiam a pregação, os exercícios espirituais, a educação das crianças, a administração de sacramentos e a prática de obras de misericórdia. Eram governados por um geral vitalício, sendo os demais cargos definidos por nomeação. A Ordem chega a Portugal a pedido de D. João III, convencido por Diogo de Gouveia que seria o grupo ideal para ajudar a conversão da Índia, tendo chegado a Portugal São Francisco Xavier e Simão Rodrigues, em 1540, o primeiro partindo para a Índia e o segundo estabelecendo a Província de Portugal, ereta em 1546, com a sede no Mosteiro de Santo Antão-o-Velho, onde se encontravam desde 1542. No século XVIII, várias posições políticas da Ordem, relativas aos tratados celebrados com Madrid para o estabelecimento das fronteiras sul-americanas, foram motivo, aliados a outros fatores, a uma perseguição por parte do Marquês de Pombal, iniciada em 1757 e terminada com a prisão do Provincial e sequestro de todos os bens da Ordem dois anos depois, resultando na expulsão da mesma do Reino. A 07-08-1814, o Papa Pio VII restaurou a Companhia de Jesus, tendo Portugal contestado a bula, e indicando que não autorizava a entrada da Ordem nos seus d…
in scheme: Tesauro SIPA
preferred label: Society of Jesus @en
preferred label: Compagnie de Jésus @fr
preferred label: Compagnia di Gesù @it
alternative label: Jesuítas
broader: Ordens de cânones regulares

Ordem da Santíssima Trindade para a Redenção dos Cativos
type: Concept
scope note: Ordem religiosa criada em 17-12-1198, pela bula Operante Divinae Dispositionis, do papa Inocêncio III, por iniciativa de São João da Mata e São Félix de Valois, tendo por objetivo propagar o culto da Santíssima Trindade, a hospitalidade e o resgate de cristãos cativos, com dinheiro conseguido por esmolas, obtidas pelos vários privilégios que os seus conventos obtinham. Chegou a Portugal no momento da Reconquista, no meio dos cruzados, tendo sido bem acolhida por D. Sancho I, que a acomodou no palácio real e lhe cedeu a Ermida da Senhora da Abóbada, em Santarém, começando a edificar um convento no local em 1208. Chegam a Lisboa em 1218, onde edificaram o Mosteiro de Santa Catarina, nos arrabaldes, em 1294. Perante a dificuldade de obterem esmolas no século XIV e perante o aumento de cativos, D. Afonso V criou, em 1454, o Tribunal da Redenção de Cativos, ficando os frades com funções assistenciais; em 1561, durante a regência de D. Catarina, voltam a ter a responsabilidade dos resgates. Tiveram também uma via feminina e ambas foram extintas em 1834. Tinham vários mosteiros no país, além dos já mencionados, como o de Silves, junto ao palácio do Infante D. Fernando (1239-1450), o de Faro, na Ermida de São Pedro (1415-1450), o de Sintra, criado em 1400 e o de Torre de Moncorvo, em 1474. Mais tarde, surgem os de Santíssima Trindade de Lousa (1474-1834), Santíssima Trindade do Alvito (1597-1834), Santíssima Trindade de Lagos (1599-1834), Nossa Senhora do Livramento de Alcântara, em Lisboa (1679-1834), Santíssima Trindade de Setúbal (1667-1834), Santíssima Trindade de Vila Franca de Xira (1784-1834) e Santíssima Trindade de Coimbra (1834). A via feminina teve os mosteiros de Nossa Senhora dos Remédios em Lisboa (1637) e Nossa Senhora da Soledade do Mocambo, em Lisboa (1657).
in scheme: Tesauro SIPA
preferred label: Order of the Most Holy Trinity and of the Captives @en
preferred label: Ordre de la Très Sainte Trinité et de la Rédemption des Captifs @fr
preferred label: Ordine della Santissima Trinità @it
alternative label: Trinitários
broader: Ordens de cânones regulares

Ordem de Nossa Senhora das Mercês
type: Concept
scope note: Ordem religiosa criada na Catedral de Barcelona, em 10-08-1218, por iniciativa de São Pedro Nolasco, aprovada pelo Papa Gregório IX, em 1235, pela bula Devotionis Vestrae, adoptando a regra de Santo Agostinho e estabelecendo-se numa dependência do Palácio Real de Barcelona, doado por D. Jaime I de Aragão. Tinha como objetivos a redenção dos cativos e o cuidado dos doentes e peregrinos. A partir de 1327, os religiosos, que efetuavam votos de obediência, castidade e pobreza, faziam um quarto voto de redenção, dando a sua vida em troca de cativos. Em 1231, criaram, em Barcelona, um convento, a casa-mãe, em terreno doado por Raimundo de Plegamans, governador-geral da Catalunha. Com o início das viagens das Descobertas, acrescentam um novo objetivo, o de missionação na América. A Ordem organizava-se em Províncias, existindo a de Castela, que englobava as casas em Portugal, onde se instalaram a partir de 1300, acolhidos pela rainha Santa Isabel, que terá fundado um convento em Beja, o de Santa Vitória, extinto em 1503. A vida da Ordem em Portugal foi atribulada, entrando em constantes contendas com a Ordem da Santíssima Trindade para a Redenção dos Cativos e com o Tribunal da Redenção dos Cativos, criado por D. Afonso V. Em 1590, tentam estabelecer-se, novamente, em Portugal, mas não foram apoiados nas suas pretensões, proibindo-se a fundação de casas da Ordem e, em 1372, procedendo-se à expulsão dos religiosos mercedários que existissem no reino; os que ficassem tinham que obedecer aos Trinitários. Em 1682, após grande insistência, foram autorizados a fundar um convento em Lisboa, no Mocambo, destinado aos religiosos que partiam para o Brasil, em atividade missionária, transferido de local em 1746, com o apoio de D. João V.
in scheme: Tesauro SIPA
preferred label: Order of the Blessed Virgin Mary of Mercy @en
preferred label: Ordre de Notre-Dame-de-la-Merci @fr
preferred label: Ordine di Santa Maria della Mercede @it
alternative label: Mercedários
broader: Ordens de cânones regulares

Ordem de São Salvador
type: Concept
scope note: Ordem religiosa criada na Suécia, por Santa Brígida (1302-1373), membro da Ordem Terceira de São Francisco, no Convento de Wadstena, aprovada por Urbano VIII, em 1370. Fundou em Roma um hospício para peregrinos e estudantes suecos que estivessem no local, ganhando especial fulgor com a ação da sua filha, Catarina. Viria a ter problemas de perseguições nos séculos XV e XVI. Freiras inglesas da Ordem refugiaram-se em Portugal, em 1594, instalando-se no Convento da Esperança, a que se sucedeu a transferência para o Mocambo, mas com o incêndio no templo, em 17 de agosto de 1651, lançaram a primeira pedra do novo mosteiro, em Marvila, fundado por Fernando Cabral, arcediago da Catedral de Lisboa.
in scheme: Tesauro SIPA
preferred label: Order of the Most Holy Savior @en
preferred label: Ordre du Très Saint-Sauveur @fr
preferred label: Ordine del Santissimo Salvatore di Santa Brigida @it
alternative label: Brígidas
broader: Ordens de cânones regulares

Ordens mendicantes
type: Concept
scope note: Ordens religiosas, nascidas em plena Idade Média, opondo-se ao sistema fundiário das demais ordens religiosas, as quais, além dos três votos de castidade, obediência e pobreza, defendem um ideal de vida em que a pobreza é levada ao extremo, recusando a posse de qualquer bem terreno e vivendo das dádivas dos fiéis ou patronos, só podendo aceitar os bens que lhes são estritamente necessários para a sua sobrevivência.
in scheme: Tesauro SIPA
preferred label: Mendicants orders @en
preferred label: Ordres mendiants @fr
preferred label: Ordini mendicanti @it
broader: Ordens de cânones regulares
narrower: Ordem de São Domingos
narrower: Ordem de São Francisco
narrower: Ordem dos Eremitas de Santo Agostinho
narrower: Ordem dos Eremitas Descalços de Santo Agostinho
narrower: Ordem das Agostinhas Descalças
narrower: Ordem dos Irmãos de Nossa Senhora do Monte do Carmo
narrower: Monjas Descalças da Ordem da Bem-Aventurada Virgem Maria do Monte Carmelo

Ordem de São Domingos
type: Concept
scope note: Ordem religiosa mendicante, fundada por Domingos de Gusmão, em 1215, quando o religioso sentiu, ao regressar da Dinamarca, o avanço dos cátaros em Toulouse. Teve como principal objetivo lutar contra as heresias através da palavra (pregação), o que exigia aos seus membros uma formação teológica sólida, vivendo, contudo, na maior pobreza, humildade e silêncio. Seguia a Regra de Santo Agostinho, aprovada por Honório III, em 1216, sendo padres, que viviam próximo dos cânones regulares, habitando um convento, governado por um prior, que elegia, em conjunto com os demais, o Provincial. A partir de 1221, sofre uma grande expansão, dividindo-se em várias províncias, sendo protegidos pelos Papas, que os viriam a convidar para inquisidores. A Ordem entrou em Portugal em 1217, por Frei Soeiro Gomes, instalando-se em Montejunto, passando a receber o apoio da Casa Real e pertencente à Província de Espanha. O Cisma do Ocidente veio criar uma divisão na Ordem, fundando-se uma Ordem mais rígida, a Via Observante, apoiada pela nova dinastia de Avis e com sede no Mosteiro da Batalha, fundado em 1388, mantendo-se os conventos antigos na via que apoiava o Papa de Avinhão e se mantinha fiel a Espanha. Com o fim do Cisma, em 1415, a família dominicana uniu-se, em 1418, numa única Província de Portugal. A Ordem foi extinta em 1834, tendo um sacerdote, Manuel Frutuoso, regressado a Portugal em 1897, tendo sido perceptor dos príncipes D. Luís Filipe e de D. Manuel. Retirou-se com a República, em 1910, regressando, com dois companheiros, em 1913, tendo sido eleito bispo de Portalegre em 1920. Vinte anos depois, a Ordem crescia, com uma casa adaptada numa garagem, no Porto, tendo crescido, possuindo, atualmente quatro conventos, quatro casas e unidades missionárias em Angola. A Ordem possuía, em território português, os seguintes conventos masculinos: Nossa Senhora das Neves, em Montejunto (1218-1721), São Domingos de Santarém (1218-1834), São Domingos de Coimbra (1227-1280-1834), Nossa Senho…
in scheme: Tesauro SIPA
preferred label: Order of Saint Dominic @en
preferred label: Ordre dominicain @fr
preferred label: Ordine dei frati predicatori @it
alternative label: Dominicanos
alternative label: Ordem dos pregadores
broader: Ordens mendicantes
narrower: Ordem Terceira de São Domingos

Ordem Terceira de São Domingos
type: Concept
in scheme: Tesauro SIPA
preferred label: Third Order of Penitence of Saint Dominic @en
preferred label: Ordre de Pénitence de Saint Dominique @fr
preferred label: Terzo Ordine della Penitenza di San Domenico @it
broader: Ordem de São Domingos

Ordem de São Francisco
type: Concept
scope note: Ordem religiosa nascida de uma comunidade fraterna, criada por Francisco de Bernardone, um jovem burguês da região da Úmbria, com vastas riquezas e uma vida inicial devassa, que por revelações, enveredou pela vida religiosa, a que se juntaram doze discípulos, atraídos pelos ideais de pobreza, oração individual, contemplação, mortificação, abstinência, distanciamento dos bens terrenos e a promessa da possibilidade da salvação individual, seguindo o exemplo de Cristo, levando uma vida pobre e errante, procurando aproximar-se da que levara Cristo e os seus Apóstolos. Desde o início, a Ordem teve, essencialmente, um papel missionário, fazendo escrever por toda a parte o tetragrama ou símbolo de Cristo (IHS), particularmente nos locais onde surgiam os símbolos heréticos guelfos e gibelinos ou na Península Ibérica, com papel ativo na tentativa de conversão dos muçulmanos. O método de abordagem da nova ordem era a ligação aos mais pobres e marginalizados (especialmente doentes), através de ajuda financeira e de ajuda espiritual, através de uma pregação simples, popular, entendível e moralizante. A regra franciscana, aprovada pelo Papa em 1223, nasceu de uma necessidade de criar uma hierarquia religiosa, com a grande afluência de irmãos e a proliferação de comunidades por toda a Itália, adaptando-se ao cenobitismo, definindo-se que “a ordem seria dirigida por um Ministro Geral, as províncias por ministros e os conventos por simples guardiães. Os ideais franciscanos chegaram a Portugal no século XIII - segundo alguns escritos, através do próprio Serafim Chagado -, pela ação de dois dos seus discípulos, enviados à Península, Frei Zacarias e Frei Gualter (1214-1216), dando origem às primeiras comunidades, situadas nos grandes centros urbanos. Apoiados pela população e pelos nobres em geral, destacando-se a ação da Corte e da poderosa Casa de Bragança, a sua instalação não viria, contudo, a ser pacífica, estando bem divulgados os problemas com o clero, nomeadamente com o bispo …
in scheme: Tesauro SIPA
preferred label: Franciscan Order @en
preferred label: Ordre de Saint François d'Assise @fr
preferred label: Ordine di San Francesco d'Assisi @it
alternative label: Ordem dos Frades Menores
alternative label: Franciscanos
broader: Ordens mendicantes
narrower: Ordem de Santa Clara
narrower: Ordem dos Frades Menores Capuchos
narrower: Ordem dos Frades Menores Conventuais
narrower: Ordem dos Frades Menores Observantes
narrower: Ordem Terceira de São Francisco

Ordem de Santa Clara
type: Concept
scope note: Ordem religiosa feminina fundada por Clara de Assis, em 1212, fixando-se em São Damião, com uma regra redigida por São Francisco de Assis, exigindo pobreza, em clausura estrita, vivendo do seu trabalho e de esmolas recolhidas pela via masculina, vivendo na dependência jurídica e monetária do ramo masculino. Em 1218-1219, a regra foi contestada, sofrendo uma reforma pelo Cardeal Hugolino, protetor dos Franciscanos, introduzindo elementos da Ordem de São Bento, mas que não viria a ser aprovada. Entretanto, Isabel de França fundou um mosteiro em Longchamp, criando uma regra que lhes permitia a posse de bens, autorizada por Urbano IV, passando a corresponder às denominadas Clarissas Urbanas. Alguns conventos recusaram-se a seguir esta via, seguindo a regra de Santa Clara, ficando conhecida como as Clarissas Pobres. Existem, ainda, as Clarissas Coletinas, seguindo a reforma de Colette de Corbie, para voltar à pureza original, acontecendo o mesmo fenómeno com as Clarissas Alcantarinas, no século XVII, formando uma reforma muito severa, de silêncio e oração perpétuas; o mesmo esquema rígido foi adotado pelas Clarissas Farnesianas, fundada em 1631 por Françoise Farnèse. Em 1258, as Clarissas chegam a Portugal, tendo sido autorizadas pelo Papa Alexandre IV a regra do cardeal Hugolino a um Convento em Lamego, iniciadas na regra por irmãs estrangeiras. Expandem-se em Portugal, vivendo dos dotes de cada uma das noviças que ingressava no convento e do dinheiro do seu trabalho e do ensino de jovens, cujas famílias as confiavam ao cuidado destas comunidades. Conventos pertencentes ao ordinário: Nossa Senhora da Assunção de Guimarães (1548-1891), Nossa Senhora da Assunção de Bragança (1569-1870), Madre de Deus de Vinhais (1580-1897), Santa Marta de Jesus, em Lisboa (1583-1889), Chagas de Lamego (1588-1834), Salvador de Évora (1590-1886), Nossa Senhora da Graça, no Torrão (1599-1882), São Luís de Pinhel (1602-1836), Nossa Senhora do Amparo do Vila Real (1609-1855), Santo Crucifixo d…
in scheme: Tesauro SIPA
preferred label: Order of Saint Clare @en
preferred label: Ordre de Sainte-Claire @fr
preferred label: Ordine di Santa Chiara @it
alternative label: Clarissas
broader: Ordem de São Francisco
narrower: Ordem de Santa Clara da Província de Portugal
narrower: Ordem de Santa Clara da Província do Algarve

Ordem de Santa Clara da Província de Portugal
type: Concept
in scheme: Tesauro SIPA
preferred label: Order of Saint Clare of Portugal @en
preferred label: Ordre de Sainte-Claire du Portugal @fr
preferred label: Ordine di Santa Chiara del Portogallo @it
broader: Ordem de Santa Clara

Ordem de Santa Clara da Província do Algarve
type: Concept
in scheme: Tesauro SIPA
preferred label: Order of Saint Clare of Algarve @en
preferred label: Ordre de Sainte-Claire de la province de l'Algarve @fr
preferred label: Ordine di Santa Chiara della Provincia dell'Algarve @it
alternative label: Xabreganas
broader: Ordem de Santa Clara

Ordem dos Frades Menores Capuchos
type: Concept
scope note: Um dos três ramos em que se dividiu a via masculina dos franciscanos, criada em 1528, rompendo com um outro ramo, o da Observância. Nasce no âmbito do Concílio de Trento, com Matteo de Bascio, um frade observante que teria tido uma revelação de São Francisco para regressar ao ideal primitivo, preconizado pela Regra franciscana. Recebe a aprovação do Papa em 1525, sendo fundada pela Bula Religionis Zelus, datada de 1528, com estatutos criados em 1535 – 1536, baseados na Regra e no Testamento de São Francisco. Para se distinguirem dos demais franciscanos, adotam um capucho. Em 1619, adquirem autonomia jurídica, ficando independentes dos Observantes. Contudo, este tivera um antecessor castelhano, Frei João de Guadalupe que, em 1498, se dirigiu a Roma, munido de cartas de recomendação dos Reis Católicos, a solicitar ao Papa autorização para seguir a regra preconizada por São Francisco. Neste âmbito criaram vários cenóbios em território espanhol, que, no século XVI, após a morte do fundador (1503) passam a ser perseguidos, refugiando-se em Portugal e criando a custódia da Piedade, em 1508, confirmada por breve de Júlio II, em 1509, sendo a primeira custódia capucha de todo o ramo franciscano.
in scheme: Tesauro SIPA
preferred label: Order of Friars Minor Capucin @en
preferred label: Ordre des Frères Mineurs Capucins @fr
preferred label: Ordine dei Frati Minori Cappuccini @it
alternative label: Antoninos
alternative label: Capuchos
alternative label: Franciscanos Capuchos
alternative label: Franciscanos Recolectos
broader: Ordem de São Francisco
narrower: Ordem dos Frades Menores Capuchos da Província da Arrábida
narrower: Ordem dos Frades Menores Capuchos da Província da Piedade
narrower: Ordem dos Frades Menores Capuchos da Província da Soledade
narrower: Ordem dos Frades Menores Capuchos da Província de Santo António
narrower: Ordem dos Frades Menores Capuchos da Real Província de Nossa Senhora da Conceição

Ordem dos Frades Menores Capuchos da Província da Arrábida
type: Concept
scope note: Teve origem na Província do Algarve, fundada em 1542 e aprovada em 1560. Conventos: Nossa Senhora dos Prazeres, em Palhais (1542-1834), Santa Maria da Arrábida (1542-1834), Nossa Senhora da Piedade de Salvaterra de Magos (1543-1834), Nossa Senhora da Piedade da Caparica (1550-1834), São José de Ribamar (1551-1834), Santa Cruz de Sintra (1560-1834), Santa Maria Madalena de Alcobaça (1566-1834), Nossa Senhora da Conceição de Alferrara (1567-1834), Nossa Senhora dos Anjos em Torres Vedras (1570-1834), Espírito Santo da Mealhada (1573-1834), Nossa Senhora da Conceição da Azóia (1584-1834), Santo António de Pereiro, em Santarém (1590-1834), Madre de Deus de Verderena (1591-1834), Santo António de Torres Novas (1591-1834), São Miguel de Gaeiras (1602-1834), Nossa Senhora da Boa Viagem, em Oeiras (1618-1834), Santa Catarina de Ribamar (1634-1834), Santo António de Leiria (1651-1834), São Cornélio dos Olivais (1675-1834), São Pedro de Alcântara, em Lisboa (1685-1834), Nosso Senhor e Santo António de Mafra (1730-1834).
in scheme: Tesauro SIPA
preferred label: Order of Friars Minor Capucin of the Province of Arrábida @en
broader: Ordem dos Frades Menores Capuchos

Ordem dos Frades Menores Capuchos da Província da Piedade
type: Concept
scope note: Criada pelo breve Exponi nobis nuper, de 7 de julho de 1517, de Leão X, separada da de Castela, que fora fundada em 1509. Conventos: São Francisco de Tavira (1320-1834), Nossa Senhora da Piedade, em Vila Viçosa (1500-1834), São Vicente do Cabo, em Sines (1504-1834), Nossa Senhora da Conceição do Bosque, em Borba (1505-1834), São Francisco de Elvas (1518-1834), São Francisco de Lagos (1518-1834), Santo António de Portalegre (1522-1834), Nossa Senhora da Esperança de Portimão (1530-1834), Santo António de Estremoz (1537-1834), Nossa Senhora da Purificação de Évora (1544-1834), Nossa Senhora da Assunção, na Vidigueira (1545-1834), Santo António de Loulé (1546-1834), São Francisco de Portel (1547-1834), Santo António de Évora (1576-1834), Santo António de Alter do Chão (1595-1834), Santo António do Redondo (1603-1834), Santo António de Beja (1609-1834), Santo António de Fronteira (1613-1834), Santo António de Faro (1620-1834), Santo António de Moura (1684-1834).
in scheme: Tesauro SIPA
preferred label: Order of Friars Minor Capucin of the Province of Piedade @en
broader: Ordem dos Frades Menores Capuchos

Ordem dos Frades Menores Capuchos da Província da Soledade
type: Concept
scope note: Destaca-se da Província da Piedade em 1668, por breve de Clemente IX, executado em 1673. Conventos: Nossa Senhora dos Anjos, em Azurara (1424-1834), Bom Jesus do Monte, na Franqueira (1497-1834), São Frutuoso do Real (1522-1834), Santo António de Aveiro (1524-1834), Nossa Senhora do Seixo no Fundão (1526-1834), Santo António de Abrantes (1526-1834), Nossa Senhora da Anunciada em Tomar (1528-1834), Santo António dos Olivais em Coimbra (1539-1834), Santo António da Covilhã (1553-1834), Santo António de Castelo Branco (1562-1834), Santo António do Vale da Piedade, em Vila Nova de Gaia (1569-1834), Nossa Senhora da Caridade, no Sardoal (1571-1834), Santo António de Penamacor (1571-1834), Santo António de Ourém (1600-1834), Santo António de Idanha-a-Nova (1630-1834), Santo António de Barcelos (1652-1834), Santo António de Guimarães (1663-1834), Santo António de Penafiel (1663-1834), São Francisco de Chaves (1673-1834), Havia, ainda, o Hospício de Santo António do Calvário, no Porto (1735-1834).
in scheme: Tesauro SIPA
preferred label: Order of Friars Minor Capucin of the Province of Soledade @en
broader: Ordem dos Frades Menores Capuchos

Ordem dos Frades Menores Capuchos da Província de Santo António
type: Concept
scope note: Teve origem na Província de Portugal da Via Observante, formando custódia em 1565 e Província em 1568. Conventos: Santa Catarina da Carnota (1565-1834), Santa Maria da Ínsua (1565-1705), Santa Maria de Mosteiró (1565-1705), Santo António da Castanheira (1565-1834), Santo António de Ponte de Lima (1565-1705), Santo António do Pinheiro da Chamusca (1565-1834), São Francisco do Monte, em Orgens (1565-1705), São Francisco do Monte, em Viana do Castelo (1565-1705), São Francisco de Lamego (1568-1705), São Francisco de Vila Real (1568-1705), São Francisco de Moncorvo (1569-1705), Santo António dos Capuchos de Lisboa (1570-1834), Nossa Senhora do Loreto, em Paio de Pele (1572-1834), Santo António de Penela (1576-1834), Nossa Senhora dos Anjos em Sobral de Monte Agraço (1590-1834), Santo António de Aldeia Galega da Merceana (1600-1834), Santo António da Pedreira, em Coimbra (1602-1834), Santo António de Caminha (1618-1705), Santo António de Viana do Castelo (1625-1705), Santo António da Sertã (1635-1834), Santo António de Serém (1635-1705), Santo António de Viseu (1635-1705), Santo António de Cantanhede (1675-1834), São Bento de Arcos de Valdevez (1677-1705), São José de Cernache de Bonjardim (1699-1834), Nossa Senhora do Cardal, em Pombal (1707-1834), Santo António da Anadia (1750-1834), Santo António da Lousã (1750-1834), Santo António de Condeixa (1750-1834).
in scheme: Tesauro SIPA
preferred label: Order of Friars Minor Capucin of the Province of Santo António @en
broader: Ordem dos Frades Menores Capuchos

Ordem dos Frades Menores Capuchos da Real Província de Nossa Senhora da Conceição
type: Concept
scope note: Teve origem na Província de Santo António, fundada em 1705. Conventos: Santa Maria da Ínsua (1705-1834), Santa Maria de Mosteiró (1705-1834), Santo António de Caminha (1705-1834), Santo António de Ponte de Lima (1705-1834), Santo António de Serém (1705-1834), Santo António de Viana do Castelo (1705-1834), São Bento de Arcos de Valdevez (1705-1834), São Francisco de Lamego (1705-1834), São Francisco de Moncorvo (1705-1834), São Francisco de Vila Real (1705-1834), São Francisco do Monte, em Orgens (1705-1834), São Francisco do Monte, em Viana do Castelo (1705-1834), Santo António de Viseu (1705-1834), Santo António de Vila Cova de Alva (1713-1834), Santo António de Pinhel (1731-1834), Nossa Senhora da Conceição de Melgaço (1746-1834), São Bento e Nossa Senhora da Glória de Monção (1748-1834), Santo António do Porto (1747-1832), Santo Cristo da Fraga (1749-1834), São José de São Pedro do Sul (1751-1834). Possuía, ainda, o Colégio de Santo António da Estrela, em Coimbra (17??-1834) e o Hospício da Bemposta, em Lisboa (1707-1834).
in scheme: Tesauro SIPA
preferred label: Order of Friars Minor Capucin of the Royal Province of Nossa Senhora Da Conceição @en
broader: Ordem dos Frades Menores Capuchos

Ordem dos Frades Menores Conventuais
type: Concept
scope note: Um dos três ramos em que se dividiu a via masculina dos franciscanos, criado em 1517, correspondendo a uma tendência que se verificava desde 1250, usada parta qualificar uma conceção de vida que não aceitava a regra original de Francisco de Assis, seguindo uma via mais simples, com certos privilégios que o Papa Inocêncio IV entretanto concedera, permitindo-lhes utilizarem sandálias, possuírem bens pecuniários, poderem andar a cavalo e usarem camisa de linho. Instalavam-se nas cidades ou junto a igrejas conventuais, dedicando-se à predicação e ao ensino. A sua vivência baseia-se nas Constituições de Narbonne, de 1260. A cisão entre os Conventuais e a Via Observante, ocorrida em 1517, com a bula de Leão X, constituiu um rude golpe para os mesmos e os conventuais tendem a desaparecer, o que aconteceria em 1568, com Pio V. Tiveram, entretanto, um protetor, Carlos Borromeu que conferiu a este braço uma certa estabilidade, com constituições criadas em 1628, que estiveram em vigor até 1932. Tiveram o seu momento de apogeu nos séculos XVII e XVIII, com os seus membros a ocupar os mais altos cargos clericais, como os de bispos, arcebispos e os postos de inquisidores. Em Portugal, a bula de Pio V colocou um fim a todos estes diferendos no universo Seráfico, passando todos os conventos para a via Observante, que manteve o título de Província de Portugal.
in scheme: Tesauro SIPA
preferred label: Order of Friars Minor Conventual @en
preferred label: Ordre des Frères Mineurs Conventuels @fr
preferred label: Ordine dei Frati Minori Conventuali @it
alternative label: Franciscanos conventuais
alternative label: Franciscanos claustrais
broader: Ordem de São Francisco
narrower: Província de Portugal dos Conventuais

Província de Portugal dos Conventuais
type: Concept
in scheme: Tesauro SIPA
preferred label: Portugal Povince of the Conventuals @en
broader: Ordem dos Frades Menores Conventuais

Ordem dos Frades Menores Observantes
type: Concept
scope note: Em Itália, várias correntes cenobíticas, se foram insurgindo contra as prerrogativas dadas aos Franciscanos Conventuais, muito distintas do ideal protagonizado por São Francisco, definido inequivocamente na regra e no seu Testamento. Assim, surgiram, sucessivamente, vários núcleos reformistas, embora efémeros, como os dos Cesarenos (Frei Cesareo, 1236), Clarenos (Frei Clareno, 1294), Coletanos (Santa Coleta de Corbié) e Amadeus (Amadeo) (JOSÉ, vol. I, 1760, p. 24). Estes movimentos eram veementemente defendidos pelos frades franciscanos mais proeminentes, como São Bernardino de Siena, São João de Capristano e São Jácome de Marca. De entre estes grupos, surgiu uma corrente mais forte, iniciada por Frei Paulo de Trincis, que germinou e deu origem aos denominados Franciscanos Observantes, com forte expansão após 1368. Estes seguiam integralmente a Regra, praticavam a austeridade e a pobreza na simplicidade dos edifícios, privilegiavam a oração mental e a pregação popular e localizaram-se geralmente em ermos ou meios rurais. A via Observante chegou a Portugal cerca de 1392, através de vários monges que haviam saído de Santiago, região que permanecia adepta da corte de Avinhão, para apoiar o papa de Roma, os responsáveis pela fundação dos primeiros conventos da via observante em Portugal, autorizada por bula de Bonifácio IV, datada de 6 de abril de 1392. O crescimento do mundo observante e a proliferação de cenóbios, levou à necessidade de estabelecer regras de funcionamento e à criação de mecanismos que possibilitassem a comunicação e as relações entre todos eles; neste sentido, foi solicitado, em 1407, ao Provincial dos Claustrais, dos quais eram dependentes, um vigário que assumisse estas tarefas, o que foi diferido a 23 de setembro de 1415, no Concílio de Constância. A partir desta data, os Observantes passaram a ter vigários provinciais e um Geral, independente do Ministro dos Claustrais. Perante o crescimento e a popularidade atingida pelos Observantes, os Conventu…
in scheme: Tesauro SIPA
preferred label: Order of Friars Minor Observants @en
preferred label: Ordre des Frères Mineurs Observants @fr
preferred label: Ordine dei Frati Minori Osservanti @it
alternative label: Observantes
broader: Ordem de São Francisco
narrower: Província de Portugal da Regular Observância
narrower: Ordem dos Frades Menores Observantes da Província de São João Evangelista
narrower: Ordem dos Frades Menores Observantes da Província dos Algarves

Província de Portugal da Regular Observância
type: Concept
scope note: Na sequência do Cisma do Ocidente, quase todas as províncias e custódias espanholas apoiaram o Papa de Avinhão, exceto a de Santiago, governada, na altura, pelo provincial Frei Fernando de Astorga, que se refugiou em Portugal, reino que apoiava o Papa de Roma, a partir do qual estabeleceu o governo da sua Província. Contudo, as contestações na Galiza eram enormes e o prelado, em 1417, autonomizou e criou a Província de Portugal, que ele próprio passou a governar, destacando-a da de Santiago, que se mantinha fiel ao Papa de Avinhão.
in scheme: Tesauro SIPA
preferred label: Portugal Povince of the Regular Observance @en
broader: Ordem dos Frades Menores Observantes

Ordem dos Frades Menores Observantes da Província de São João Evangelista
type: Concept
scope note: Deriva da Província de Portugal e formaram uma custódia em 1638 e província em 1639. Conventos: Nossa Senhora da Guia, em Angra do Heroísmo (1452), Nossa Senhora da Conceição em Vila da Praia (1489-1834), Nossa Senhora do Rosário, em Vila Franca do Campo (1501-1832), Nossa Senhora da Conceição de Ponta Delgada (1525-1834), Nossa Senhora do Rosário da Horta (1552-1834).
in scheme: Tesauro SIPA
preferred label: Order of Friars Minor Observants of the Province of São João Evangelista @en
broader: Ordem dos Frades Menores Observantes

Ordem dos Frades Menores Observantes da Província dos Algarves
type: Concept
scope note: Foi desmembrada da Província de Portugal pela congregação reunida em Tolosa, em 1532, confirmada no Capítulo Geral, no ano seguinte, com sede em Santa Maria de Jesus de Xabregas, em Lisboa. Conventos masculinos: Bom Jesus de Peniche (1533-1834), Nossa Senhora da Estrela de Marvão (1533-1834), Nossa Senhora do Loreto em Santiago do Cacém (1533-1834), Santa Maria de Jesus de Xabregas (1533-1834), Santo António de Alcácer do Sal (1533-1834), Santo António de Campo Maior (1533-1834), Santo António de Cascais (1533-1834), Santo António de Faro (1533-1834), Santo António de Odemira (1533-1834), Santo António de Serpa (1533-1834), Santo António de Sines (1533-1834), São Bernardino, em Atouguia da Baleia (1533-1834), São Francisco de Beja (1533-1834), São Francisco de Estremoz (1533-1834), São Francisco de ?vora (1533-1834), São Francisco de Montemor-o-Novo (1533-1834), São Francisco de Portalegre (1533-1834), São Francisco de Setúbal (1533-1834), São Francisco de Valbom (1533-1834), Nossa Senhora da Visitação de Vila Verde dos Francos (1540-1834), São Francisco de Moura (1547-1834), Nossa Senhora da Piedade de Messejana (1567-1834), Nossa Senhora do Socorro em Alcochete (1572-1834), Nossa Senhora da Conceição de Castelo de Vide (1585-1834), Santo António da Lourinhã (1598-1834), Santo António do Crato (1603-1834), Santo António do Torrão (1604-1834), Santo António de Estômbar (1610-1834), Nossa Senhora da Assunção de Mértola (1612-1834). A via feminina tinha os seguintes conventos: Bom Jesus de Monforte (1533-1862), Chagas de Vila Viçosa (1533-1905), Madre de Deus de Xabregas (1533-1869), Nossa Senhora da Conceição de Beja (1533-1892), Nossa Senhora da Conceição de Elvas (1533-1909), Santa Clara de Beja (1533-1896), Santa Clara de Estremoz (1533-1553), Santa Clara de Évora (1533-1904), Santa Clara de Jesus (1533-1892), Santa Clara de Moura (1533-1893), Santa Clara de Portalegre (1533-1898), Santa Helena do Calvário, em Évora (1570-1889), Nossa Senhora de Ara Coeli (1573-19…
in scheme: Tesauro SIPA
preferred label: Order of Friars Minor Observants of the Province of Algarves @en
alternative label: Xabreganos
broader: Ordem dos Frades Menores Observantes

Ordem Terceira de São Francisco
type: Concept
scope note: As ordens terceiras eram e são grupos de irmãos laicos que viviam em comum e que já existiam no tempo de São Francisco de Assis, o responsável pela união de várias congregações que se formavam, em torno de uma regra comum, criando a Irmandade da Penitência ou Ordem Terceira da Penitência. Esta regra tinha treze capítulos e foi aprovada por Honório III, em 1221, vigorando sessenta e oito anos, sendo ampliada, em 1289, por Nicolau IV, com obrigações de assistência aos leprosos, em albergarias e asilos, tendo várias alterações, com bulas em 1495 (revogação de poderes de enterramento), 1516 (admissão ao hábito sem licença dos bispos), 1606 (Capítulo Geral de Toledo, retomando antigos privilégios). Em 1521, Leão X pela bula Inter Caetera, aprovou uma nova regra, sujeitando estas corporações aos Padres Menores, tendo, contudo, Província própria. Constituíam verdadeiras escolas de santificação, do triunfo do espiritual sobre o carnal, de mortificação, abstinência, autoflagelação, oração, exame de consciência, bem como desprendimento dos bens terrenos, o que foi bem visto pelo Concílio de Trento, dando origem à sua multiplicação, identificando-se, também, com os ideais franciscanos, sendo apoiada incondicionalmente pelos Observantes capuchos, junto aos quais se refugiariam. Conventos masculinos: São Francisco de Caria (1444-1834), Nossa Senhora dos Remédios de Vilar, em Marialva (1447-1834), São Francisco do Vimieiro (1554-1834), Nossa Senhora da Esperança, em Belmonte (1564-1834), São Francisco de Viana do Alentejo (1580-1834), São Francisco de São João da Pesqueira (1581-1834), Nossa Senhora do Vale da Erra, em Coruche (1582-1834), Nossa Senhora de Jesus, em Lisboa (1595-1834), Nossa Senhora de Jesus do Sítio, em Santarém (1617-1834), São Francisco de Mogadouro (1617-1834), São Francisco de Silves (1621-1834), Nossa Senhora do Desterro de Monchique, em Vila Nova de Gaia (1632-1834), São Francisco de Arraiolos (1633-1834), Nossa Senhora da Conceição em Almodôvar (1680-1834…
in scheme: Tesauro SIPA
preferred label: Third Order of Saint Francis @en
preferred label: Troisième Ordre de Saint François @fr
preferred label: Terzo ordine regolare di San Francesco @it
broader: Ordem de São Francisco

Ordem dos Eremitas de Santo Agostinho
type: Concept
scope note: Ordem religiosa mendicante nascida em Itália no século XIII, reunindo vários grupos de eremitas, que passaram a professar a regra criada por Santo Agostinho. O primeiro grupo apareceu na Toscana, em 1244, a que se juntaram vários grupos de outras regiões, em 1256, denominada como a “Grande união”. No século XIV, a Ordem proliferou para vários países, com tendências missionárias, chegando à Alemanha, Áustria, Dalmácia, França e Península Ibérica. Em Portugal, implantou-se, ainda, no século XIII, com a vinda de frades italianos, que se instalaram em Lisboa, em 1234, no Monte de São Gens, onde fundaram a primeira comunidade. Esta prosperou, tendo-se instalado um pouco mais abaixo, no atual Convento da Graça, em 1362, que se tornou a casa-mãe, levando a que fossem denominados Gracianos. Os vários conventos e colégios agregaram-se numa única província, a Província de Portugal, criada em 1243, durando até à extinção das Ordens religiosas, em 1834. Conventos: Nossa Senhora da Graça de Lisboa (1147-1834), Santo Agostinho de Lisboa (1222-1540), Nossa Senhora da Assunção de Penafirme (1226-1834), Nossa Senhora da Graça de Torres Vedras (1267-1834), Santo Agostinho de Vila Viçosa (1270-1834), Santo Agostinho de Santarém (1376-1834), Nossa Senhora dos Anjos de Montemor-o-Velho (1494-1834), Nossa Senhora da Graça, em Évora (1512-1834), Nossa Senhora da Graça, em Castelo Branco (1526-1834), Nossa Senhora da Graça de Tavira (1544-1834), São Pedro de Cete (1551-1834), Nossa Senhora da Luz de Arronches (1570-1834), Nossa Senhora da Graça de Loulé (1574-1834), Santo Agostinho de Leiria (1576-1834), São João o Novo, no Porto (1592-1833), Nossa Senhora do Pópulo, em Braga (1595-1834), Nossa Senhora da Penha de França, em Lisboa (1603-1834), Nossa Senhora da Piedade de Lamego (1630-1834). Têm o Colégio de Nossa Senhora da Graça, em Coimbra (1543-1834).
in scheme: Tesauro SIPA
preferred label: Order of Discalced Augustinians @en
preferred label: Ordre de Saint Augustin; Ordre des ermites de Saint Augustin @fr
preferred label: Ordine di Sant'Agostino; Ordine degli Eremitani di Sant'Agostino @it
alternative label: Agostinhos
alternative label: Gracianos
broader: Ordens mendicantes
narrower: Eremitas da Observância Ordinária

Eremitas da Observância Ordinária
type: Concept
in scheme: Tesauro SIPA
preferred label: Hermits of Regular Observance @en
preferred label: Ermites de l'Observance Ordinaire @fr
preferred label: Eremiti dell'Osservanza Ordinaria @it
broader: Ordem dos Eremitas de Santo Agostinho

Ordem dos Eremitas Descalços de Santo Agostinho
type: Concept
scope note: No século XVII, mais precisamente em 1664, no âmbito dos ditames do Concílio de Trento e apoiados pela rainha D. Luísa de Gusmão, esposa de D. João IV, nasce uma via mais pura e seguidora da regra inicial de Santo Agostinho. A ordem religiosa instala-se na zona de Xabregas, num local chamado Grilos, que viria, popularmente, a designar a congregação. A Ordem propagou-se rapidamente com o apoio da Corte, tendo, em 1683, 11 conventos e três hospícios, onde viviam 152 religiosos, mas estando dependente da Ordem dos Eremitas de Santo Agostinho. Em 1745, criaram uma segunda Província, reformada, a da Beira. Foram extintos em 1834. Conventos: Nossa Senhora da Conceição do Monte Olivete, em Lisboa (1666-1829), Nossa Senhora da Boa-Hora, em Lisboa (1674-1834), Nossa Senhora das Mercês, em Évora (1669-1834), Nossa Senhora da Conceição, em Montemor-o-Novo (1671-1834), Nossa Senhora da Consolação, em Estremoz (1671-1834), Nossa Senhora da Piedade, em Santarém (1675-1834), Bom Jesus, em Porto de Mós (1676-1834), Nossa Senhora da Assunção, em Sobreda (1677-1834), Nossa Senhora da Orada, em Monsaraz (1679-1834), Santa Maria do Castelo, em Portalegre (1683-1834), São Nicolau Tolentino, em Mora (1716-1834), Jesus Maria, em Coimbra (1731), Nossa Senhora do bom Despacho, na Maia (1745-1834), Tinham os Colégios de Nossa Senhora da Boa-Hora, em Setúbal (1695-1834), Nossa Senhora dos Anjos, em Grândola (1727-1834), de Santa Rita, em Coimbra (1731-1834).
in scheme: Tesauro SIPA
preferred label: Order of Discalced Augustinians @en
preferred label: Ordre des Augustins déchaux @fr
preferred label: Ordine degli Agostiniani scalzi @it
alternative label: Grilos
broader: Ordens mendicantes

Ordem das Agostinhas Descalças
type: Concept
scope note: Ordem religiosa criada, em Portugal, pela rainha D. Luísa de Gusmão, esposa de D. João IV, em 1664, com a construção de um convento em Xabregas, tendo vindo as primeiras religiosas do Convento de Santa Mónica, também na cidade de Lisboa, seguindo a regra das Agostinhas Descalças Espanholas. Este edifício foi o único que a Ordem teve em Portugal.
in scheme: Tesauro SIPA
preferred label: Order of Discalced Augustinians @en
alternative label: Grilas
broader: Ordens mendicantes

Ordem dos Irmãos de Nossa Senhora do Monte do Carmo
type: Concept
scope note: Esta Ordem religiosa nasce da junção de vários grupos de anacoretas, que viviam em redor da baía de Haifa, atualmente em Israel. Em 1156, criaram um convento dedicado à Virgem e, quando se organizaram, dirigiram-se ao Patriarca de Jerusalém, Alberto Avogadro, para que lhes redigisse uma regra, que viria a ser executada entre 1205 e 1214, baseada nos princípios de São Basílio de Cesareia e em Santo Agostinho. Em 1291, foram expulsos pelos islâmicos do Oriente, mas, já se encontravam instalados no Ocidente, acolhidos pelo Papa Honório III, que autorizou a regra escrita por Alberto, confirmada por Gregório IX, em 1229; esta viria a ser renovada, integrando elementos das regras reconhecidas no Ocidente, nomeadamente de São Bento, com São Simão Stock, aprovada por Inocêncio IV, em 1247. Tiveram uma integração difícil, sendo mal acolhidos pelo clero secular e pelas demais ordens mendicantes, receosas da concorrência. Criaram uma ordem contemplativa, vivendo do trabalho e das esmolas que recebiam. No século XVI, espalha-se por toda a Europa e, em 15 de fevereiro de 1432, o Papa Eugénio IV concede-lhe várias benesses, dispensando-os do silêncio e do jejum semanal. A bula de 1452, Cum nulla, de Nicolau V, alterou a regra, permitindo a criação de casas femininas. A Ordem chegou a Portugal, através de capelães da Ordem Militar de São João de Jerusalém, em 1251, instalando-se em Moura, expandindo-se para Lisboa por ação de D. Nuno Álvares Pereira, em 1347. Em 1423, realiza-se, em Portugal, o primeiro Capítulo Provincial e elaboraram-se os primeiros estatutos, aprovados por D. João I em 1424. A atividade missionária da Ordem foi praticamente nula, com algumas casas fundadas no Brasil. Em 1834, restavam poucos frades da Ordem, uma vez que os seus cenóbios haviam sido muito danificados pelo terramoto de 1 de novembro de 1755, tendo sido expulsos e partido para o Brasil. Em 1930, a Ordem foi restaurada pela ação do Padre Manuel Baranera, com um grupo de frades provenientes de Espan…
in scheme: Tesauro SIPA
preferred label: Order of the Brothers of the Blessed Virgin Mary of Mount Carmel @en
preferred label: Ordre des Frères de Notre-Dame du Mont Carmel @fr
preferred label: Ordine dei fratelli della Beata Vergine Maria del Monte Carmel @it
alternative label: Carmelitas
broader: Ordens mendicantes

Monjas Descalças da Ordem da Bem-Aventurada Virgem Maria do Monte Carmelo
type: Concept
scope note: Com a dispensa papal, em 1432, de vários items da regra, a vida conventual tornou-se mais liberal, originando movimentos reformistas, principalmente com Santa Teresa de Ávila, em 1562, a qual criou a via denominada “Descalça”, para se distinguir da via comum. Excomungada pelo Geral carmelita, viria a ser reconhecida pelo Papa Clemente VII, criando uma Ordem independente. Em 1581, com o patrocínio de Filipe I, chegaram a Portugal as primeiras monjas, que se instalaram no Convento da Anunciada, passando para casa própria, o Convento de Santo Alberto, em 1584. Em 1787, com a proteção régia, determinou-se fazer uma adaptação portuguesa da regra e das constituições monacais, tomando como base as espanholas, alteradas em 1786, o que seria aprovado em 1790, pelo Papa. Em 1834, a Ordem foi extinta, exceto o Mosteiro de Coimbra, cujas monjas se exilaram em Espanha, em 1910. Na década de 20, a Ordem recomeça a sua atividade em Portugal, seguindo uma regra comum, aprovada em 1926, revisto na década de 60, aproximando-a mais da regra original de Santa Teresa de Ávila. Conventos: Santo Alberto de Lisboa, vulgo Albertas (1585-1890), Santa Teresa de Jesus, em Carnide (1642-1910), São João Evangelista de Aveiro (1658-1862), Nossa Senhora dos Cardais, em Lisboa (1681-1877), São José de Évora (1681-1886), São José e Maria, no Porto (1702-1833), Santa Teresa de Jesus, em Coimbra (1739-1897), Santa Teresa de Jesus, em Braga (1742-1902), Desterro de Jesus, Maria e José, em Viana do Castelo (1780-1900), Santíssimo Coração de Jesus, em Lisboa (1781-1885), Santíssimo Coração de Jesus dos Olivais (?-1889).
in scheme: Tesauro SIPA
preferred label: Order of the Discalced Sisters of the Blessed Virgin Mary of Mount Carmel @en
preferred label: Moniales déchaussées de l'Ordre de la Bienheureuse Vierge Marie du Mont Carmel @fr
preferred label: Monache scalze dell'Ordine della Beata Vergine Maria del Monte Carmelo @it
alternative label: Carmelitas Descalças
broader: Ordens mendicantes
narrower: Ordem dos Irmãos Descalços de Nossa Senhora do Monte do Carmo
narrower: Ordem Terceira do Carmo

Ordem dos Irmãos Descalços de Nossa Senhora do Monte do Carmo
type: Concept
scope note: Com a dispensa papal, em 1432, de vários elementos da regra carmelita, a vida conventual tornou-se mais liberal, originando movimentos reformistas, principalmente com Santa Teresa de Ávila, em 1562, que instigou São João da Cruz a fazer o mesmo na via masculina. D. Teotónio de Bragança, que estudara em Salamanca e conhecia a reforma de Santa Teresa, quando se tornou bispo de Évora, correspondeu-se com a mesma, convidando-a para vir a Portugal, fundar um convento da sua Ordem. A Santa não se deslocou a Évora, mas enviou Frei Ambrósio Mariano a Lisboa, o qual fundou o primeiro convento dos Descalços, em 15 de outubro de 1581, onde teve lugar o primeiro Capítulo Provincial, em 1585, onde participou, pessoalmente, Frei João da Cruz. Após a Restauração de 1640, D. Luísa de Gusmão tornar-se-ia a grande patrocinadora desta via carmelita em Portugal. Conventos: Nossa Senhora dos Remédios, em Lisboa (1581-1834), Nossa Senhora da Piedade de Cascais (1594-1834), Divino Espírito Santo, de Alter do Chão (1595-1834), Nossa Senhora do Carmo, em Figueiró dos Vinhos (1600-1834), São José dos Marianos, em Coimbra (1603-1834), Nossa Senhora dos Remédios, em Évora (1606-1834), Nossa Senhora do Carmo, em Aveiro (1613-1834), Nossa Senhora do Carmo, no Porto (1619-1833), Santa Cruz do Deserto do Buçaco (1630-1834), Nossa Senhora do Carmo de Viana do Castelo (1647-1834), Corpus Christi, em Lisboa (1648-1834), Nossa Senhora da Encarnação, em Olhalvo (1648-1834), Santa Teresa de Jesus, em Santarém (1648-1834), Nossa Senhora do Pópulo, em Braga (1653-1834), Santa Teresa de Jesus, em Setúbal (1661-1834), São João da Cruz, de Carnide (1681-1834), Nossa Senhora do Carmo de Tavira (1737-1834), Nossa Senhora do Carmo, em Vila do Conde (1755-1834), Nossa Senhora do Carmo, em Faro (1766-1834).
in scheme: Tesauro SIPA
preferred label: Order of the Discalced Brothers of the Blessed Virgin Mary of Mount Carmel @en
preferred label: Ordre des Frères déchaussés de Notre-Dame du Mont-Carmel @fr
preferred label: Ordine dei Fratelli Scalzi di Nostra Signora del Monte Carmelo @it
alternative label: Carmelitas Descalços
broader: Monjas Descalças da Ordem da Bem-Aventurada Virgem Maria do Monte Carmelo

Ordem Terceira do Carmo
type: Concept
in scheme: Tesauro SIPA
preferred label: Third Order of Our Lady of Mount Carmel @en
preferred label: Troisième ordre du Carmel @fr
preferred label: Terzo Ordine del Carmelo @it
broader: Monjas Descalças da Ordem da Bem-Aventurada Virgem Maria do Monte Carmelo

Ordens de clérigos regulares
type: Concept
in scheme: Tesauro SIPA
preferred label: Orders of Clerics Regular @en
preferred label: Ordres de clercs réguliers @fr
preferred label: Ordini di chierici regolari @it
broader: Ordens religiosas
narrower: Ordem dos Cónegos Regrantes de Santo Agostinho
narrower: Ordem das Cónegas Regrantes de Santo Agostinho
narrower: Ordem dos Cónegos Regrantes de Santo Antão
narrower: Ordem dos Cónegos Regulares de Santa Cruz
narrower: Ordem dos Padres Camilos
narrower: Ordem dos Teatinos
narrower: Ordem Hospitaleira de São João de Deus

Ordem dos Cónegos Regrantes de Santo Agostinho
type: Concept
scope note: Em Portugal, a Ordem religiosa nasce no século XI, seguindo a regra de Santo Agostinho, tendo como objetivos a pregação, a caridade e a assistência, sendo particularmente exigente com a formação e a atividade coral, de onde saíam os membros do alto clero. Em Portugal, destacam-se duas vertentes, uma localizada a sul do Rio Douro, com fundações monásticas patrocinadas por Santa Cruz de Coimbra e surgindo no âmbito citadino, patrocinados pelo rei, outra na zona Entre Douro e Minho, num espaço mais rural, absorvendo várias comunidades de frades beneditinos, com patrocínios de padroeiros locais. Tiveram a sua primeira reunião provincial em 1229, no Porto, onde se definiram algumas regras, como a periodicidade trienal dos capítulos provinciais, a nomeação de visitadores, regulamentação de saídas; suavização dos jejuns, homogeneização do hábito, generalização da oração diária e da oração mental, desenvolvimento do sistema de ensino. Sofreu um rude golpe no século XVI, com uma reforma protagonizada por Frei Brás de Barros, partindo do Mosteiro de Santa Cruz de Coimbra, perdendo vários cenóbios, que passaram a outras congregações, tendo sido extinta em 1834.
in scheme: Tesauro SIPA
preferred label: Order of Canons Regular of Saint Augustine @en
preferred label: Ordre des chanoines réguliers de Saint-Augustin @fr
preferred label: Canonici regolari di Sant'Agostino confederati @it
broader: Ordens de clérigos regulares

Ordem das Cónegas Regrantes de Santo Agostinho
type: Concept
scope note: Ordem religiosa feminina, criada no século XII, professando a Regra de Santo Agostinho, implantada em Coimbra, junto ao Mosteiro de Santa Cruz, que era dúplice, dando origem ao aparecimento do Mosteiro de São João das Donas, em 1136. Outros mosteiros dúplices foram criados pela Ordem, como Santa Ana de Coimbra, São Félix de Chelas, São Miguel das Donas de Lisboa a as “casas de sorores” em Grijó, Vila boa do Bispo, Landim, Vila Cova e Banho.
in scheme: Tesauro SIPA
preferred label: Order of Canons Regular of Saint Augustine @en
preferred label: Ordre des chanoinesses réguliers de Saint-Augustin @fr
preferred label: Ordine delle Canonichesse Regolari di Sant'Agostino @it
alternative label: Donas
broader: Ordens de clérigos regulares

Ordem dos Cónegos Regrantes de Santo Antão
type: Concept
scope note: Ordem fundada em Dauphiné, cerca de 1095, numa igreja onde estariam guardadas as relíquias de Santo Antão, trazidas, segundo a tradição, de um cavaleiro de Constantinopla, por um nobre local, Guérin de Valloire, sendo o primeiro mestre o pai, Gaston de Valloire. Dedicavam-se a tratar peregrinos atingidos pelo mal de Santo Antão, provocado por uma componente do trigo, que gerava gangrenam convulsões e alucinações, sendo os serviços religiosos assegurados por monges beneditinos da Abadia de Montmajour, na Provença. A comunidade seguia a regra de Santo Agostinho, dependendo diretamente do Papa, possuindo um grão-mestre ou abade. As casas encontravam-se distribuídas por comendas. Instalaram-se nas grandes cidades, espalhando-se por Itália, Alemanha, Península Ibérica, Polónia e Oriente. No século XIII, os antoninos e os beneditinos começaram a lutar abertamente pelo controlo da peregrinação, que levou à intervenção papal, em 1297, por bula de Bonifácio VIII, obrigando os beneditinos a voltar à sua origem, recebendo, em troca, 300 libras anuais, doadas pelos antoninos, a título de recompensa. A partir do século XIV, a doença tende a desaparecer e a Ordem entra em crise económica, dedicando-se à atividade pastoral e à fundação de hospitais para pobres e outros doentes. Declina no século XVII, apesar das sucessivas reformas tentadas em 1616 e 1630 e, em 17 de dezembro de 1776, pela bula Renum humanarum conditio é integrada na Ordem de Malta, tendo desaparecido completamente em 1803. Em Portugal, instalaram-se na casa de Santo Antão de Benespera, próximo da Guarda, no século XIII. Rapidamente, se sucedem outras casas, como a de Marvila, em Santarém, Santo Antão da Aveleira, em Pinhel e de São Domingos de Besteiros, em Viseu, surgindo, ainda, pequenas ermidas junto aos grandes centros, como em Lisboa, Santarém, Coimbra e Évora. A reforma das instituições assistenciais ocorrida nos séculos XV e XVI provoca a decadência da Ordem, que viria a ser integrada na Companhia de Jesus…
in scheme: Tesauro SIPA
preferred label: Order of Canons Regular of Saint Anthony the Abbot @en
preferred label: Ordre des chanoines réguliers de Saint Antoine @fr
preferred label: Ordine dei Canonici Regolari di Sant'Antonio @it
broader: Ordens de clérigos regulares

Ordem dos Cónegos Regulares de Santa Cruz
type: Concept
scope note: A Ordem religiosa nasce no contexto português, numa época em que os mosteiros de Cónegos Regrantes de Santo Agostinho haviam entrado em crise de valores, e financeira, com a usurpação dos cargos por comendadores estrangeiros que estavam ausentes, mas que consumiam os rendimentos das comunidades, sendo necessária uma reforma do sistema, originada pelo poder real, que começava a dominar as ordens religiosas em geral. O primeiro cenóbio a dar origem a uma renovação foi o de Santa Cruz de Coimbra, que já tentara algumas mudanças através do prior João de Noronha (1473-1506), mas que entraria em plena reforma com o hieronimita Frei Brás de Barros, em 1527. A reforma não era coerciva, dando-se hipótese aos que desejavam continuar a professar as normas anteriores de o fazerem, recebendo a denominação de “Cónegos Velhos”. A reforma desenvolveu-se em termos teológicos, económicos e do sistema de ensino, Em 1556, o Papa Paulo V instituiu a Congregação dos Cónegos Regrantes de Santa Cruz de Coimbra e, em 1615, o Papa retifica as constituições apostólicas dos crúzios, possuindo dez mosteiros, a que se acrescentaram mais dez em 1615, por ordem do Papa Clemente VIII. Em 1770, os mosteiros de Grijó, Vila Boa do Bispo, Caramos, Landim, Paderne, São Simão da Junqueira, São Jorge, Refojos do Lima e Moreira da Maia passaram a ser administrados pelos Cónegos Regulares de Santo Agostinho, sendo os bens anexados ao Mosteiro de Mafra. Os mosteiros da Ordem foram afetados pelas Invasões Francesas (1707-1810), tendo sido extintos em 1834.
in scheme: Tesauro SIPA
preferred label: Canons Regular of the Order of the Holly Cross @en
preferred label: Ordre des chanoines réguliers de la Sainte-Croix @fr
preferred label: Ordine della Santa Croce @it
alternative label: Crúzios
broader: Ordens de clérigos regulares

Ordem dos Padres Camilos
type: Concept
scope note: Congregação de clérigos regulares, criada com o intuito de se consagrar ao tratamento de doentes, com ajuda espiritual e material, nos hospitais, prisões ou casas particulares, especialmente em epidemias de peste. Foi criada por Camilo de Lelis, em 1582, e aprovada por Sisto V, após aquele religioso capucho, ao ter um problema de saúde, verificar como funcionavam mal os hospitais. Os membros pronunciam os votos solenes clássicos, de pobreza, castidade e obediência, tendo grande expansão após a morte do fundador, em 1614. Tiveram uma casa em Lisboa.
in scheme: Tesauro SIPA
preferred label: Ministers of the Sick @en
preferred label: Ordre des Clercs Réguliers pour les Malades @fr
preferred label: Chierici regolari Ministri degli Infermi @it
alternative label: Religiosos Camilos
broader: Ordens de clérigos regulares

Ordem dos Teatinos
type: Concept
scope note: Ordem de clérigos regulares, de origem nobre, que vivem sob uma regra, criada pelo padre romano Gaéran de Thiene e pelo bispo de Chieti, Gian Pietro Carafa, em 1524, obrigando-se à pobreza rigorosa, à celebração litúrgica comunitárias e à atividade coral, sendo responsáveis pelo ensino do alto clero, sendo os grandes impulsionadores da revisão dos textos e celebrações litúrgicas. Da Ordem saíram os principais bispos que viriam a propagar as normas do Concílio de Trento. No século XVII, desenvolveram atividades missionárias na Índia e no Bornéu, estando especialmente em Goa, de onde foram expulsos por D. João IV quando subiu ao trono português. D. Ardizzone Spínola vem a Lisboa, em 1648, pedir ao monarca que deixe a Ordem continuar em Goa, o que consegue por alvará de 12 de dezembro de 1650; a partir desta data, instalam-se em Lisboa, no Convento de Nossa Senhora da Divina Providência, no Bairro Alto, casa fundada por D. Mariana de Noronha e Castro, em 1653, destinada a noviços que se preparavam para a atividade missionária. Mantiveram, apenas, este edifício em Portugal, até à expulsão em 1834.
in scheme: Tesauro SIPA
preferred label: Chierici regolari teatini @it
preferred label: Congregation of Clerics Regular; Order of the Theatines @en
preferred label: Ordre des Théatins; Ordre des Clercs Réguliers @fr
alternative label: Teatinos
alternative label: Caetanos
broader: Ordens de clérigos regulares

Ordem Hospitaleira de São João de Deus
type: Concept
scope note: Ordem laica formada em Granada, em 1540, por São João de Deus, aprovada por Pio V em 1571, oficializada no ano seguinte pela bula Licet ex debito, do mesmo Papa, a qual seguia a regra de Santo Agostinho, emitindo os membros votos simples. Dedicada ao apoio aos doentes pobres e à salvação das vítimas da prostituição. Em 1586, forma uma ordem religiosa, por iniciativa de Sisto V, com constituições aprovadas em 1617 por Paulo V e revistas em 1713, sendo o primeiro superior-geral Frei Pedro Soriano. Teve grande sucesso em Espanha, Itália, onde constituiu ordem separada, França e Áustria. Sofreu com as lutas liberais, tendo-se dispersado, reconstituindo-se, em Espanha, em 1867, por ação de Frei Bento Menni, enviado de Itália para esse fim. Em Portugal, o primeiro instituto foi criado em 1606, em Montemo-o-Novo, difundindo-se, essencialmente, pela Índia e Brasil. Foi extinta em 1834, ressurgindo em 1890, com a criação da Casa do Telhal, tendo, além desta, a Casa de Saúde der São João de Deus, em Barcelos, a Casa de São José, em Vilar de Frades, o Hospital de São João de Deus, em Montemor-o-Novo, a Casa de Saúde de São João de Deus, no Funchal, a Casa de Saúde de São Rafael, em Angra do Heroísmo, a Casa de Saúde de São Miguel, em Ponta Delgada, que se mantinham em 1996, data de comemoração da beatificação do Santo fundador.
in scheme: Tesauro SIPA
preferred label: Hospitaller Order of Saint John of God @en
preferred label: Ordre hospitalier de Saint-Jean-de-Dieu @fr
preferred label: Ordine Ospedaliero di San Giovanni di Dio @it
broader: Ordens de clérigos regulares

Ordens monásticas
type: Concept
in scheme: Tesauro SIPA
preferred label: Ordres monastiques @fr
preferred label: Ordini monastici @it
preferred label: Monastic Orders; Monasticism @en
broader: Ordens religiosas
narrower: Ordem da Visitação de Santa Maria
narrower: Ordem de Cister
narrower: Ordem de São Bento
narrower: Ordem Feminina de São Bento
narrower: Ordem de São Bruno
narrower: Ordem de São Jerónimo

Ordem da Visitação de Santa Maria
type: Concept
scope note: Ordem religiosa feminina, fundada em Annecy por São Francisco de Sales e Santa Joana de Chantal, em 1610. Faziam votos simples e tinham, como principal missão, visitar os pobres e doentes. Com o Concílio de Trento, ficaram obrigadas a professar votos solenes e uma clausura rigorosa, obrigando a alterar os seus objetivos iniciais, ficando confinadas a uma vida monástica e educativa, responsáveis pela educação de meninas nobres. A Ordem entrou em Portugal pela mão do padre Oratoriano Teodoro de Almeida, apoiado por uma série de senhoras nobres, chegando a Lisboa em dezembro de 1783, instalando-se, definitivamente, no Mosteiro da Visitação em Belém, a 28 de janeiro de 1784. Não saíram de Portugal em 1834, ficando até 1910, altura em que tinham três casas dedicadas à educação, a casa de Belém, o Colégio da Visitação em Vilar, no Porto, e o Colégio de São Francisco de Sales, em Santo Tirso. Regressaram em 1933, tendo dois mosteiros, um em Braga e outro em Leiria, onde se dedicam, exclusivamente, à vida contemplativa.
in scheme: Tesauro SIPA
preferred label: Order of the Visitation of Holy Mary @en
preferred label: Ordre de la Visitation de Sainte-Marie @fr
preferred label: Ordine della Visitazione di Santa Maria @it
alternative label: Salesianos
alternative label: Salésias
broader: Ordens monásticas

Ordem de Cister
type: Concept
scope note: Ordem religiosa que surgiu da necessidade que um grupo de beneditinos sentiu de cumprir, com mais rigor, a regra de São Bento, tendo sido fundada por Robert de Molesmes, em 1098, na região da Borgonha. Com dificuldades iniciais de implantação e com fraca adesão, os monges brancos sobreviveram graças à ação de trinta monges, liderados por São Bernardo, provenientes do Convento de Cister, descontentes com o tipo de regra que se seguia no local. Estes deram um novo vigor e expansão à nova Ordem, criando a casa-mãe na Abadia de Claraval, com primeira fundação em 1115. Vários mosteiros e grupos de eremitas aderiram ao novo ideal, ajudando à expansão da Ordem. Os mosteiros construídos pela comunidade surgiam em terras doadas, isoladas e com fortes potenciais para cultivo e bons recursos hídricos. As casas tinham um número de monges viável à sua sustentação, que, ao crescerem, davam origem a uma nova casa. Cada uma das casas era mais ou menos autónoma economicamente, dependendo, do ponto de vista administrativo e teológico da casa-mãe. Em Portugal, a Ordem entra com a filiação de casas beneditinas aos novos princípios, tendo sido um dos primeiros a aderir o Mosteiro de São Cristóvão de Lafões, cerca de 1138 e procedendo-se a fundações de raiz, como a casa-mãe de Alcobaça. No século XV, as abadias portuguesas, dependentes de França, tentam emancipar-se, o que viria a ser conseguido por breve do Papa em 1567. Nesta data, a Ordem procedeu a uma reforma litúrgica e de vivência, nomeadamente nos sistemas de cultivo, que abrangiam vastas áreas e passaram a ser aforados a particulares. A via feminina nasceu no final do século XII, surgindo, em Portugal, de imediato, mas tendo atingido o seu desenvolvimento pleno no século XIII, com estatutos próprios, adaptados da Ordem de São Bento. Estavam ligadas ao Capítulo Geral, sob o domínio de Cister ou de Claraval. No caso feminino, também podiam existir abadias, que possuíam outros cenóbios associados, regulado pela organização geral (m…
in scheme: Tesauro SIPA
preferred label: Order of Cistercians @en
preferred label: Ordre cistercien @fr
preferred label: Ordine cistercense @it
alternative label: Cistercienses
broader: Ordens monásticas

Ordem de São Bento
type: Concept
scope note: Ordem religiosa ativa desde a Alta Idade Média, altura em que existiu a tendência para certos grupos viverem em comunidade, tendo adotado a regra de São Bento, dando origem a uma série de cenóbios que seguiam a regra beneditina e que acabaram por se agrupar em torno da abadia de Cluny. Foi introduzida em Portugal no séc. X, embora as comunidades seguissem, paralelamente, regras hispânicas, como a de Pacómio, Isidoro e Frutuoso. As comunidades peninsulares viviam de forma distinta das do resto da Europa, prevalecendo um forte contacto entre o abade ou prior e as comunidades locais, podiam admitir irmãos oblatos seculares e as respetivas famílias e, a maior parte dos mosteiros, eram dúplices (masculinos e femininos). Apenas no século XI, a regra de São Bento se torna a única a ser seguida pelos mosteiros portugueses, com adoção plena a partir do Concílio de Burgos, em 1080, onde se adotou e generalizou a liturgia romana. As comunidades beneditinas concentraram-se, em Portugal, na região entre Douro e Minho, possuindo grandes domínios territoriais. No século XIV, a peste e a crise económica, provocada pelo direito de pousio e pela existência de abades comendatários, que apenas cobravam rendas e não habitavam no local, dizimou alguns mosteiros, que se extinguiram, levando a uma diminuição no número de cenóbios beneditinos em território nacional. Em 1834, a Ordem é extinta, tendo sido restaurada com Frei João de Santa Gertrudes Leite Amorim, em 1865, proveniente do Brasil, o qual angariou vários apoiantes, possibilitando-lhe a aquisição do Mosteiro de Cucujães (1875), elevado a priorado em 1876 e a abadia a 6 de junho de 1888. Com a ajuda da Congregação de Beuron, fundou o Mosteiro de Singeverga, em Roriz, a 25 de janeiro de 1892, fazendo renascer a Ordem. A implantação da República, em 1910, este mosteiro não foi afetado, pois os doadores encontravam-se vivos, tendo regressado à posse da Ordem quando esta regressou em 1931, tendo sido reconhecida como corporação mission…
in scheme: Tesauro SIPA
preferred label: Order of Saint Benedict @en
preferred label: Ordre de Saint Benoît @fr
preferred label: Ordine di San Benedetto @it
alternative label: Beneditinos
broader: Ordens monásticas

Ordem Feminina de São Bento
type: Concept
scope note: A vertente feminina da Ordem religiosa beneditina nasceu a par da masculina, em conventos dúplices, compostos por corpos separados, mas governados por um abade comum ou, mais raramente, por uma abadessa, muito numerosos na Alta Idade Média, por intermédio da ação de Santa Escolástica. Nesta época, cada convento era independente, havendo alterações profundas quando os conventos se agregaram em províncias, nos séculos XIV a XVI, ficando as casas femininas sujeitas ao ordinário, sem laços reais com a Ordem, apenas se mantendo o mesmo tipo de regra e de espiritualidade, de que os bispos eram zelosos protetores, através de visitações regulares. Estas alterações levaram ao desaparecimento de alguns conventos femininos durante este período. Em 1834, os mosteiros foram extintos, mantendo-se abertos até à morte da última freira, chegando algns ao final do século XIX. No século XX, a regra voltou a ressurgir, aliada à masculina, espalhando-se por alguns países da Europa e nos Estados Unidos da América, não entrando em Portugal. Em Portugal, a via feminina teve vários mosteiros – São Salvador de Vairão (974-1890), São Cristóvão de Rio Tinto (1058-1535), Divino Salvador ou Santo André, em Vila Cova, concelho de Barcelos (1081-1533), São Salvador da Vila Cova de Sandim (1081-1536), Santa Marta de Serzedelo das Donas (1085-1471), São Salvador de Vitorino das Donas (1085-1589), Santa Eufémia ou Santa Maria de Ferreira de Aves (1120-1891), São Salvador de Tuias (1165-1173), Santa Maria ou Nossa Senhora da Assunção de Semide (1183-1896), Santa Maria de Tarouquela (1185-1536), Santa Maria de Gondar, em Amarante (1202-1455), Santa Maria de Valboa (1258-1455), Santa Marinha de Loivo (1258-1530), São Pedro de Merufe (1258-1461), São Salvador de Lufrei, Amarante (1455), Santa Ana de Viana do Castelo (1528-1895), Santo Bento da Avé-Maria do Porto (1536-1892), Santa Maria, em Jazente, em Amarante (desaparecido em 1542), São Bento de Viana do Castelo (1546-1891), São Bento de Monção (1550 –…
in scheme: Tesauro SIPA
preferred label: Feminine Order of Saint Benedict @en
preferred label: Ordre féminin de Saint Benoît @fr
preferred label: Ordine femminile di San Benedetto @it
alternative label: Beneditinas
broader: Ordens monásticas

Ordem de São Bruno
type: Concept
scope note: Ordem religiosa semi-eremita, fundada em 1084, em França, por São Bruno, numa montanha deserta, em Chartreuse, onde construíra, o primeiro eremitério, expandindo-se, no final do século, para Itália, com o apoio do Papa Urbano II. Criaram uma regra em 1127, já depois da morte do fundador, ocorrida em 1101. Em comunidade, viviam os padres e os irmãos leigos, em contemplação constante, praticando uma vida solitária, em silêncio, com jejuns semanais, encontrando-se, diariamente, para as celebrações litúrgicas, e no refeitório em períodos de festividades religiosas. O ramo feminino, nasceu em 1145. A Ordem chegou a Portugal por iniciativa do arcebispo de Évora, D. Teotónio de Bragança, que instalou sete monges no paço real, até o Mosteiro de Santa Maria Scala Coeli estar concluído, o que viria a acontecer em 1598. Foi bastante protegida pela Casa Real, que contribuiu para reedificações e adorno dos mosteiros. Extinta em 1834, os edifícios foram vendidos a particulares, mas a Ordem regressou a Portugal em 14 de setembro de 1960, voltando a instalar-se no mosteiro de Évora. Em Portugal, tiveram duas casas, a de Évora e a Cartuxa de Laveiras, próxima de Lisboa, com construção iniciada em 1598.
in scheme: Tesauro SIPA
preferred label: Order of Carthusians @en
preferred label: Ordine certosino @it
preferred label: Ordre des Chartreux; Ordre cartusien @fr
alternative label: Cartuxos
broader: Ordens monásticas

Ordem de São Jerónimo
type: Concept
scope note: Ordem religiosa criada nos séculos XIV e XV, juntando várias congregações eremíticas, que se encontravam espalhadas por Itália e Espanha, inspirada na obra de Giovanni d'Andrea, que exaltava a figura de um São Jerónimo legendário, mas em cujas diretivas espirituais a ordem se viria a fundamentar, apoiada, em Espanha e Portugal, pela monarquia. A Ordem congrega vários grupos, como a Ordem Hospitaleira dos Clérigos Apostólicos de São Jerónimos, denominados como Jesuatos, fundada por João Colombini, em 1335, os Frades Eremitas de São Jerónimo, criados em Pisa, por Pedro Gambacorta, em 1380, e os Eremitas de São Jerónimo, fundados por Carlos de Montegranelli, em 1360. Viviam sob a regra de Santo Agostinho, numa comunidade que impunha o silêncio, a obediência e se dedicava, essencialmente, ao ofício do coro, desenvolvido oito horas diárias. Em 1400, Lope de Olmedo fundou, em Guadalupe, uma congregação observante das linhas iniciais da regra de Santo Agostinho, consideradas demasiado rigorosas pela maior parte das comunidades, ficando esta como um braço autónomo da Ordem hieronimita, o mesmo acontecendo com um braço formado em Fiesole, em 1360. O italiano Tommasucio de Siena foi o responsável pela criação da Ordem em Espanha, sediada em Toledo, que viria a influenciar um português, Vasco Martins, que trouxe os preceitos da mesma para Portugal, fundando um eremitério em Penha Longa, Sintra. Criam vários mosteiros, tendo um ramo feminino, ambos extintos em 1834. Em Portugal, surgem os seguintes mosteiros masculinos: São Jerónimo de Penha Longa (1400-1834), São Jerónimo do Mato, em Alenquer (1400-1834), São Marcos de Tentúgal (1451-1834), Nossa Senhora do Espinheiro, em Évora (1457-1834), Santa Maria de Belém (1498-1834), Nossa Senhora da Pena (1503-1834), Nossa Senhora da Misericórdia, nas Berlengas (1513-1535), Santa Maria da Costa, em Guimarães (1528-1834), Nossa Senhora da Conceição de Valbenfeito (1535-1834), surgindo o Colégio de São Jerónimo, em Coimbra (1550-1834). S…
in scheme: Tesauro SIPA
preferred label: Order of Saint Jerome @en
preferred label: Ordre de Saint Jérôme @fr
preferred label: Ordine di San Girolamo @it
alternative label: Hieronimitas
alternative label: Jerónimos
broader: Ordens monásticas

Pessoas coletivas religiosas de assistência
type: Concept
in scheme: Tesauro SIPA
preferred label: Religious juridical persons of assistance @en
preferred label: Personnes morales religieuses d'assistance @fr
preferred label: Persone giuridiche religiose di assistenza @it
hidden label: Pessoas colectivas religiosas de assistência
broader: Igreja Católica
narrower: Confraria
narrower: Irmandade

Confraria
type: Concept
scope note: Associação de fiéis, regulamentadas e com estatutos próprios que surgem com a finalidade de assistir aos seus irmãos, desenvolver ações caritativas e promover o culto público do seu santo patrono, por cuja festa se responsabilizam. Existem vários tipos de confrarias, como as penitenciais, que surgem frequentemente no Sul da Europa e expiam os pecados através de atos de autoflagelação durante os ofícios pascais, as caritativas, devocionais e as que agrupam um ofício, sendo a forma de garantir a coesão do grupo, permitindo-lhes angariar estatutos e regalias mais vantajosos para os mesmos.
in scheme: Tesauro SIPA
preferred label: Fraternity @en
preferred label: Confrérie @fr
preferred label: Confraternita @it
broader: Pessoas coletivas religiosas de assistência
narrower: Misericórdias

Misericórdias
type: Concept
in scheme: Tesauro SIPA
preferred label: Houses of Mercy @en
preferred label: Misericordia @fr
broader: Confraria

Irmandade
type: Concept
scope note: Associação de fiéis, regulamentadas e com estatutos próprios que surgem com a finalidade de assistir aos seus irmãos, desenvolvendo ações caritativas.
in scheme: Tesauro SIPA
preferred label: Brotherood @en
preferred label: Fraternité; Confrérie @fr
preferred label: Confraternita; Fratellanza @it
broader: Pessoas coletivas religiosas de assistência

Igreja protestante (Pessoas coletivas religiosas segundo o credo)
type: Concept
in scheme: Tesauro SIPA
preferred label: Protestant Church (Religious juridical persons according to worship) @en
preferred label: Église protestante (Personnes morales religieuses selon la croyance) @fr
preferred label: Chiesa protestante (Persone giuridiche religiose secondo il credo) @it
broader: Pessoas coletivas religiosas segundo o credo
narrower: Igreja anglicana
narrower: Igreja evangélica alemã
narrower: Igreja evangélica presbiteriana

Igreja anglicana
type: Concept
in scheme: Tesauro SIPA
preferred label: Church of England @en
preferred label: Église anglicane @fr
preferred label: Chiesa anglicana @it
broader: Igreja protestante (Pessoas coletivas religiosas segundo o credo)

Igreja evangélica alemã
type: Concept
in scheme: Tesauro SIPA
preferred label: Evangelical Church in Germany @en
preferred label: Église évangélique allemande @fr
preferred label: Chiesa evangelica tedesca @it
broader: Igreja protestante (Pessoas coletivas religiosas segundo o credo)

Igreja evangélica presbiteriana
type: Concept
in scheme: Tesauro SIPA
preferred label: Presbyterian Evangelical Church @en
preferred label: Église évangélique presbytérienne @fr
preferred label: Chiesa evangelica presbiteriana @it
broader: Igreja protestante (Pessoas coletivas religiosas segundo o credo)

Pessoas coletivas segundo o tipo genérico
type: Concept
in scheme: Tesauro SIPA
preferred label: Juridical persons according to generic type @en
preferred label: Personnes morales par type générique @fr
preferred label: Persone giuridiche secondo il tipo generico @it
hidden label: Pessoas colectivas segundo o tipo genérico
broader: Pessoas coletivas
narrower: Órgão (Pessoas coletivas)

Órgão (Pessoas coletivas)
type: Concept
in scheme: Tesauro SIPA
preferred label: Contitutional body (Juridical persons) @en
preferred label: Organisme (Personnes morales) @fr
preferred label: Organo; Ente (Persone giuridiche) @it
broader: Pessoas coletivas segundo o tipo genérico
narrower: Órgão colegial

Órgão colegial
type: Concept
in scheme: Tesauro SIPA
preferred label: Collegiate body @en
preferred label: Organisme collégial @fr
preferred label: Organo collegiale @it
broader: Órgão (Pessoas coletivas)
narrower: Órgão colegial segundo o setor de atividade

Órgão colegial segundo o setor de atividade
type: Concept
in scheme: Tesauro SIPA
preferred label: Collegiate body according to activity sector @en
preferred label: Organisme collégial par secteur d'activité @fr
preferred label: Organo collegiale per settore di attività @it
hidden label: Órgão colegial segundo o sector de atividade
broader: Órgão colegial
narrower: Órgão colegial religioso

Órgão colegial religioso
type: Concept
in scheme: Tesauro SIPA
preferred label: Religious collegiate body @en
preferred label: Organe collégial religieux @fr
preferred label: Organo collegiale religioso @it
broader: Órgão colegial segundo o setor de atividade
narrower: Órgão colegial religioso de governo e administração
narrower: Órgão colegial religioso de reunião

Órgão colegial religioso de governo e administração
type: Concept
in scheme: Tesauro SIPA
preferred label: Religious collegiate body of government and administration @en
preferred label: Organisme collégial religieux de gouvernement et d'administration @fr
preferred label: Organo collegiale religioso di governo e amministrazione @it
broader: Órgão colegial religioso
narrower: Arciprestado (Órgão colegial religioso de governo e administração)
narrower: Cabido
narrower: Chancelaria
narrower: Colegiada (Órgão colegial religioso)
narrower: Colégio cardinalício
narrower: Conezia
narrower: Consistório (Órgão colegial religioso de governo e administração)
narrower: Cúria diocesana
narrower: Cúria papal
narrower: Cúria patriarcal
narrower: Definitório (Órgão colegial religioso de governo e administração)
narrower: Fábrica paroquial
narrower: Guardiania
narrower: Nunciatura
narrower: Presbyterium
narrower: Vigararia

Arciprestado (Órgão colegial religioso de governo e administração)
type: Concept
in scheme: Tesauro SIPA
preferred label: Archpriest; Archpresbyter (Religious collegiate body) @en
preferred label: Archipresbytérat (Organe collégial religieux) @fr
preferred label: Arcipretura (Organo collegiale religioso) @it
alternative label: Ouvidoria
alternative label: Vigararia forânea
broader: Órgão colegial religioso de governo e administração

Cabido
type: Concept
scope note: Conjunto de religiosos (cónegos), com estatutos próprios e aprovados pelo bispo da arquidiocese ou diocese, que preside às funções litúrgicas de uma igreja catedral ou de uma igreja colegiada, nas quais podem ser coadjuvados por vários sacerdotes e diáconos. Paralelamente, o Cabido de uma catedral tem por função ser consultor do bispo ou arcebispo e assumir as suas funções em caso de sede vacante, ou seja, na ausência de um bispo, residente ou não. Teoricamente, devia-lhe pertencer o privilégio da escolha do novo bispo, mas raramente acontecia, sendo escolhido pelo monarca. Deveria, ainda, garantir funções assistenciais, zelando pelos pobres, órfãos e peregrinos da diocese, e de ensino, sendo os responsáveis pelo funcionamento das escolas catedralícias. O Cabido diocesano é composto pelo arcediago, arcipreste, deão, chantre, mestre-escola, tesoureiro e um chanceler. A existência de uma comunidade em torno do bispo vem desde as origens do Cristianismo, mas, a partir dos séculos XI a XIII, dá-se uma separação entre o bispo e o Cabido, que passam a ter residências próprias.
in scheme: Tesauro SIPA
preferred label: Chapter @en
preferred label: Chapitre @fr
preferred label: Capitolo @it
broader: Órgão colegial religioso de governo e administração

Chancelaria
type: Concept
in scheme: Tesauro SIPA
preferred label: Chancellery @en
preferred label: Chancellerie @fr
preferred label: Cancelleria @it
broader: Órgão colegial religioso de governo e administração
narrower: Chancelaria Episcopal

Chancelaria Episcopal
type: Concept
scope note: Órgão responsável pelo funcionamento político e administrativo de uma diocese, sendo dirigido por um chanceler, que pode ter vários funcionários ao seu serviço, nomeadamente notários.
in scheme: Tesauro SIPA
preferred label: Episcopal chancellery @en
preferred label: Chancellerie épiscopale @fr
preferred label: Cancelleria episcopale @it
broader: Chancelaria

Colegiada (Órgão colegial religioso)
type: Concept
scope note: Grupo de cónegos e alguns auxiliares que viviam em comunidade e desenvolviam em alguns templos um culto solene, semelhante ao das catedrais, tendo de possuir estatutos próprios, retificados pelo bispo. Dependiam do bispo diocesano, exceto as mais antigas que mantinham uma autonomia, como, no caso português, a de Guimarães. Tal como sucedeu nas catedrais, os cónegos separaram-se do prior, passando a viver individualmente, processo que ocorreu entre os séculos XI a XIII. Tinham como função, para além de garantir o culto solene, manter escolas e assistir a pobres, órfãos e peregrinos. Era composto pelo prior, apresentado pelo padroeiro da igreja e confirmado pelo bispo da diocese, chantre, sub-chantre, tesoureiro e mestre-escola. Nas mais importantes, poderiam existir mais cónegos e capelães, que proliferaram com a criação de capelas particulares com fins funerários. Constituindo uma realidade rara no Norte de Portugal, proliferaram no Centro e Sul, existindo uma em cada sede de concelho; sofreram um rude golpe com a extinção dos dízimos no século XIX, mas sobreviveram à Revolução Liberal, à instauração da República, tendo desaparecido com a Lei da Separação da Igreja e do Estado. Tiveram origem num forte incremento dado à vida comunitária pela reforma gregoriana, tendo mesmo atingido alguns mosteiros, cujos membros não se adaptavam às exigências de uma vida regular.
in scheme: Tesauro SIPA
preferred label: Collegiate Churches (Religious collegiate body) @en
preferred label: Collégiale (Organe collégial religieux) @fr
preferred label: Collegiata (Organo collegiale religioso) @it
broader: Órgão colegial religioso de governo e administração

Colégio cardinalício
type: Concept
scope note: Órgão responsável por aconselhar o Papa nas suas atividades religiosa e administrativas. Foi instituído em 1150, sendo composto por um Decano, o Bispo de Ostia, um Camerlengo, responsável pela administração dos bens do Vaticano durante a vacância do trono pontifício, e os sete cardeais das dioceses situadas mais próximo de Roma (Albano, Frascati, Ostia, Palestrina, Porto-Santa Ruffina e Velletri-Segni).
in scheme: Tesauro SIPA
preferred label: College of Cardinals @en
preferred label: Collège des Cardinaux @fr
preferred label: Collegio Cardinalizio @it
alternative label: Colégio dos Cardeais
alternative label: Sacro Colégio Pontifício
broader: Órgão colegial religioso de governo e administração

Conezia
type: Concept
in scheme: Tesauro SIPA
preferred label: Canonry @en
preferred label: Conenicat @fr
preferred label: Canonicato @it
broader: Órgão colegial religioso de governo e administração

Consistório (Órgão colegial religioso de governo e administração)
type: Concept
scope note: Assembleia onde se reúnem o Papa e o Colégio Cardinalício para resolverem problemas da Igreja Católica.
in scheme: Tesauro SIPA
preferred label: Consistory @en
preferred label: Consistoire @fr
preferred label: Concistoro @it
broader: Órgão colegial religioso de governo e administração
narrower: Consistório extraordinário
narrower: Consistório ordinário

Consistório extraordinário
type: Concept
scope note: Assembleia que reúne todos os cardeais existentes no mundo católico.
in scheme: Tesauro SIPA
preferred label: Extraordinary Consistory @en
preferred label: Consistoire extraordinaire @fr
preferred label: Concistoro straordinario @it
broader: Consistório (Órgão colegial religioso de governo e administração)

Consistório ordinário
type: Concept
scope note: Assembleia que apenas tem presente o Papa e os sete cardeais que compõem o Colégio, podendo, contudo, estar presentes outros bispos, sacerdotes e convidados especiais.
in scheme: Tesauro SIPA
preferred label: Ordinary Consistory @en
preferred label: Consistoire ordinaire @fr
preferred label: Concistoro ordinario @it
broader: Consistório (Órgão colegial religioso de governo e administração)

Cúria diocesana
type: Concept
scope note: Conjunto de órgãos e pessoas que assistem o bispo ou arcebispo no governo das suas dioceses. No campo administrativo, surgem o vigário-geral, vigário episcopal, um secretário-geral e um ecónomo, surgindo, ainda, o moderador da cúria, um religioso nomeado pelo bispo para fazer a interligação entre este órgão e o bispo. No campo judicial, existe o tribunal que julga casos do foro canónico, surgindo, em cada diocese, o vigário judicial.
in scheme: Tesauro SIPA
preferred label: Diocesan chancery @en
preferred label: Curie diocésaine @fr
preferred label: Curia diocesana @it
alternative label: Arcebispado
alternative label: Bispado
broader: Órgão colegial religioso de governo e administração

Cúria papal
type: Concept
scope note: A cúria é no sentido restrito a corte que assiste o Papa nas suas funções, sendo o principal órgão administrativo do Vaticano, constituído por uma série de autoridades que coordenam o funcionamento do Estado do Vaticano e da Igreja Católica.
in scheme: Tesauro SIPA
preferred label: Curie papale @fr
preferred label: Curia Papale @it
preferred label: Roman Pontiff Curia; Papal Curia @en
alternative label: Papado
broader: Órgão colegial religioso de governo e administração
narrower: Dicastério

Dicastério
type: Concept
scope note: Cada um dos departamentos que compõem a Cúria Papal, composta por uma secretaria de estado, presidida por um cardeal, por congregações que tratam de assuntos específicos (Congregação para a Doutrina da Fé, Congregação para as Igrejas Orientais, Congregação para as Causas dos Santos, Congregação para a Evangelização dos Povos, Congregação para os Institutos de Vida Consagrada e as Sociedades de Vida Apostólica, Congregação para o Culto Divino e Disciplina dos Sacramentos, Congregação para os Bispos, Congregação para o Clero e Congregação para a Educação Católica), por Conselhos Pontifícios, órgãos de aconselhamento, (Pontifício Conselho para os Leigos, Pontifício Conselho para a Promoção da Unidade dos Cristãos, Pontifício Conselho para a Família, Pontifício Conselho Justiça e Paz, Pontifício Conselho Cor Unum, Pontifício Conselho para a Pastoral dos Migrantes e Itinerantes, Pontifício Conselho para a Pastoral no Campo da Saúde, Pontifício Conselho para a Cultura, Pontifício Conselho para as Comunicações Sociais, Pontifício Conselho para o Diálogo Inter-Religioso e Pontifício Conselho para os Textos Legislativos), os Tribunais que julgam processos de direito canónico (Penitenciaria Apostólica, Supremo Tribunal da Assinatura Apostólica, Rota Romana), Comissões Pontifícias (Comissão Pontifícia para a América Latina, Comissão Pontifícia Ecclesia Dei, Comissão Pontifícia para os Bens Culturais da Igreja, Comissão Pontifícia de Arqueologia Sacra, Comissão Pontifícia Bíblica, Comissão Teológica Internacional, Comissão Interdicasterial para o Catecismo da Igreja Católica e Comissão para as Relações Religiosas com o Judaísmo), as Academias Pontifícias (Pontifícia Academia para a Vida, Pontifícia Academia das Ciências, Pontifícia Academia Eclesiástica, Pontifícia Academia Cultorum Martyrum, Pontifícia Academia das Ciências Sociais), os Comités Pontifícios (Pontifício comité para os Congressos Eucarísticos Internacionais e Pontifício Comité das Ciências Históricas) e um pequen…
in scheme: Tesauro SIPA
preferred label: Dicastery @en
preferred label: Dicastère @fr
preferred label: Dicastero @it
broader: Cúria papal

Cúria patriarcal
type: Concept
in scheme: Tesauro SIPA
preferred label: Patriarchal Curia @en
preferred label: Curie patriarcale @fr
preferred label: Curia patriarcale @it
alternative label: Patriarcado
broader: Órgão colegial religioso de governo e administração

Definitório (Órgão colegial religioso de governo e administração)
type: Concept
scope note: Órgão composto por um conjunto de religiosos com função de aconselhamento e eleitoral, os quais, em conjunto com o Provincial, garantiam a administração de uma Província de uma ordem religiosa mendicante. O definitório é composto pelos definidores, cujo número varia consoante a Província a que pertence.
in scheme: Tesauro SIPA
preferred label: Definitory @en
preferred label: Définitoire @fr
preferred label: Definitorio @it
alternative label: Governo Geral da Província
broader: Órgão colegial religioso de governo e administração

Fábrica paroquial
type: Concept
scope note: Conjunto de fiéis, normalmente leigos, que zelam pelas contas da paróquia e pelos vários festejos da mesma, ajudando, nesta atividade, o pároco.
in scheme: Tesauro SIPA
preferred label: Chop-church @en
broader: Órgão colegial religioso de governo e administração

Guardiania
type: Concept
scope note: Entidade responsável pelo governo de um convento mendicante, que, no caso franciscano, era composto pelo guardião e vice-guardião, os quais se responsabilizavam pelo funcionamento temporal e espiritual, respetivamente. Cada guardiania durava um ano e meio, iniciando-se no Capítulo Provincial e terminando no Capítulo intermédio.
in scheme: Tesauro SIPA
preferred label: Guardianship @en
preferred label: Gardiennage @fr
preferred label: Guardianato
broader: Órgão colegial religioso de governo e administração

Nunciatura
type: Concept
in scheme: Tesauro SIPA
preferred label: Nunciature @en
preferred label: Nonciature @fr
preferred label: Nunziatura @it
broader: Órgão colegial religioso de governo e administração

Presbyterium
type: Concept
scope note: Grupo de religiosos que colaboravam como o bispo nos primeiros tempos do Cristianismo, tendo sido alterado no concílio de Verneuil, em 755, substituído pelo Cabido.
in scheme: Tesauro SIPA
broader: Órgão colegial religioso de governo e administração

Vigararia
type: Concept
in scheme: Tesauro SIPA
preferred label: Vicariat @fr
preferred label: Vicarianto @it
preferred label: Vicarship; Vicarage @en
broader: Órgão colegial religioso de governo e administração

Órgão colegial religioso de reunião
type: Concept
in scheme: Tesauro SIPA
preferred label: Religious collegiate organ of assembly @en
preferred label: Organisme collégial de rencontre religieuse @fr
preferred label: Organo collegiale di riunione religiosa @it
broader: Órgão colegial religioso
narrower: Capítulo
narrower: Concílio
narrower: Conclave
narrower: Conferência episcopal
narrower: Sínodo

Capítulo
type: Concept
scope note: Assembleia de religiosos com competência para decidir sobre diversas matérias, variando consoante o tipo de capítulo.
in scheme: Tesauro SIPA
preferred label: Chapter @en
preferred label: Chapitre @fr
preferred label: Capitolo @it
broader: Órgão colegial religioso de reunião
narrower: Capítulo regular
narrower: Capítulo secular

Capítulo regular
type: Concept
scope note: Assembleia de uma ordem religiosa com competência para decidir sobre diversas matérias, reunida no mosteiro ou convento designado como Casa Capitular. Nestas reuniões, consoante a ordem religiosa, tomam-se decisões relativas ao foro eclesiástico, ao governo da ordem e das respetivas casas, bem como se procede à eleição dos vários corpos dirigentes das mesmas.
in scheme: Tesauro SIPA
preferred label: Regular Chapter @en
preferred label: Chapitre régulier @fr
preferred label: Capitolo regolare @it
broader: Capítulo
narrower: Capítulo das regras monásticas
narrower: Capítulo extraordinário
narrower: Capítulo geral
narrower: Capítulo intermédio
narrower: Capítulo ordinário
narrower: Capítulo provincial

Capítulo das regras monásticas
type: Concept
scope note: Assembleia diária que reunia uma congregação ou ordem religiosa, reunida num espaço concebido para tal, o Capítulo, que surgiria no século IX, sendo possível que, anteriormente, se reunissem em outros locais das casas religiosas. Nesta reunião, era lido um capítulo da Regra, para relembrar aos monges ou frades os seus compromissos, evitando desleixos, o martirológico, o necrológio, o acto de fundação, recitação de salmos, absolvição de defuntos, encomendação de benfeitores, distribuição de tarefas quotidianas e imposição de penas aos culposos. Terá sido um costume iniciado pelas primeiras comunidades beneditinas, que se viria a propagar a todas as demais ordens religiosas.
in scheme: Tesauro SIPA
preferred label: Monastic rules chapter @en
preferred label: Chapitre des règles monastiques @fr
preferred label: Capitolo delle regole monastiche @it
broader: Capítulo regular

Capítulo extraordinário
type: Concept
scope note: Assembleia de uma ordem religiosa que não segue o calendário comum, com o objetivo de decidir sobre matéria(s) urgente(s).
in scheme: Tesauro SIPA
preferred label: Extraordinary Chapter @en
preferred label: Chapitre extraordinaire @fr
preferred label: Capitolo straordinario @it
broader: Capítulo regular

Capítulo geral
type: Concept
scope note: Assembleia de uma ordem religiosa, que reúne os órgãos máximos de cada um dos países ou Províncias que a compõem, tendo em vista o governo da ordem em questão e a tomada de decisões do foro canónico e estatutário. Normalmente, serve para eleger o representante máximo da Ordem, aquele que tem assento junto à Cúria romana. Realiza-se na casa-mãe de cada uma das ordens.
in scheme: Tesauro SIPA
preferred label: General Chapter @en
preferred label: Chapitre général @fr
preferred label: Capitolo generale @it
broader: Capítulo regular

Capítulo intermédio
type: Concept
scope note: Assembleia dos principais órgãos de uma ordem religiosa, efetuada após a visita do Provincial ou Geral, destinada a tomar decisões sobre o governo da ordem em causa, podendo ser organizada em qualquer dos mosteiros ou conventos da mesma.
in scheme: Tesauro SIPA
preferred label: Intermediate Chapter @en
preferred label: Chapitre intermédiaire @fr
preferred label: Capitolo intermedio @it
broader: Capítulo regular

Capítulo ordinário
type: Concept
scope note: Assembleia de uma casa religiosa, que serve para tratar de assuntos correntes do governo da mesma e, no caso de algumas ordens religiosas, como os beneditinos ou cistercienses, eleger o abade da mesma.
in scheme: Tesauro SIPA
preferred label: Chapitre ordinaire @fr
preferred label: Capitolo ordinario @it
preferred label: Common Chapter @en
broader: Capítulo regular

Capítulo provincial
type: Concept
scope note: Assembleia levada a cabo pelas ordens mendicantes, com uma periodicidade trienal, onde tomam assento todos os religiosos eleitores, realizada no convento designado como Casa Capitular. Esta reunião tem como objetivo eleger o governo da Província.
in scheme: Tesauro SIPA
preferred label: Provincial Chapter @en
preferred label: Chapitre provincial @fr
preferred label: Capitolo provinciale @it
broader: Capítulo regular

Capítulo secular
type: Concept
scope note: Assembleia que reúne os vários cónegos que compõem um cabido de uma catedral ou colegiada, servindo para discutir assuntos do governo da mesma e proceder à eleição para os principais cargos. Esta reunião decorria, normalmente, na casa capitular da catedral ou colegiada ou na casa oficial de residência do cabido.
in scheme: Tesauro SIPA
preferred label: Secular Chapter @en
preferred label: Chapitre séculier @fr
preferred label: Capitolo secolare @it
broader: Capítulo

Concílio
type: Concept
scope note: Reunião de autoridades eclesiásticas, especialmente bispos, sancionada pelo Papa, tendo como objetivo deliberar sobre questões de fé, costumes, doutrina, disciplina eclesiástica ou mesmo assuntos pastorais.
in scheme: Tesauro SIPA
preferred label: Council @en
preferred label: Concile @fr
preferred label: Concilio @it
broader: Órgão colegial religioso de reunião
narrower: Concílio diocesano
narrower: Concílio ecuménico
narrower: Concílio nacional
narrower: Concílio provincial

Concílio diocesano
type: Concept
scope note: Reunião composta pelo bispo e os párocos da diocese que governa para deliberar sobre questões de fé, costumes, doutrina, disciplina eclesiástica ou mesmo pastorais.
in scheme: Tesauro SIPA
preferred label: Diocesan Council @en
preferred label: Concile diocésain @fr
preferred label: Concilio diocesano @it
broader: Concílio

Concílio ecuménico
type: Concept
scope note: Reunião composta por todos os bispos da Igreja Católica, presidido pelo Papa ou por alguém por ele designado, com o objetivo de esclarecer pontos doutrinais, dogmas, corrigir erros e condenar heresias. Foi uma prática introduzida na Igreja no século IV e, entre 325 e 1965, ocorreram vinte e um concílios ecuménicos.
in scheme: Tesauro SIPA
preferred label: Ecumenical council @en
preferred label: Concile œcuménique @fr
preferred label: Concilio ecumenico @it
alternative label: Concílio perfeito
broader: Concílio

Concílio nacional
type: Concept
scope note: Reunião composta por bispos e outros dignitários para decidir sobre matérias de fé, moral ou disciplina, a nível nacional, tendo nascido após a queda do Império romano e a formação de vários estados, sendo convocado, normalmente, pelo bispo primaz.
in scheme: Tesauro SIPA
preferred label: National Chapter @en
preferred label: Concile national @fr
preferred label: Concilio nazionale @it
alternative label: Concílio plenário
broader: Concílio

Concílio provincial
type: Concept
scope note: Associação dos religiosos pertencentes a uma província eclesiástica, convocada pelo arcebispo, para discutir assuntos relativos à correção e reforma da vida religiosa e a relação com os fiéis. Nesta, estavam presentes todos os bispos sufragâneos e vigários capitulares, cabidos e abades regulares. Iniciaram-se no século III, passando a uma periodicidade anual no século XIII, deliberação tomada no IV Concílio de Latrão (1215).
in scheme: Tesauro SIPA
preferred label: Synod @en
preferred label: Concile provincial @fr
preferred label: Concilio provinciale @it
broader: Concílio

Conclave
type: Concept
scope note: Reunião do colégio de cardeais para eleger o novo Papa. O sistema de reunião foi criado pelo Papa Gregório X, em 1274 e decorre, desde aí, com poucas alterações. Os cardeais mantêm-se em clausura na Capela Sistina, reunindo 15 a 20 dias após a morte do Papa, onde se procedem às votações, tendo, cada um dos cardeais, o máximo de dois assistentes, sendo necessário o eleito obter 2/3 dos votos dos cardeais; as votações podem ser várias e, no fim de cada uma delas, os votos são queimados, aos quais se junta uma substância química, que produz o fumo negro ou branco, revelando a existência de um novo Papa, conduzido à janela da basílica que dá para a Praça, sendo anunciado o seu nome e feita a sua primeira bênção Urbi et Orbi.
in scheme: Tesauro SIPA
broader: Órgão colegial religioso de reunião

Conferência episcopal
type: Concept
scope note: Órgão criado no séc. XX, na sequência do Concílio Vaticano II (1963-1965), congregando o conjunto de bispos de uma nação ou determinado território, com poder deliberativo e autónomo relativo a algumas questões.
in scheme: Tesauro SIPA
preferred label: Episcopal conference @en
preferred label: Conférence épiscopale @fr
preferred label: Conferenza episcopale @it
broader: Órgão colegial religioso de reunião

Sínodo
type: Concept
in scheme: Tesauro SIPA
preferred label: Synod @en
preferred label: Synode @fr
preferred label: Sinodo @it
broader: Órgão colegial religioso de reunião

Pessoas singulares
type: Concept
in scheme: Tesauro SIPA
preferred label: Personnes physiques @fr
preferred label: Persone fisiche @it
preferred label: Physical persons; Natural persons @en
broader: Entidades
narrower: Pessoas singulares segundo a condição
narrower: Pessoas singulares segundo o setor de atividade

Pessoas singulares segundo a condição
type: Concept
in scheme: Tesauro SIPA
preferred label: Singular persons according to condition @en
preferred label: Personnes physiques selon le statut @fr
preferred label: Persone fisiche secondo lo status @it
broader: Pessoas singulares
narrower: Pessoas singulares segundo a condição jurídica
narrower: Pessoas singulares segundo a condição religiosa
narrower: Pessoas singulares segundo a função organizacional e social

Pessoas singulares segundo a condição jurídica
type: Concept
in scheme: Tesauro SIPA
preferred label: Singular persons according to juridical condition @en
preferred label: Personnes physiques selon le statut juridique @fr
preferred label: Persone fisiche secondo lo status giuridico @it
broader: Pessoas singulares segundo a condição
narrower: Detido
narrower: Recluso

Detido
type: Concept
in scheme: Tesauro SIPA
preferred label: Prisoner @en
preferred label: Captif @fr
preferred label: Detenuto @it
broader: Pessoas singulares segundo a condição jurídica

Recluso
type: Concept
in scheme: Tesauro SIPA
preferred label: Prisonnier @fr
preferred label: Prigioniero @it
preferred label: Inmate; Recluse @en
broader: Pessoas singulares segundo a condição jurídica

Pessoas singulares segundo a condição religiosa
type: Concept
in scheme: Tesauro SIPA
preferred label: Singular persons according to religious condition @en
preferred label: Personnes physiques selon le statut religieux @fr
preferred label: Persone fisiche secondo lo stato religioso @it
broader: Pessoas singulares segundo a condição
narrower: Agnóstico
narrower: Ateu
narrower: Religioso

Agnóstico
type: Concept
in scheme: Tesauro SIPA
preferred label: Agnostic @en
preferred label: Agnostique @fr
preferred label: Agnostico @it
broader: Pessoas singulares segundo a condição religiosa

Ateu
type: Concept
in scheme: Tesauro SIPA
preferred label: Atheist @en
preferred label: Athée @fr
preferred label: Ateo @it
broader: Pessoas singulares segundo a condição religiosa

Religioso
type: Concept
in scheme: Tesauro SIPA
preferred label: Religious @en
preferred label: Religieux @fr
broader: Pessoas singulares segundo a condição religiosa

Pessoas singulares segundo a função organizacional e social
type: Concept
in scheme: Tesauro SIPA
preferred label: Singular persons according to organisational and social function @en
preferred label: Personnes physiques selon leur fonction organisationnelle et sociale @fr
preferred label: Persone fisiche in base alla funzione organizzativa e sociale @it
broader: Pessoas singulares segundo a condição
narrower: Aficionado
narrower: Público

Aficionado
type: Concept
in scheme: Tesauro SIPA
preferred label: Enthusiast; Afficionado @en
preferred label: Aficionado; Supporter @fr
preferred label: Appassionato; Aficionado @it
broader: Pessoas singulares segundo a função organizacional e social

Público
type: Concept
in scheme: Tesauro SIPA
preferred label: Public @fr
preferred label: Pubblico @it
preferred label: Public; Crowd @en
alternative label: Assistência
broader: Pessoas singulares segundo a função organizacional e social

Pessoas singulares segundo o setor de atividade
type: Concept
in scheme: Tesauro SIPA
preferred label: Natural persons according to activity sector @en
preferred label: Personnes physiques par secteur d'activité @fr
preferred label: Persone fisiche per settore di attività @it
hidden label: Pessoas singulares segundo o sector de atividade
broader: Pessoas singulares
narrower: Pessoas singulares do setor agrícola e recursos naturais
narrower: Pessoas singulares do setor artístico e artesanal
narrower: Pessoas singulares do setor cinegético e piscatório
narrower: Pessoas singulares do setor comercial e de serviços
narrower: Pessoas singulares do setor da agropecuária
narrower: Pessoas singulares do setor da construção, conservação e planeamento
narrower: Pessoas singulares do setor da justiça
narrower: Pessoas singulares do setor da segurança e proteção
narrower: Pessoas singulares do setor das ciências
narrower: Pessoas singulares do setor das ciências sociais
narrower: Pessoas singulares do setor das comunicações
narrower: Pessoas singulares do setor de apoio infraestrutural
narrower: Pessoas singulares do setor de carga e transporte
narrower: Pessoas singulares do setor de transformação e produção de materiais
narrower: Pessoas singulares do setor do desporto
narrower: Pessoas singulares do setor do ensino e formação
narrower: Pessoas singulares do setor do registo gráfico
narrower: Pessoas singulares do setor financeiro
narrower: Pessoas singulares militares
narrower: Pessoas singulares político-administrativas
narrower: Pessoas singulares religiosas

Pessoas singulares do setor agrícola e recursos naturais
type: Concept
in scheme: Tesauro SIPA
preferred label: Agriculture natural persons @en
preferred label: Personnes physiques dans le secteur agricole @fr
preferred label: Persone fisiche nel settore agricolo @it
hidden label: Pessoas singulares do sector agrícola e recursos naturais
broader: Pessoas singulares segundo o setor de atividade
narrower: Agricultor
narrower: Enxertador
narrower: Mineiro
narrower: Podador
narrower: Silvicultor

Agricultor
type: Concept
in scheme: Tesauro SIPA
preferred label: Farmer @en
preferred label: Agriculteur @fr
preferred label: Agricoltore @it
broader: Pessoas singulares do setor agrícola e recursos naturais

Enxertador
type: Concept
in scheme: Tesauro SIPA
preferred label: Grafter @en
preferred label: Greffeur @fr
preferred label: Innestatore @it
broader: Pessoas singulares do setor agrícola e recursos naturais

Mineiro
type: Concept
in scheme: Tesauro SIPA
preferred label: Miner @en
preferred label: Mineur @fr
preferred label: Minerario @it
broader: Pessoas singulares do setor agrícola e recursos naturais

Podador
type: Concept
in scheme: Tesauro SIPA
preferred label: Pruner @en
preferred label: Tailleur @fr
preferred label: Potatore @it
broader: Pessoas singulares do setor agrícola e recursos naturais

Silvicultor
type: Concept
in scheme: Tesauro SIPA
preferred label: Silviculturist @en
preferred label: Sylviculteur @fr
preferred label: Selvicoltore @it
broader: Pessoas singulares do setor agrícola e recursos naturais

Pessoas singulares do setor artístico e artesanal
type: Concept
in scheme: Tesauro SIPA
preferred label: Arts and crafts singular persons @en
preferred label: Personnes physiques dans le secteur des arts et de l'artisanat @fr
preferred label: Persone fisiche del settore artistico e artigianale @it
hidden label: Pessoas singulares do sector artístico e artesanal
broader: Pessoas singulares segundo o setor de atividade
narrower: Artesão
narrower: Artista
narrower: Artífice
narrower: Pessoas singulares do setor artístico e artesanal segundo a hierarquia
narrower: Pessoas singulares do setor artesanal segundo a profissão ou ocupação
narrower: Pessoas singulares do setor artístico segundo a profissão ou ocupação
narrower: Pessoas singulares do setor performativo

Artesão
type: Concept
in scheme: Tesauro SIPA
preferred label: Artisan @fr
preferred label: Artigiano @it
preferred label: Artisan; Craftsman @en
broader: Pessoas singulares do setor artístico e artesanal

Artista
type: Concept
in scheme: Tesauro SIPA
preferred label: Artist @en
preferred label: Artiste @fr
broader: Pessoas singulares do setor artístico e artesanal

Artífice
type: Concept
in scheme: Tesauro SIPA
preferred label: Ouvrier @fr
preferred label: Artefice @it
preferred label: Artisan; Craftsman @en
broader: Pessoas singulares do setor artístico e artesanal

Pessoas singulares do setor artístico e artesanal segundo a hierarquia
type: Concept
in scheme: Tesauro SIPA
preferred label: Arts and crafts singular persons according to hierarchy @en
preferred label: Personnes physiques dans le secteur des arts et de l'artisanat selon la hiérarchie @fr
preferred label: Persone fisiche nel settore dell'artigianato artistico in base alla gerarchia @it
hidden label: Pessoas singulares do sector artístico e artesanal segundo a hierarquia
broader: Pessoas singulares do setor artístico e artesanal
narrower: Aprendiz
narrower: Mestre (Pessoas singulares segundo a função organizacional e social)
narrower: Oficial
narrower: Servente
narrower: Servidor

Aprendiz
type: Concept
in scheme: Tesauro SIPA
preferred label: Apprentice @en
preferred label: Apprenti @fr
preferred label: Apprendista @it
broader: Pessoas singulares do setor artístico e artesanal segundo a hierarquia

Mestre (Pessoas singulares segundo a função organizacional e social)
type: Concept
in scheme: Tesauro SIPA
preferred label: Master (Singular persons according to organisational and social function) @en
preferred label: Maître d'apprentissage; Maitre (Personnes physiques selon leur fonction organisationnelle et sociale) @fr
preferred label: Maestro (Persone fisiche in base alla funzione organizzativa e sociale) @it
broader: Pessoas singulares do setor artístico e artesanal segundo a hierarquia

Oficial
type: Concept
in scheme: Tesauro SIPA
preferred label: Officier @fr
preferred label: Ufficiale @it
broader: Pessoas singulares do setor artístico e artesanal segundo a hierarquia

Servente
type: Concept
in scheme: Tesauro SIPA
preferred label: Servant; Assistant @en
preferred label: Servant; Manoeuvre @fr
broader: Pessoas singulares do setor artístico e artesanal segundo a hierarquia

Servidor
type: Concept
scope note: Pessoa singular que executa todo o tipo de serviços braçais inerentes a uma construção.
in scheme: Tesauro SIPA
preferred label: Serviteur @fr
preferred label: Servizievole @it
preferred label: Servant @en
alternative label: Braceiro
broader: Pessoas singulares do setor artístico e artesanal segundo a hierarquia

Pessoas singulares do setor artesanal segundo a profissão ou ocupação
type: Concept
in scheme: Tesauro SIPA
preferred label: Singular persons in the craft sector by profession or occupation @en
preferred label: Personnes physiques dans le secteur de l'artisanat par profession ou occupation @fr
preferred label: Persone fisiche del settore artigianale per professione o occupazione @it
hidden label: Pessoas singulares do sector artesanal segundo a profissão ou ocupação
broader: Pessoas singulares do setor artístico e artesanal
narrower: Alfaiate
narrower: Chapeleiro
narrower: Costureiro
narrower: Luveiro
narrower: Oleiro (Pessoas singulares do setor artesanal segundo a profissão ou ocupação)
narrower: Sapateiro

Alfaiate
type: Concept
in scheme: Tesauro SIPA
preferred label: Tailor @en
preferred label: Tailleur; Couturier @fr
broader: Pessoas singulares do setor artesanal segundo a profissão ou ocupação

Chapeleiro
type: Concept
in scheme: Tesauro SIPA
preferred label: Hatter @en
preferred label: Chapelier @fr
preferred label: Cappellaio @it
broader: Pessoas singulares do setor artesanal segundo a profissão ou ocupação

Costureiro
type: Concept
in scheme: Tesauro SIPA
preferred label: Couturier @fr
preferred label: Sarto @it
preferred label: Seamstress @en
broader: Pessoas singulares do setor artesanal segundo a profissão ou ocupação

Luveiro
type: Concept
in scheme: Tesauro SIPA
preferred label: Ganterie @fr
preferred label: Glovemaker @en
preferred label: Guantaio @it
broader: Pessoas singulares do setor artesanal segundo a profissão ou ocupação

Oleiro (Pessoas singulares do setor artesanal segundo a profissão ou ocupação)
type: Concept
in scheme: Tesauro SIPA
preferred label: Potter (Singular persons in the craft sector by profession or occupation) @en
preferred label: Potiér (Personnes physiques dans le secteur de l'artisanat par profession ou occupation) @fr
preferred label: Vasaio (Persone fisiche del settore artigianale per professione o occupazione) @it
broader: Pessoas singulares do setor artesanal segundo a profissão ou ocupação

Sapateiro
type: Concept
scope note: Oficial que fabrica os vários tipos de calçado.
in scheme: Tesauro SIPA
preferred label: Shoemaker/Cobbler @en
preferred label: Cordonnier @fr
preferred label: Calzolaio @it
broader: Pessoas singulares do setor artesanal segundo a profissão ou ocupação

Pessoas singulares do setor artístico segundo a profissão ou ocupação
type: Concept
in scheme: Tesauro SIPA
preferred label: Personnes physiques dans le secteur du design artistique et artisanal @fr
preferred label: Persone fisiche che operano nel settore dell'artigianato e dell'arte @it
preferred label: Arts and crafts design singular persons according to hierarchy @en
hidden label: Pessoas singulares do sector artístico segundo a profissão ou ocupação
broader: Pessoas singulares do setor artístico e artesanal
narrower: Argumentista
narrower: Arquiteto
narrower: Ceramista
narrower: Cineasta
narrower: Compositor
narrower: Desenhador
narrower: Designer
narrower: Escritor
narrower: Escultor
narrower: Imaginário
narrower: Ourives
narrower: Pintor

Argumentista
type: Concept
in scheme: Tesauro SIPA
preferred label: Screenwriter @en
preferred label: Scénariste @fr
preferred label: Sceneggiatore @it
broader: Pessoas singulares do setor artístico segundo a profissão ou ocupação

Arquiteto
type: Concept
in scheme: Tesauro SIPA
preferred label: Architect @en
preferred label: Architecte @fr
preferred label: Architetto @it
hidden label: Arquitecto
broader: Pessoas singulares do setor artístico segundo a profissão ou ocupação
narrower: Arquiteto paisagista

Arquiteto paisagista
type: Concept
in scheme: Tesauro SIPA
preferred label: Landscape architect @en
preferred label: Architecte paysagiste @fr
preferred label: Architetto paesaggista @it
hidden label: Arquitecto paisagista
broader: Arquiteto

Ceramista
type: Concept
in scheme: Tesauro SIPA
preferred label: Céramiste @fr
preferred label: Ceramist; Ceramicist @en
broader: Pessoas singulares do setor artístico segundo a profissão ou ocupação

Cineasta
type: Concept
in scheme: Tesauro SIPA
preferred label: Filmmaker; Director @en
preferred label: Réalisateur @fr
preferred label: Regista @it
broader: Pessoas singulares do setor artístico segundo a profissão ou ocupação

Compositor
type: Concept
scope note: Agente que cria um trabalho musical normalmente uma peça de música manuscrita ou impressa.
in scheme: Tesauro SIPA
preferred label: Composer @en
preferred label: Compositeur @fr
preferred label: Compositore @it
broader: Pessoas singulares do setor artístico segundo a profissão ou ocupação

Desenhador
type: Concept
in scheme: Tesauro SIPA
preferred label: Concepteur @fr
preferred label: Progettista @it
preferred label: Draughtsman; Designer @en
broader: Pessoas singulares do setor artístico segundo a profissão ou ocupação

Designer
type: Concept
in scheme: Tesauro SIPA
broader: Pessoas singulares do setor artístico segundo a profissão ou ocupação

Escritor
type: Concept
in scheme: Tesauro SIPA
preferred label: Writer @en
preferred label: Écrivain @fr
preferred label: Scrittore @it
broader: Pessoas singulares do setor artístico segundo a profissão ou ocupação

Escultor
type: Concept
in scheme: Tesauro SIPA
preferred label: Sculptor @en
preferred label: Sculpteur @fr
preferred label: Scultore @it
broader: Pessoas singulares do setor artístico segundo a profissão ou ocupação

Imaginário
type: Concept
scope note: Oficial que esculpe imagens de vulto, relevos e ornatos arquitetónicos.
in scheme: Tesauro SIPA
preferred label: Bigot; Imaginary @en
alternative label: Maginário
broader: Pessoas singulares do setor artístico segundo a profissão ou ocupação

Ourives
type: Concept
in scheme: Tesauro SIPA
preferred label: Goldsmith @en
preferred label: Orfèvre @fr
preferred label: Orafo @it
broader: Pessoas singulares do setor artístico segundo a profissão ou ocupação

Pintor
type: Concept
in scheme: Tesauro SIPA
preferred label: Painter @en
preferred label: Peintre @fr
preferred label: Pittore @it
broader: Pessoas singulares do setor artístico segundo a profissão ou ocupação
narrower: Aguarelista

Aguarelista
type: Concept
scope note: Pessoa singular que se dedica à pintura segundo a técnica da aguarela.
in scheme: Tesauro SIPA
preferred label: Watercolour artist @en
preferred label: Aquarelliste @fr
preferred label: Acquerellista @it
broader: Pintor
narrower: Pintor de azulejo
narrower: Pintor dourador

Pintor de azulejo
type: Concept
in scheme: Tesauro SIPA
preferred label: Tile painter @en
preferred label: Peintre en carreaux @fr
preferred label: Pittore di piastrelle @it
broader: Aguarelista

Pintor dourador
type: Concept
in scheme: Tesauro SIPA
preferred label: Gilder @en
preferred label: Peintre doreur @fr
preferred label: Pittore di dorature @it
broader: Aguarelista

Pessoas singulares do setor performativo
type: Concept
in scheme: Tesauro SIPA
preferred label: Singular persons in the performing arts sector @en
preferred label: Personnes physiques du secteur des arts du spectacle @fr
preferred label: Persone fisiche del settore dello spettacolo @it
hidden label: Pessoas singulares do sector performativo
broader: Pessoas singulares do setor artístico e artesanal
narrower: Artista tauromáquico
narrower: Ator
narrower: Bailarino
narrower: Cantor

Artista tauromáquico
type: Concept
in scheme: Tesauro SIPA
preferred label: Bullfight artist @en
preferred label: Artiste taurin @fr
preferred label: Artista di corrida @it
broader: Pessoas singulares do setor performativo
narrower: Apoderado
narrower: Toureiro

Apoderado
type: Concept
in scheme: Tesauro SIPA
preferred label: Bullfighter’s manager @en
broader: Artista tauromáquico

Toureiro
type: Concept
in scheme: Tesauro SIPA
preferred label: Torero @fr
preferred label: Bullfighter; Toreador; Torero @en
broader: Artista tauromáquico
narrower: Bandarilheiro
narrower: Cavaleiro
narrower: Forcado
narrower: Matador
narrower: Toureiro a pé

Bandarilheiro
type: Concept
in scheme: Tesauro SIPA
preferred label: Bandarillero @en
broader: Toureiro

Cavaleiro
type: Concept
in scheme: Tesauro SIPA
preferred label: Bullfught rider @en
preferred label: Chevalier @fr
preferred label: Cavaliere @it
alternative label: Toureiro equestre
broader: Toureiro

Forcado
type: Concept
in scheme: Tesauro SIPA
preferred label: Bullfighter @en
preferred label: Forcadier @fr
preferred label: Forcato @it
alternative label: Monteiros da choca
broader: Toureiro
narrower: Cernelheiro
narrower: Chefe de lide
narrower: Forcado da cara
narrower: Rabejador
narrower: Rejoneador

Cernelheiro
type: Concept
in scheme: Tesauro SIPA
broader: Forcado

Chefe de lide
type: Concept
in scheme: Tesauro SIPA
preferred label: Bullfighting leader @en
preferred label: Meneur taurin @fr
preferred label: Capo della corrida @it
broader: Forcado

Forcado da cara
type: Concept
in scheme: Tesauro SIPA
preferred label: Face forcado @en
broader: Forcado

Rabejador
type: Concept
in scheme: Tesauro SIPA
broader: Forcado

Rejoneador
type: Concept
in scheme: Tesauro SIPA
preferred label: Rejoneador; Lancer @en
broader: Forcado

Matador
type: Concept
in scheme: Tesauro SIPA
broader: Toureiro

Toureiro a pé
type: Concept
in scheme: Tesauro SIPA
preferred label: Torero à pied @fr
preferred label: Torero a piedi @it
preferred label: Bullfighter (Toreador) @en
broader: Toureiro

Ator
type: Concept
in scheme: Tesauro SIPA
preferred label: Actor @en
preferred label: Acteur @fr
preferred label: Attore @it
hidden label: Actor
broader: Pessoas singulares do setor performativo

Bailarino
type: Concept
in scheme: Tesauro SIPA
preferred label: Dancer @en
preferred label: Danseur @fr
preferred label: Ballerino @it
broader: Pessoas singulares do setor performativo

Cantor
type: Concept
in scheme: Tesauro SIPA
preferred label: Singer @en
preferred label: Chanteur @fr
preferred label: Cantante @it
broader: Pessoas singulares do setor performativo
narrower: Cantor lírico

Cantor lírico
type: Concept
in scheme: Tesauro SIPA
preferred label: Opera singer @en
preferred label: Chanteur lyrique @fr
preferred label: Cantante lirico @it
broader: Cantor

Pessoas singulares do setor cinegético e piscatório
type: Concept
in scheme: Tesauro SIPA
preferred label: Singular persons in the hunting and fishing sector @en
preferred label: Personnes physiques du secteur de la chasse et de la pêche @fr
preferred label: Persone fisiche del settore della caccia e della pesca @it
hidden label: Pessoas singulares do sector cinegético e piscatório
broader: Pessoas singulares segundo o setor de atividade
narrower: Caçador
narrower: Pescador

Caçador
type: Concept
in scheme: Tesauro SIPA
preferred label: Hunter @en
preferred label: Chasseur @fr
preferred label: Cacciatore @it
broader: Pessoas singulares do setor cinegético e piscatório

Pescador
type: Concept
in scheme: Tesauro SIPA
preferred label: Fisherman @en
preferred label: Pêcheur @fr
preferred label: Pescatore @it
broader: Pessoas singulares do setor cinegético e piscatório

Pessoas singulares do setor comercial e de serviços
type: Concept
in scheme: Tesauro SIPA
preferred label: Singular persons in the commercial and service sector @en
preferred label: Personnes physiques dans le secteur du commerce et des services @fr
preferred label: Persone fisiche nel settore commerciale e dei servizi @it
hidden label: Pessoas singulares do sector comercial e de serviços
broader: Pessoas singulares segundo o setor de atividade
narrower: Alfarrabista
narrower: Almocreve
narrower: Editor
narrower: Feirante
narrower: Feitor
narrower: Livreiro
narrower: Lojista
narrower: Mercador
narrower: Notário
narrower: Padeiro

Alfarrabista
type: Concept
in scheme: Tesauro SIPA
preferred label: Bookstore @en
preferred label: Bouquiniste @fr
preferred label: Libraio antiquario @it
broader: Pessoas singulares do setor comercial e de serviços

Almocreve
type: Concept
in scheme: Tesauro SIPA
preferred label: Mule driver merchant @en
preferred label: Muletier @fr
preferred label: Mulattiere @it
broader: Pessoas singulares do setor comercial e de serviços

Editor
type: Concept
in scheme: Tesauro SIPA
preferred label: Publisher @en
preferred label: Éditeur @fr
preferred label: Editore @it
broader: Pessoas singulares do setor comercial e de serviços

Feirante
type: Concept
in scheme: Tesauro SIPA
preferred label: Market vendor @en
preferred label: Vendeur de marché @fr
preferred label: Venditore di mercato @it
broader: Pessoas singulares do setor comercial e de serviços

Feitor
type: Concept
in scheme: Tesauro SIPA
preferred label: Overseer @en
preferred label: Conducteur de travaux @fr
preferred label: Capo @it
broader: Pessoas singulares do setor comercial e de serviços

Livreiro
type: Concept
in scheme: Tesauro SIPA
preferred label: Bookseller @en
preferred label: Libraire @fr
preferred label: Libraio @it
broader: Pessoas singulares do setor comercial e de serviços

Lojista
type: Concept
in scheme: Tesauro SIPA
preferred label: Shopkeeper @en
preferred label: Commerçant @fr
preferred label: Commerciante @it
broader: Pessoas singulares do setor comercial e de serviços

Mercador
type: Concept
in scheme: Tesauro SIPA
preferred label: Merchant @en
preferred label: Marchand @fr
preferred label: Mercante @it
broader: Pessoas singulares do setor comercial e de serviços

Notário
type: Concept
in scheme: Tesauro SIPA
preferred label: Notaire @fr
preferred label: Notaio @it
preferred label: Notary @en
broader: Pessoas singulares do setor comercial e de serviços

Padeiro
type: Concept
in scheme: Tesauro SIPA
preferred label: Baker @en
preferred label: Boulanger @fr
preferred label: Panettiere @it
broader: Pessoas singulares do setor comercial e de serviços

Pessoas singulares do setor da agropecuária
type: Concept
in scheme: Tesauro SIPA
preferred label: Agriculture and livestock activity singular persons @en
preferred label: Personnes physiques du secteur agricole @fr
preferred label: Persone fisiche al settore agricolo @it
hidden label: Pessoas singulares do sector da agro-pecuária
broader: Pessoas singulares segundo o setor de atividade
narrower: Campino
narrower: Ganadeiro

Campino
type: Concept
in scheme: Tesauro SIPA
preferred label: Bull herdsman @en
broader: Pessoas singulares do setor da agropecuária

Ganadeiro
type: Concept
in scheme: Tesauro SIPA
preferred label: Bull breader @en
preferred label: Éleveur de taureaux @fr
preferred label: Allevatore di bestiame @it
broader: Pessoas singulares do setor da agropecuária

Pessoas singulares do setor da construção, conservação e planeamento
type: Concept
in scheme: Tesauro SIPA
preferred label: Construction, planning and maintenance singular persons @en
preferred label: Personnes physiques du secteur de la construction, planification et de la conservation @fr
preferred label: Persone fisiche nel settore dell'edilizia, planificazione e della conservazione @it
hidden label: Pessoas singulares do sector da construção, conservação e planeamento
broader: Pessoas singulares segundo o setor de atividade
narrower: Abobadilheiro
narrower: Alvaneiro
narrower: Aparelhador
narrower: Cabouqueiro
narrower: Caiador
narrower: Calceteiro
narrower: Conservador
narrower: Curador (Pessoas singulares do setor da construção, conservação e planeamento)
narrower: Empreiteiro
narrower: Engenheiro
narrower: Estucador
narrower: Mestre de canos
narrower: Mestre de obras
narrower: Pregueiro
narrower: Restaurador
narrower: Roçador
narrower: Serralheiro (Pessoas singulares do setor da construção, conservação e planeamento)
narrower: Taipeiro
narrower: Telheiro
narrower: Valador
narrower: Pessoas singulares do setor da construção e conservação segundo o material
narrower: Pessoas singulares do setor da construção naval

Abobadilheiro
type: Concept
in scheme: Tesauro SIPA
preferred label: Vault maker @en
broader: Pessoas singulares do setor da construção, conservação e planeamento

Alvaneiro
type: Concept
in scheme: Tesauro SIPA
preferred label: Brick layer @en
preferred label: Briqueteur @fr
preferred label: Muratore @it
broader: Pessoas singulares do setor da construção, conservação e planeamento

Aparelhador
type: Concept
scope note: Trabalhadores que secundavam os mestres de obras na coordenação dos grupos de oficiais, distribuição de tarefas, interpretação dos traçados e verificação do trabalho feito. O aparelhador surge no final do séc. XV, por influência das fábricas construtivas espanholas, de onde eram oriundos muitos dos mestres de obras da época.
in scheme: Tesauro SIPA
preferred label: Apprêteur @fr
preferred label: Apparecchiatore @it
preferred label: Rigger; Foreman @en
broader: Pessoas singulares do setor da construção, conservação e planeamento

Cabouqueiro
type: Concept
scope note: Pessoa singular que faz alicerces, abre caboucos, faz terraplanagens, arranca e desbasta primariamente a pedraria das pedreiras.
in scheme: Tesauro SIPA
preferred label: Ditchdigger @en
preferred label: Terrassier @fr
preferred label: Cavapietre; Cavatore @it
broader: Pessoas singulares do setor da construção, conservação e planeamento

Caiador
type: Concept
in scheme: Tesauro SIPA
preferred label: Whitewasher @en
preferred label: Badigeonneur @fr
preferred label: Imbianchino @it
broader: Pessoas singulares do setor da construção, conservação e planeamento

Calceteiro
type: Concept
in scheme: Tesauro SIPA
preferred label: Paviour @en
preferred label: Paveur @fr
preferred label: Selciatore @it
broader: Pessoas singulares do setor da construção, conservação e planeamento

Conservador
type: Concept
in scheme: Tesauro SIPA
preferred label: Conservateur @fr
preferred label: Conservatore @it
preferred label: Conserver; Preserver @en
broader: Pessoas singulares do setor da construção, conservação e planeamento

Curador (Pessoas singulares do setor da construção, conservação e planeamento)
type: Concept
scope note: Responsável pela conceção, organização e supervisão de exposições de arte, incluindo a seleção e apresentação das obras, além da elaboração do respetivo catálogo.
in scheme: Tesauro SIPA
preferred label: Curator (Construction, planning and maintenance singular persons) @en
preferred label: Curateur (Personnes physiques du secteur de la construction, planification et de la conservation) @fr
preferred label: Curatore (Persone fisiche nel settore dell'edilizia, planificazione e della conservazione) @it
broader: Pessoas singulares do setor da construção, conservação e planeamento

Empreiteiro
type: Concept
scope note: Mestre de obras que dirige uma construção de acordo com um contrato de empreitada, responsabilizando-se por todo o processo construtivo, desde o início até ao fim do mesmo.
in scheme: Tesauro SIPA
preferred label: Contractor @en
preferred label: Entrepreneur @fr
preferred label: Appaltatore; Imprenditore edile @it
broader: Pessoas singulares do setor da construção, conservação e planeamento

Engenheiro
type: Concept
in scheme: Tesauro SIPA
preferred label: Engineer @en
preferred label: Ingénieur @fr
preferred label: Ingegnere @it
broader: Pessoas singulares do setor da construção, conservação e planeamento
narrower: Engenheiro agrónomo
narrower: Engenheiro civil
narrower: Engenheiro mecânico
narrower: Engenheiro segundo o âmbito cronológico

Engenheiro agrónomo
type: Concept
in scheme: Tesauro SIPA
preferred label: Agronomist @en
preferred label: Ingénieur agricole @fr
preferred label: Ingegnere agricolo @it
broader: Engenheiro

Engenheiro civil
type: Concept
in scheme: Tesauro SIPA
preferred label: Civil engineer @en
preferred label: Ingénieur civil @fr
preferred label: Ingegnere civile @it
broader: Engenheiro
narrower: Engenheiro de estruturas

Engenheiro de estruturas
type: Concept
in scheme: Tesauro SIPA
preferred label: Structure engineer @en
preferred label: Ingénieur structurel @fr
preferred label: Ingegnere strutturale @it
broader: Engenheiro civil

Engenheiro mecânico
type: Concept
in scheme: Tesauro SIPA
preferred label: Mechanical engineer @en
preferred label: Ingénieur mécanique @fr
preferred label: Ingegnere meccanico @it
broader: Engenheiro

Engenheiro segundo o âmbito cronológico
type: Concept
in scheme: Tesauro SIPA
preferred label: Engineer according to chronological scope @en
preferred label: Ingénieur par ordre chronologique @fr
preferred label: Ingegnere in ordine cronologico @it
broader: Engenheiro
narrower: Engenheiro-mor da Província
narrower: Engenheiro-mor do Reino

Engenheiro-mor da Província
type: Concept
in scheme: Tesauro SIPA
preferred label: Chief engineer of the Province @en
preferred label: Ingénieur en chef de la province @fr
preferred label: Ingegnere capo della Provincia @it
broader: Engenheiro segundo o âmbito cronológico

Engenheiro-mor do Reino
type: Concept
in scheme: Tesauro SIPA
preferred label: Chief engineer of the Kingdom @en
preferred label: Ingénieur major du Royaume @fr
preferred label: Ingegnere capo del Regno @it
broader: Engenheiro segundo o âmbito cronológico

Estucador
type: Concept
in scheme: Tesauro SIPA
preferred label: Plâtrier @fr
preferred label: Stuccatore @it
preferred label: Stucco worker; Plasterer @en
broader: Pessoas singulares do setor da construção, conservação e planeamento

Mestre de canos
type: Concept
scope note: Mestre de obras que faz e solda canalizações de chumbo e faz redes de fio de arame para forrar vidraças.
in scheme: Tesauro SIPA
preferred label: Pipe master @en
preferred label: Maître de la tuyauterie @fr
preferred label: Maestro dei tubi @it
broader: Pessoas singulares do setor da construção, conservação e planeamento

Mestre de obras
type: Concept
scope note: Mestre que dirige e organiza um grupo de oficiais, seleciona materiais, delineia modelos e moldes e controla e verifica o andamento de uma obra. No séc. XVI, tinha sobretudo um papel prático, de executante, e nem sempre era ele o autor dos projetos ou traçados das obras que dirigia.
in scheme: Tesauro SIPA
preferred label: Master buider @en
preferred label: Maître d'œuvre @fr
preferred label: Capomastro @it
broader: Pessoas singulares do setor da construção, conservação e planeamento

Pregueiro
type: Concept
scope note: Oficial que faz pregos para uma obra.
in scheme: Tesauro SIPA
preferred label: Nail maker @en
preferred label: Cloutier @fr
preferred label: Chiodatore; Chiodaio @it
broader: Pessoas singulares do setor da construção, conservação e planeamento

Restaurador
type: Concept
in scheme: Tesauro SIPA
preferred label: Restaurateur @fr
preferred label: Restauratore @it
preferred label: Restorer; Conservator @en
broader: Pessoas singulares do setor da construção, conservação e planeamento

Roçador
type: Concept
scope note: Oficial que roça tijolos numa obra.
in scheme: Tesauro SIPA
preferred label: Clearer @en
preferred label: Meuleuse @fr
broader: Pessoas singulares do setor da construção, conservação e planeamento

Serralheiro (Pessoas singulares do setor da construção, conservação e planeamento)
type: Concept
scope note: Oficial que faz fechaduras, batentes e grades metálicas numa obra.
in scheme: Tesauro SIPA
preferred label: Serrurier (Personnes physiques du secteur de la construction et de la conservation) @fr
preferred label: Locksmith (Construction and maintenance singular persons) @en
preferred label: Fabbro; Incastellatore (Persone fisiche nel settore dell'edilizia e della conservazione) @it
broader: Pessoas singulares do setor da construção, conservação e planeamento

Taipeiro
type: Concept
scope note: Oficial especialista que constrói alvenarias de taipa.
in scheme: Tesauro SIPA
preferred label: Mud wall mason @en
preferred label: Piseur @fr
broader: Pessoas singulares do setor da construção, conservação e planeamento

Telheiro
type: Concept
in scheme: Tesauro SIPA
preferred label: Tile layer @en
preferred label: Tuilier @fr
preferred label: Piastrellista @it
broader: Pessoas singulares do setor da construção, conservação e planeamento

Valador
type: Concept
scope note: Oficial que abre valas para uma construção.
in scheme: Tesauro SIPA
preferred label: Fossoyeur @fr
preferred label: Becchino @it
preferred label: Ditcher; Ditchdigger @en
broader: Pessoas singulares do setor da construção, conservação e planeamento

Pessoas singulares do setor da construção e conservação segundo o material
type: Concept
in scheme: Tesauro SIPA
preferred label: Contruction and maintenance singular persons according to material @en
preferred label: Personnes physiques du secteur de la construction et de la conservation par matériau @fr
preferred label: Persone fisiche nel settore dell'edilizia e della conservazione per materiale @it
hidden label: Pessoas singulares do sector da construção e conservação segundo o material
broader: Pessoas singulares do setor da construção, conservação e planeamento
narrower: Trabalho da pedra
narrower: Trabalho de barro
narrower: Trabalho de madeira
narrower: Trabalho do metal
narrower: Trabalho do vidro

Trabalho da pedra
type: Concept
in scheme: Tesauro SIPA
preferred label: Stone work @en
preferred label: Travail de la pierre @fr
preferred label: Lavorazione della pietra @it
broader: Pessoas singulares do setor da construção e conservação segundo o material
narrower: Canoveiro
narrower: Canteiro
narrower: Pedreiro

Canoveiro
type: Concept
scope note: Oficial que faz pedras de canovão.
in scheme: Tesauro SIPA
preferred label: Stone carver @en
preferred label: Tailleur de pierre @fr
preferred label: Masono di pietra @it
broader: Trabalho da pedra

Canteiro
type: Concept
scope note: Oficial que afeiçoa, exculpe e aplica os silhares objeto de um aparelho em cantaria.
in scheme: Tesauro SIPA
preferred label: Stonemason @en
preferred label: Marbrier @fr
preferred label: Scalpellino; Marmista @it
broader: Trabalho da pedra

Pedreiro
type: Concept
scope note: Oficial que executa trabalhos de pedra, compreendendo desbastar, alisar, talhar, dar acabamento, aparelhar, lavrar, assentar cantarias, fazer paredes e todos os elementos estruturais pétreos dos edifícios.
in scheme: Tesauro SIPA
preferred label: Muratore @it
preferred label: Mason @en
preferred label: Maçon @fr
broader: Trabalho da pedra

Trabalho de barro
type: Concept
scope note: Técnica que utiliza a terra argilosa, de grão fino, que adquire plasticidade quando misturada com água podendo ser moldada das mais variadas formas. Ao secar solidifica e se for cozida a altas temperaturas ganha forte resistência física.
in scheme: Tesauro SIPA
preferred label: Clay work @en
preferred label: Travail de l'argile @fr
preferred label: Lavorazione dell'argilla @it
broader: Pessoas singulares do setor da construção e conservação segundo o material
narrower: Azulejador
narrower: Ladrilhador

Azulejador
type: Concept
in scheme: Tesauro SIPA
preferred label: Piastrellista @it
preferred label: Tile maker @en
preferred label: Carreleur @fr
broader: Trabalho de barro

Ladrilhador
type: Concept
scope note: Oficial que aplica ladrilhos ou tijoleiras em pavimentos.
in scheme: Tesauro SIPA
preferred label: Paver @en
preferred label: Pavimentista @it
preferred label: Carreleur; Dallleur @fr
broader: Trabalho de barro

Trabalho de madeira
type: Concept
in scheme: Tesauro SIPA
preferred label: Wood work @en
preferred label: Travail du bois @fr
preferred label: Lavorazione del legno @it
broader: Pessoas singulares do setor da construção e conservação segundo o material
narrower: Carpinteiro
narrower: Corticeiro
narrower: Entalhador
narrower: Ensamblador
narrower: Marceneiro
narrower: Torneiro

Carpinteiro
type: Concept
scope note: Oficial que faz trabalhos de madeira, compreendendo serrar, desbastar, esquadriar, lavrar, soalhar, fazer cimbres para a construção, travejamentos para coberturas, artefactos e peças de mobiliário simples.
in scheme: Tesauro SIPA
preferred label: Carpenter @en
preferred label: Charpentier @fr
preferred label: Falegname @it
broader: Trabalho de madeira
narrower: Carpinteiro de limpos
narrower: Carpinteiro de toscos

Carpinteiro de limpos
type: Concept
in scheme: Tesauro SIPA
preferred label: Finish work carpenter @en
preferred label: Charpentier propre @fr
preferred label: Falegname pulito @it
broader: Carpinteiro

Carpinteiro de toscos
type: Concept
in scheme: Tesauro SIPA
preferred label: Charpentier brut @fr
preferred label: Falegname grezzo @it
preferred label: Shuttering/ Formwork carpenter @en
broader: Carpinteiro

Corticeiro
type: Concept
in scheme: Tesauro SIPA
preferred label: Cork worker @en
preferred label: Ouvrier de liège @fr
preferred label: Lavoratore del sughero @it
broader: Trabalho de madeira

Entalhador
type: Concept
in scheme: Tesauro SIPA
preferred label: Intagliatore @it
preferred label: Carver; Engraver @en
preferred label: Sculpteur en bois; Ornemaniste @fr
broader: Trabalho de madeira

Ensamblador
type: Concept
in scheme: Tesauro SIPA
preferred label: Assembleur @fr
preferred label: Carver @en
preferred label: Intagliatore; Ebanista @it
broader: Trabalho de madeira

Marceneiro
type: Concept
in scheme: Tesauro SIPA
preferred label: Joiner; Cabinetmaker @en
preferred label: Menuisier; Ébéniste @fr
preferred label: Falegname; Ebanista @it
broader: Trabalho de madeira

Torneiro
type: Concept
in scheme: Tesauro SIPA
preferred label: Tourneur @fr
preferred label: Tornitore @it
preferred label: Lathe operator; Turner @en
broader: Trabalho de madeira

Trabalho do metal
type: Concept
in scheme: Tesauro SIPA
preferred label: Metal work @en
preferred label: Lavorazione dei metalli @it
preferred label: Métallurgie; Travail du métal @fr
broader: Pessoas singulares do setor da construção e conservação segundo o material
narrower: Bate-folha
narrower: Ferreiro
narrower: Latoeiro
narrower: Serralheiro (Trabalho do metal)

Bate-folha
type: Concept
scope note: Oficial que trabalha o ouro, a prata ou outros metais em folhas delgadas para aplicar numa superfície.
in scheme: Tesauro SIPA
preferred label: Tôlerie @fr
preferred label: Lattoniere @it
preferred label: Goldbeater; Tinsmith @en
broader: Trabalho do metal

Ferreiro
type: Concept
scope note: Oficial que faz ou conserta ferragens, elementos metálicos de construção e ferramentas.
in scheme: Tesauro SIPA
preferred label: Forgeron @fr
preferred label: Blacksmith; Ironmonger @en
preferred label: Fabbro; Battiberta @it
broader: Trabalho do metal

Latoeiro
type: Concept
in scheme: Tesauro SIPA
preferred label: Tinsmith @en
preferred label: Ferblantier @fr
preferred label: Lattoniere; Stagnaio @it
broader: Trabalho do metal

Serralheiro (Trabalho do metal)
type: Concept
scope note: Oficial ou mestre que trabalha os metais menos nobres, podendo elaborar serralharia artística ou elementos utilitários.
in scheme: Tesauro SIPA
preferred label: Fabbro (Lavorazione dei metalli) @it
preferred label: Locksmith (Metal work) @en
preferred label: Serrurier (Travail du métal) @fr
broader: Trabalho do metal

Trabalho do vidro
type: Concept
in scheme: Tesauro SIPA
preferred label: Glass work @en
preferred label: Lavorazione del vetro @it
preferred label: Verrerie; Travail sur verre @fr
broader: Pessoas singulares do setor da construção e conservação segundo o material
narrower: Vidraceiro
narrower: Vitralista

Vidraceiro
type: Concept
scope note: Oficial que assenta as vidraças numa construção.
in scheme: Tesauro SIPA
preferred label: Glazier @en
preferred label: Vitrier @fr
preferred label: Vetraio @it
broader: Trabalho do vidro

Vitralista
type: Concept
in scheme: Tesauro SIPA
preferred label: Stained glass artist @en
preferred label: Vetratista @it
preferred label: Vitrailliste; Maitre-verrier @fr
broader: Trabalho do vidro

Pessoas singulares do setor da construção naval
type: Concept
in scheme: Tesauro SIPA
preferred label: Ship building singular persons @en
preferred label: Personnes physiques dans le secteur de la construction navale @fr
preferred label: Persone fisiche alla costruzione navale @it
hidden label: Pessoas singulares do sector da construção naval
broader: Pessoas singulares do setor da construção, conservação e planeamento
narrower: Calafates
narrower: Carpinteiro de machado

Calafates
type: Concept
in scheme: Tesauro SIPA
preferred label: Caulker @en
preferred label: Calfats @fr
preferred label: Calafati @it
broader: Pessoas singulares do setor da construção naval

Carpinteiro de machado
type: Concept
in scheme: Tesauro SIPA
preferred label: Shipbuilding carpenter @en
preferred label: Charpentier de construction navale @fr
preferred label: Carpentiere navale @it
alternative label: Carpinteiro de construção naval
broader: Pessoas singulares do setor da construção naval

Pessoas singulares do setor da justiça
type: Concept
in scheme: Tesauro SIPA
preferred label: Judicial sector singular persons @en
preferred label: Personnes physiques dans le secteur de la justice @fr
preferred label: Persone fisiche al settore della giustizia @it
hidden label: Pessoas singulares do sector da justiça
broader: Pessoas singulares segundo o setor de atividade
narrower: Advogado
narrower: Carcereiro
narrower: Carrasco
narrower: Guarda prisional
narrower: Juiz

Advogado
type: Concept
in scheme: Tesauro SIPA
preferred label: Avocat @fr
preferred label: Avvocato @it
preferred label: Lawyer; Barrister @en
broader: Pessoas singulares do setor da justiça

Carcereiro
type: Concept
scope note: Pessoa singular responsável pela guarda de prisioneiros e pela sua alimentação numa cadeia.
in scheme: Tesauro SIPA
preferred label: Geôlier @fr
preferred label: Carceriere @it
preferred label: Jailer; Gaoler @en
broader: Pessoas singulares do setor da justiça

Carrasco
type: Concept
in scheme: Tesauro SIPA
preferred label: Executioner @en
preferred label: Bourreau @fr
preferred label: Boia (Carnefice) @it
broader: Pessoas singulares do setor da justiça

Guarda prisional
type: Concept
in scheme: Tesauro SIPA
preferred label: Gardien de prison @fr
preferred label: Guardia carceraria @it
preferred label: Warder; Prison guard @en
broader: Pessoas singulares do setor da justiça

Juiz
type: Concept
in scheme: Tesauro SIPA
preferred label: Judge @en
preferred label: Juge @fr
preferred label: Giudice @it
broader: Pessoas singulares do setor da justiça
narrower: Juiz de fora
narrower: Juiz dos órfãos

Juiz de fora
type: Concept
in scheme: Tesauro SIPA
preferred label: External judge @en
preferred label: Juge itinérant @fr
preferred label: Giudice itinerante @it
broader: Juiz

Juiz dos órfãos
type: Concept
in scheme: Tesauro SIPA
preferred label: Judge of the Orphans @en
broader: Juiz

Pessoas singulares do setor da segurança e proteção
type: Concept
in scheme: Tesauro SIPA
preferred label: Singular persons in the safety and security sector @en
preferred label: Personnes physiques dans le secteur de la sécurité et de la protection @fr
preferred label: Persone fisiche che operano nel settore della sicurezza e della protezione @it
hidden label: Pessoas singulares do sector da segurança e protecção
broader: Pessoas singulares segundo o setor de atividade
narrower: Bombeiro
narrower: Guarda (Pessoas singulares do setor da segurança e proteção)
narrower: Nadador-salvador
narrower: Polícia

Bombeiro
type: Concept
in scheme: Tesauro SIPA
preferred label: Firefighter @en
preferred label: Pompier @fr
preferred label: Pompiere @it
broader: Pessoas singulares do setor da segurança e proteção

Guarda (Pessoas singulares do setor da segurança e proteção)
type: Concept
in scheme: Tesauro SIPA
preferred label: Guard (Singular persons in the safety and security sector ) @en
preferred label: Gardien (Personnes physiques dans le secteur de la sécurité et de la protection) @fr
preferred label: Guardia (Persone fisiche che operano nel settore della sicurezza e della protezione) @it
broader: Pessoas singulares do setor da segurança e proteção
narrower: Guarda florestal

Guarda florestal
type: Concept
in scheme: Tesauro SIPA
preferred label: Forest ranger @en
preferred label: Garde forestier @fr
preferred label: Guardia forestale @it
broader: Guarda (Pessoas singulares do setor da segurança e proteção)

Nadador-salvador
type: Concept
in scheme: Tesauro SIPA
preferred label: Lifeguard @en
preferred label: Sauveteur aquatique @fr
preferred label: Bagnino @it
broader: Pessoas singulares do setor da segurança e proteção

Polícia
type: Concept
in scheme: Tesauro SIPA
preferred label: Police officer @en
preferred label: Officier de police @fr
preferred label: Poliziotto @it
broader: Pessoas singulares do setor da segurança e proteção

Pessoas singulares do setor das ciências
type: Concept
in scheme: Tesauro SIPA
preferred label: Singular persons in the science sector @en
preferred label: Personnes physiques du secteur scientifique @fr
preferred label: Persone fisiche del settore scientifico @it
hidden label: Pessoas singulares do sector das ciências
broader: Pessoas singulares segundo o setor de atividade
narrower: Astrónomo
narrower: Biólogo
narrower: Cientista
narrower: Físico
narrower: Geólogo
narrower: Meteorologista
narrower: Químico

Astrónomo
type: Concept
in scheme: Tesauro SIPA
preferred label: Astronomer @en
preferred label: Astronome @fr
preferred label: Astronomo @it
broader: Pessoas singulares do setor das ciências

Biólogo
type: Concept
in scheme: Tesauro SIPA
preferred label: Biologist @en
preferred label: Biologiste @fr
preferred label: Biologo @it
broader: Pessoas singulares do setor das ciências
narrower: Biólogo marinho

Biólogo marinho
type: Concept
in scheme: Tesauro SIPA
preferred label: Marine biologist @en
preferred label: Biologiste marin @fr
preferred label: Biologo marino @it
broader: Biólogo

Cientista
type: Concept
in scheme: Tesauro SIPA
preferred label: Scientist @en
preferred label: Scientifique @fr
preferred label: Scienziato @it
broader: Pessoas singulares do setor das ciências
narrower: Cientista forense

Cientista forense
type: Concept
in scheme: Tesauro SIPA
preferred label: Forensic scientist @en
preferred label: Scientifique médico-légal @fr
preferred label: Scienziato forense @it
broader: Cientista

Físico
type: Concept
in scheme: Tesauro SIPA
preferred label: Physicist @en
preferred label: Physicien @fr
preferred label: Fisico @it
broader: Pessoas singulares do setor das ciências

Geólogo
type: Concept
in scheme: Tesauro SIPA
preferred label: Geologist @en
preferred label: Géologue @fr
preferred label: Geologo @it
broader: Pessoas singulares do setor das ciências

Meteorologista
type: Concept
in scheme: Tesauro SIPA
preferred label: Meteorologist @en
preferred label: Météorologue @fr
preferred label: Meteorologo @it
broader: Pessoas singulares do setor das ciências

Químico
type: Concept
in scheme: Tesauro SIPA
preferred label: Chemist @en
preferred label: Chimiste @fr
preferred label: Chimico @it
broader: Pessoas singulares do setor das ciências

Pessoas singulares do setor das ciências sociais
type: Concept
in scheme: Tesauro SIPA
preferred label: Singular persons in the social sciences sector @en
preferred label: Personnes physiques du secteur des sciences sociales @fr
preferred label: Persone fisiche del settore delle scienze sociali @it
hidden label: Pessoas singulares do sector das ciências sociais
broader: Pessoas singulares segundo o setor de atividade
narrower: Arqueólogo
narrower: Arquivista
narrower: Bibliotecário
narrower: Curador (Pessoas singulares do setor das ciências sociais)
narrower: Filósofo
narrower: Geógrafo
narrower: Historiador
narrower: Historiador da arte
narrower: Museólogo
narrower: Psicólogo

Arqueólogo
type: Concept
in scheme: Tesauro SIPA
preferred label: Archaeologist @en
preferred label: Archéologue @fr
preferred label: Archeologo @it
broader: Pessoas singulares do setor das ciências sociais

Arquivista
type: Concept
in scheme: Tesauro SIPA
preferred label: Archivist @en
preferred label: Archiviste @fr
preferred label: Archivista @it
broader: Pessoas singulares do setor das ciências sociais

Bibliotecário
type: Concept
in scheme: Tesauro SIPA
preferred label: Librarian @en
preferred label: Bibliothécaire @fr
preferred label: Bibliotecario @it
broader: Pessoas singulares do setor das ciências sociais

Curador (Pessoas singulares do setor das ciências sociais)
type: Concept
in scheme: Tesauro SIPA
preferred label: Curator (Singular persons in the social sciences sector) @en
preferred label: Conservateur (Personnes physiques du secteur des sciences sociales) @fr
preferred label: Curatore (Persone fisiche del settore delle scienze sociali) @it
hidden label: Pessoa singular responsável pela gestão, conservação, tratamento e comunicação de uma coleção de bens.
broader: Pessoas singulares do setor das ciências sociais

Filósofo
type: Concept
in scheme: Tesauro SIPA
preferred label: Philosopher @en
preferred label: Philosophe @fr
preferred label: Filosofo @it
broader: Pessoas singulares do setor das ciências sociais

Geógrafo
type: Concept
in scheme: Tesauro SIPA
preferred label: Geographer @en
preferred label: Géographe @fr
preferred label: Geografo @it
broader: Pessoas singulares do setor das ciências sociais

Historiador
type: Concept
in scheme: Tesauro SIPA
preferred label: Historian @en
preferred label: Historien @fr
preferred label: Storico @it
broader: Pessoas singulares do setor das ciências sociais

Historiador da arte
type: Concept
in scheme: Tesauro SIPA
preferred label: Art historian @en
preferred label: Historien de l'art @fr
preferred label: Storico dell'arte @it
broader: Pessoas singulares do setor das ciências sociais

Museólogo
type: Concept
in scheme: Tesauro SIPA
preferred label: Museologist @en
preferred label: Muséologue @fr
preferred label: Museologo @it
broader: Pessoas singulares do setor das ciências sociais

Psicólogo
type: Concept
in scheme: Tesauro SIPA
preferred label: Psychologist @en
preferred label: Psychologue @fr
preferred label: Psicologo @it
broader: Pessoas singulares do setor das ciências sociais

Pessoas singulares do setor das comunicações
type: Concept
in scheme: Tesauro SIPA
preferred label: Singular persons in the communications sector @en
preferred label: Personnes physiques dans le secteur des communications @fr
preferred label: Persone fisiche del settore delle comunicazioni @it
hidden label: Pessoas singulares do sector das comunicações
broader: Pessoas singulares segundo o setor de atividade
narrower: Carteiro
narrower: Faroleiro
narrower: Telefonista

Carteiro
type: Concept
in scheme: Tesauro SIPA
preferred label: Postman @en
preferred label: Facteur @fr
preferred label: Postino @it
broader: Pessoas singulares do setor das comunicações

Faroleiro
type: Concept
in scheme: Tesauro SIPA
preferred label: Lighthouse activity @en
broader: Pessoas singulares do setor das comunicações

Telefonista
type: Concept
in scheme: Tesauro SIPA
preferred label: Operator @en
preferred label: Téléphoniste @fr
broader: Pessoas singulares do setor das comunicações

Pessoas singulares do setor de apoio infraestrutural
type: Concept
in scheme: Tesauro SIPA
preferred label: Infrastructural support singular persons @en
preferred label: Personnes physiques travaillant dans le secteur de l'appui aux infrastructures @fr
preferred label: Persone fisiche nel settore del supporto alle infrastrutture @it
hidden label: Pessoas singulares do sector de apoio infraestrutural
broader: Pessoas singulares segundo o setor de atividade
narrower: Zelador

Zelador
type: Concept
in scheme: Tesauro SIPA
preferred label: Watchman @en
preferred label: Zélateur @fr
preferred label: Zelatore @it
broader: Pessoas singulares do setor de apoio infraestrutural
narrower: Zelador da praça

Zelador da praça
type: Concept
in scheme: Tesauro SIPA
preferred label: Janitor @en
preferred label: Zélateur de la place @fr
preferred label: Zelatore di piazza @it
broader: Zelador

Pessoas singulares do setor de carga e transporte
type: Concept
in scheme: Tesauro SIPA
preferred label: Cargo and transportation activity singular persons @en
preferred label: Personnes physiques dans le secteur du chargement et du transport @fr
preferred label: Persone fisiche al carico e al trasporto @it
hidden label: Pessoas singulares do sector de carga e transporte
broader: Pessoas singulares segundo o setor de atividade
narrower: Homem da roda de fora
narrower: Piloto

Homem da roda de fora
type: Concept
in scheme: Tesauro SIPA
preferred label: Men of the wheel @en
broader: Pessoas singulares do setor de carga e transporte

Piloto
type: Concept
in scheme: Tesauro SIPA
preferred label: Pilot @en
preferred label: Pilote @fr
preferred label: Pilota @it
broader: Pessoas singulares do setor de carga e transporte

Pessoas singulares do setor de transformação e produção de materiais
type: Concept
in scheme: Tesauro SIPA
preferred label: Materials production and processing singular persons @en
preferred label: Personnes physiques dans le secteur du traitement des matériaux et de la production @fr
preferred label: Persone fisiche del settore della lavorazione e della produzione dei materiali @it
hidden label: Pessoas singulares do sector de transformação e produção de materiais
broader: Pessoas singulares segundo o setor de atividade
narrower: Amassador
narrower: Oleiro (Pessoas singulares do setor de transformação e produção de materiais )
narrower: Tanoeiro
narrower: Telheiro
narrower: Vidreiro

Amassador
type: Concept
in scheme: Tesauro SIPA
preferred label: Kneader @en
preferred label: Pétrisseur @fr
preferred label: Impastatore @it
broader: Pessoas singulares do setor de transformação e produção de materiais

Oleiro (Pessoas singulares do setor de transformação e produção de materiais )
type: Concept
in scheme: Tesauro SIPA
preferred label: Potter (Materials production and processing singular persons) @en
preferred label: Potier (Personnes physiques dans le secteur du traitement des matériaux et de la production ) @fr
preferred label: Vasaio (Persone fisiche del settore della lavorazione e della produzione dei materiali ) @it
broader: Pessoas singulares do setor de transformação e produção de materiais

Tanoeiro
type: Concept
in scheme: Tesauro SIPA
preferred label: Tonnelier @fr
preferred label: Bottaio @it
preferred label: Cooper; Barrel maker @en
broader: Pessoas singulares do setor de transformação e produção de materiais

Telheiro
type: Concept
scope note: Oficial que fabrica as telhas.
in scheme: Tesauro SIPA
preferred label: Tuilier @fr
preferred label: Piastrellista @it
preferred label: Tile maker @en
broader: Pessoas singulares do setor de transformação e produção de materiais

Vidreiro
type: Concept
scope note: Oficial que fabrica vidro, seja artístico ou para aplicação na construção.
in scheme: Tesauro SIPA
preferred label: Vetraio @it
preferred label: Verrier @fr
preferred label: Glass maker @en
broader: Pessoas singulares do setor de transformação e produção de materiais

Pessoas singulares do setor do desporto
type: Concept
in scheme: Tesauro SIPA
preferred label: Singular persons in the sports sector @en
preferred label: Personnes physiques du secteur sportif @fr
preferred label: Persone fisiche del settore sportivo @it
hidden label: Pessoas singulares do sector do desporto
broader: Pessoas singulares segundo o setor de atividade
narrower: Atleta
narrower: Treinador

Atleta
type: Concept
in scheme: Tesauro SIPA
preferred label: Athlete @en
preferred label: Athlète @fr
broader: Pessoas singulares do setor do desporto
narrower: Ginasta
narrower: Jogador
narrower: Nadador

Ginasta
type: Concept
in scheme: Tesauro SIPA
preferred label: Gymnast @en
preferred label: Gymnaste @fr
preferred label: Ginnasta @it
broader: Atleta

Jogador
type: Concept
in scheme: Tesauro SIPA
preferred label: Player @en
preferred label: Juoeur @fr
preferred label: Giocatore @it
broader: Atleta
narrower: Jogador de futebol
narrower: Jogador de ténis

Jogador de futebol
type: Concept
in scheme: Tesauro SIPA
preferred label: Football player @en
preferred label: Footballeur @fr
preferred label: Calciatore @it
broader: Jogador

Jogador de ténis
type: Concept
in scheme: Tesauro SIPA
preferred label: Tennis player @en
preferred label: Joueur de tennis @fr
preferred label: Tennista @it
broader: Jogador

Nadador
type: Concept
in scheme: Tesauro SIPA
preferred label: Swimmer @en
preferred label: Nageur @fr
preferred label: Natante @it
broader: Atleta

Treinador
type: Concept
in scheme: Tesauro SIPA
preferred label: Coach @en
preferred label: Entraineur @fr
preferred label: Alenatore @it
broader: Pessoas singulares do setor do desporto

Pessoas singulares do setor do ensino e formação
type: Concept
in scheme: Tesauro SIPA
preferred label: Educational singular persons @en
preferred label: Personnes physiques dans le secteur de l'éducation @fr
preferred label: Persone fisiche nel settore dell'istruzione @it
hidden label: Pessoas singulares do sector do ensino e formação
broader: Pessoas singulares segundo o setor de atividade
narrower: Formador
narrower: Mestre-escola
narrower: Professor

Formador
type: Concept
in scheme: Tesauro SIPA
preferred label: Trainer @en
preferred label: Formateur @fr
preferred label: Formatore @it
broader: Pessoas singulares do setor do ensino e formação

Mestre-escola
type: Concept
in scheme: Tesauro SIPA
preferred label: School-master @en
preferred label: Maestro di scuola @it
preferred label: Instituteur; Maître d'école @fr
hidden label: Cónego responsável pelo funcionamento da escola catedralícia, de existência obrigatória a partir do III Concílio de Latrão (1179), e da escola colegial, obrigatórias a partir do IV Concílio de Latrão (1215). Ensinava as letras e o canto, na ausência de chantre, corrigia os livros litúrgicos e redigia as sagradas escrituras.
broader: Pessoas singulares do setor do ensino e formação

Professor
type: Concept
in scheme: Tesauro SIPA
preferred label: Teacher; Professor @en
preferred label: Enseignant; Professeur; Maitre @fr
preferred label: Insegnante; Professore @it
broader: Pessoas singulares do setor do ensino e formação

Pessoas singulares do setor do registo gráfico
type: Concept
in scheme: Tesauro SIPA
preferred label: Graphic recording singular persons @en
preferred label: Personnes physiques dans le secteur de la conception graphique @fr
preferred label: Persone fisiche che operano nel settore della stampa @it
hidden label: Pessoas singulares do sector do registo gráfico
broader: Pessoas singulares segundo o setor de atividade
narrower: Cinzelador
narrower: Ordinator
narrower: Paginador
narrower: Lapicida

Cinzelador
type: Concept
in scheme: Tesauro SIPA
preferred label: Ciseleur @fr
preferred label: Cesellatore @it
preferred label: Chiseller; Carver @en
broader: Pessoas singulares do setor do registo gráfico

Ordinator
type: Concept
in scheme: Tesauro SIPA
preferred label: Ordinatore @it
preferred label: Ordinateur; Ordonnateur @fr
broader: Pessoas singulares do setor do registo gráfico

Paginador
type: Concept
in scheme: Tesauro SIPA
preferred label: Page designer @en
preferred label: Paginateur @fr
preferred label: Paginatore @it
broader: Pessoas singulares do setor do registo gráfico

Lapicida
type: Concept
in scheme: Tesauro SIPA
preferred label: Lapicide @en
broader: Pessoas singulares do setor do registo gráfico

Pessoas singulares do setor financeiro
type: Concept
in scheme: Tesauro SIPA
preferred label: Finantial activity singular persons @en
preferred label: Personnes physiques du secteur financier @fr
preferred label: Persone fisiche del settore finanziario @it
hidden label: Pessoas singulares do sector financeiro
broader: Pessoas singulares segundo o setor de atividade
narrower: Banqueiro
narrower: Contabilista
narrower: Pessoas singulares do setor financeiro segundo o âmbito cronológico

Banqueiro
type: Concept
in scheme: Tesauro SIPA
preferred label: Banker @en
preferred label: Banquier @fr
preferred label: Banchiere @it
broader: Pessoas singulares do setor financeiro

Contabilista
type: Concept
in scheme: Tesauro SIPA
preferred label: Accountant @en
preferred label: Comptable @fr
preferred label: Ragioniere @it
broader: Pessoas singulares do setor financeiro

Pessoas singulares do setor financeiro segundo o âmbito cronológico
type: Concept
in scheme: Tesauro SIPA
preferred label: Finantial activity singular persons according to chronological scope @en
preferred label: Personnalités du secteur financier par ordre chronologique @fr
preferred label: Persone fisiche che operano nel settore finanziario secondo l'ambito cronologico @it
hidden label: Pessoas singulares do sector financeiro segundo o âmbito cronológico
broader: Pessoas singulares do setor financeiro
narrower: Inspetor-geral das Fronteiras e Costas Marítimas do Reino

Inspetor-geral das Fronteiras e Costas Marítimas do Reino
type: Concept
in scheme: Tesauro SIPA
preferred label: Inspector General of kingdom’s borders and coastlines @en
preferred label: Inspecteur général des frontières et des côtes maritimes du Royaume @fr
preferred label: Ispettore generale delle frontiere e delle coste marine del Regno @it
hidden label: Inspector-geral das Fronteiras e Costas Marítimas do Reino
broader: Pessoas singulares do setor financeiro segundo o âmbito cronológico

Pessoas singulares militares
type: Concept
in scheme: Tesauro SIPA
preferred label: Military singular persons @en
preferred label: Personnes physiques militaires @fr
preferred label: Persone fisiche militari @it
broader: Pessoas singulares segundo o setor de atividade
narrower: Adais
narrower: Alcaide
narrower: Apontador
narrower: Governador da praça
narrower: Pés de castelo
narrower: Porteiro do alcaide

Adais
type: Concept
in scheme: Tesauro SIPA
preferred label: Mestre de camp @fr
preferred label: Condottiere @it
preferred label: Adail, Group chief; Guide; Leader @en
broader: Pessoas singulares militares

Alcaide
type: Concept
in scheme: Tesauro SIPA
preferred label: Alcalde @en
preferred label: Alcalde; Maire @fr
preferred label: Alcalde; Sindaco @it
alternative label: Casteleiro
broader: Pessoas singulares militares
narrower: Alcaide menor
narrower: Alcaide-mor

Alcaide menor
type: Concept
in scheme: Tesauro SIPA
preferred label: Alcalde minor @en
preferred label: Maire mineur @fr
preferred label: Sindaco minore @it
broader: Alcaide

Alcaide-mor
type: Concept
in scheme: Tesauro SIPA
preferred label: Alcalde General @en
preferred label: Grand Maire; Maire principal @fr
preferred label: Sindaco Maggiore @it
broader: Alcaide

Apontador
type: Concept
in scheme: Tesauro SIPA
preferred label: Loader @en
preferred label: Pointeur @fr
preferred label: Puntatore @it
broader: Pessoas singulares militares

Governador da praça
type: Concept
in scheme: Tesauro SIPA
preferred label: Governor of the fortress @en
preferred label: Gouverneur de la forteresse @fr
preferred label: Governatore della fortezza @it
broader: Pessoas singulares militares

Pés de castelo
type: Concept
in scheme: Tesauro SIPA
preferred label: Castle feet; Civil gunmen @en
preferred label: Pieds de château ; Tireurs civils @fr
preferred label: Piedi del castello; Pistoleri civili @it
broader: Pessoas singulares militares

Porteiro do alcaide
type: Concept
in scheme: Tesauro SIPA
preferred label: Alcalde gate-keeper @en
preferred label: Portier de l'Alcalde @fr
preferred label: Portinaio del sindaco @it
broader: Pessoas singulares militares

Pessoas singulares político-administrativas
type: Concept
in scheme: Tesauro SIPA
preferred label: Political and administrative singular persons @en
preferred label: Personnes physiques politiques et administratives @fr
preferred label: Persone fisiche politiche e amministrative @it
broader: Pessoas singulares segundo o setor de atividade
narrower: Comendador
narrower: Conde
narrower: Deputado
narrower: Diplomata
narrower: Duque
narrower: Faraó
narrower: Governador
narrower: Marquês
narrower: Ministro
narrower: Monarca
narrower: Presidente
narrower: Príncipe
narrower: Secretário do Estado

Comendador
type: Concept
in scheme: Tesauro SIPA
preferred label: Commander @en
preferred label: Commandeur @fr
preferred label: Commendatore @it
broader: Pessoas singulares político-administrativas

Conde
type: Concept
in scheme: Tesauro SIPA
preferred label: Count @en
preferred label: Comte @fr
preferred label: Conte @it
broader: Pessoas singulares político-administrativas

Deputado
type: Concept
in scheme: Tesauro SIPA
preferred label: Deputy @en
preferred label: Député @fr
preferred label: Deputato @it
broader: Pessoas singulares político-administrativas

Diplomata
type: Concept
in scheme: Tesauro SIPA
preferred label: Diplomat @en
preferred label: Diplomate @fr
preferred label: Diplomatico @it
broader: Pessoas singulares político-administrativas
narrower: Cônsul
narrower: Embaixador
narrower: Núncio

Cônsul
type: Concept
in scheme: Tesauro SIPA
preferred label: Consul @en
preferred label: Console @it
broader: Diplomata

Embaixador
type: Concept
in scheme: Tesauro SIPA
preferred label: Ambassador @en
preferred label: Ambassadeur @fr
preferred label: Ambasciatore @it
broader: Diplomata

Núncio
type: Concept
in scheme: Tesauro SIPA
preferred label: Nonce @fr
preferred label: Nunzio @it
preferred label: Nuncio @en
broader: Diplomata

Duque
type: Concept
in scheme: Tesauro SIPA
preferred label: Duke @en
preferred label: Duc @fr
preferred label: Duca @it
broader: Pessoas singulares político-administrativas

Faraó
type: Concept
in scheme: Tesauro SIPA
preferred label: Pharaoh @en
preferred label: Pharaon @fr
preferred label: Faraone @it
broader: Pessoas singulares político-administrativas

Governador
type: Concept
in scheme: Tesauro SIPA
preferred label: Governor @en
preferred label: Gouverneur @fr
preferred label: Governatore @it
broader: Pessoas singulares político-administrativas

Marquês
type: Concept
in scheme: Tesauro SIPA
preferred label: Marquis @en
preferred label: Marchese @it
broader: Pessoas singulares político-administrativas

Ministro
type: Concept
in scheme: Tesauro SIPA
preferred label: Minister @en
preferred label: Ministre @fr
broader: Pessoas singulares político-administrativas

Monarca
type: Concept
in scheme: Tesauro SIPA
preferred label: Monarch @en
preferred label: Monarque @fr
broader: Pessoas singulares político-administrativas

Presidente
type: Concept
in scheme: Tesauro SIPA
preferred label: President @en
preferred label: Président @fr
broader: Pessoas singulares político-administrativas

Príncipe
type: Concept
in scheme: Tesauro SIPA
preferred label: Prince @en
preferred label: Principe @it
broader: Pessoas singulares político-administrativas

Secretário do Estado
type: Concept
in scheme: Tesauro SIPA
preferred label: Secretary of State @en
preferred label: Secrétaire d'État @fr
preferred label: Segretario di Stato @it
broader: Pessoas singulares político-administrativas

Pessoas singulares religiosas
type: Concept
in scheme: Tesauro SIPA
preferred label: Religious singular persons @en
preferred label: Personnes physiques religieuses singulières @fr
preferred label: Religiosi singolari @it
broader: Pessoas singulares segundo o setor de atividade
narrower: Ecónomo
narrower: Padre
narrower: Pessoas singulares do clero regular
narrower: Pessoas singulares do clero secular

Ecónomo
type: Concept
scope note: Religioso secular que substitui, numa colegiada ou cabido um cónego ausente, remunerado com parte da prebenda que o cónego receberia, tendo como função administrar os bens da mesma.
in scheme: Tesauro SIPA
preferred label: Économe @fr
preferred label: Economo @it
preferred label: Economos; Oikonomos @en
broader: Pessoas singulares religiosas
related: Cónego
modified: 2025-09-23T13:51:09

Padre
type: Concept
in scheme: Tesauro SIPA
preferred label: Priest @en
preferred label: Prêtre @fr
preferred label: Sacerdote @it
broader: Pessoas singulares religiosas

Pessoas singulares do clero regular
type: Concept
in scheme: Tesauro SIPA
preferred label: Regular clergy singular persons @en
preferred label: Personnes physiques du clergé régulier @fr
preferred label: Persone fisiche del clero regolare @it
broader: Pessoas singulares religiosas
narrower: Leigo
narrower: Religioso regular

Leigo
type: Concept
scope note: Religioso que professou, mas não estudou nem recebeu ordens sacras.
in scheme: Tesauro SIPA
preferred label: Laïc @fr
preferred label: Laico @it
preferred label: Laic; Layman @en
broader: Pessoas singulares do clero regular

Religioso regular
type: Concept
scope note: Religioso que vive num mosteiro, alternando orações com trabalho.
in scheme: Tesauro SIPA
preferred label: Religieuses régulières @fr
preferred label: Religiosi regolari @it
preferred label: Regular religious people @en
broader: Pessoas singulares do clero regular
narrower: Egresso
narrower: Frade
narrower: Freira
narrower: Hábito retento
narrower: Monge
narrower: Monja
narrower: Religioso regular segundo o setor de atividade

Egresso
type: Concept
scope note: Religioso forçado a abandonar o convento em virtude da lei de expulsão dos religiosos, datada de 28 de maio de 1834.
in scheme: Tesauro SIPA
preferred label: Défroqué @fr
preferred label: Egress @en
preferred label: Egresso; Ex frate @it
broader: Religioso regular

Frade
type: Concept
in scheme: Tesauro SIPA
preferred label: Frate @it
preferred label: Moine @fr
preferred label: Friar; Monk @en
alternative label: Freire
broader: Religioso regular

Freira
type: Concept
in scheme: Tesauro SIPA
preferred label: Nun; Sister @en
preferred label: Soeur; Nonne @fr
preferred label: Suora; Monaca @it
broader: Religioso regular

Hábito retento
type: Concept
scope note: Religioso regular, autorizado pelo papa a viver retirado da comunidade religiosa, mas obrigado a manter o hábito.
in scheme: Tesauro SIPA
preferred label: Habito Retento @en
preferred label: Habitude de rétention @fr
broader: Religioso regular

Monge
type: Concept
scope note: Religioso regular que vive numa comunidade religiosa (mosteiro), alternando orações e trabalho.
in scheme: Tesauro SIPA
preferred label: Monk @en
preferred label: Moine @fr
preferred label: Monaco @it
broader: Religioso regular

Monja
type: Concept
scope note: Religiosa regular, que vive em comunidade, professando uma ordem monacal.
in scheme: Tesauro SIPA
preferred label: Monaca @it
preferred label: Monk @en
preferred label: Religieuse; Moinesse @fr
broader: Religioso regular

Religioso regular segundo o setor de atividade
type: Concept
in scheme: Tesauro SIPA
preferred label: Regular religious person according activity sector @en
preferred label: Religieux réguliers selon le secteur d'activité @fr
preferred label: Religiosi regolari per settore di attività @it
hidden label: Religioso regular segundo o sector de atividade
broader: Religioso regular
narrower: Setor de administração de sacramento
narrower: Setor do ensino
narrower: Setor do governo e administração

Setor de administração de sacramento
type: Concept
in scheme: Tesauro SIPA
preferred label: Administration of the Sacraments @en
preferred label: Secteur d'administration des sacrements @fr
preferred label: Settore d'amministrazione sacramenti @it
hidden label: Sector de administração de sacramento
broader: Religioso regular segundo o setor de atividade
narrower: Confessor

Confessor
type: Concept
scope note: Religioso secular ou regular, responsável pela administração do sacramento da confissão.
in scheme: Tesauro SIPA
preferred label: Confesseur @fr
preferred label: Confessore @it
broader: Setor de administração de sacramento
narrower: Confessor de religiosos regulares
narrower: Confessor de seculares

Confessor de religiosos regulares
type: Concept
scope note: Religioso que administrava este sacramento à comunidade a que pertenciam, sendo-lhes exigido quinze anos de hábito.
in scheme: Tesauro SIPA
preferred label: Confessor of regular religious persons @en
preferred label: Confesseur de religieux réguliers @fr
preferred label: Confessore de religiosos regulares @it
broader: Confessor

Confessor de seculares
type: Concept
scope note: Religioso que administrava este sacramento à comunidade local, tendo que ter 20 anos de hábito e frequentado três anos de curso de moral.
in scheme: Tesauro SIPA
preferred label: Confessor of secular religious persons @en
preferred label: Confesseur de laïcs @fr
preferred label: Confessore di laici @it
broader: Confessor

Setor do ensino
type: Concept
in scheme: Tesauro SIPA
preferred label: Educational sector @en
preferred label: Secteur de l’enseignement @fr
preferred label: Settore dell'istruzione @it
hidden label: Sector do ensino
broader: Religioso regular segundo o setor de atividade
narrower: Artista (Religioso regular - setor do ensino)
narrower: Colegial (Religioso regular - setor do ensino)
narrower: Corista
narrower: Donato
narrower: Lente
narrower: Mestre (Religioso regular - setor do ensino)
narrower: Missionário
narrower: Noviça
narrower: Noviço
narrower: Passante
narrower: Pregador

Artista (Religioso regular - setor do ensino)
type: Concept
scope note: Religioso que frequenta o curso de Filosofia ou Artes, tirando o Trivium e o Quadrivium.
in scheme: Tesauro SIPA
preferred label: Artist (Regular religious people - Educational sector) @en
preferred label: Artiste (Religieuses régulières - Secteur de l’enseignement) @fr
preferred label: Artista (Religiosi regolari - Settore dell'istruzione) @it
broader: Setor do ensino

Colegial (Religioso regular - setor do ensino)
type: Concept
scope note: Religioso matriculado em qualquer colégio regular para estudar Teologia Moral.
in scheme: Tesauro SIPA
preferred label: Collegiate (Regular religious people - Educational sector) @en
preferred label: Collégien (Religieuses régulières - Secteur de l’enseignement) @fr
preferred label: Collegiale (Religiosi regolari - Settore dell'istruzione) @it
broader: Setor do ensino

Corista
type: Concept
scope note: Religioso que continua a estudar até ter permissão para celebrar atos litúrgicos. Designa, ainda, os leigos professos durante os sete anos seguintes à profissão, em que permaneciam sujeitos a mestre, tendo, contudo, o direito de frequentar o coro.
in scheme: Tesauro SIPA
preferred label: Choriste @fr
preferred label: Chorister; Chorist @en
broader: Setor do ensino

Donato
type: Concept
scope note: Candidato a religioso leigo, devendo permanecer nesta hierarquia durante sete a oito anos, antes de entrar no noviciado.
in scheme: Tesauro SIPA
preferred label: Lay brother @en
preferred label: Frère lai @fr
preferred label: Converso @it
broader: Setor do ensino

Lente
type: Concept
scope note: Religioso que ensina nos cursos de Teologia ou Filosofia.
in scheme: Tesauro SIPA
preferred label: Professeur @fr
preferred label: Professore @it
preferred label: Reader @en
alternative label: Leitor
broader: Setor do ensino

Mestre (Religioso regular - setor do ensino)
type: Concept
scope note: Religioso regular incumbido de ensinar nos colégios das ordens religiosas, os quais tinham que ter nove anos de experiência como lente.
in scheme: Tesauro SIPA
preferred label: Master (Regular religious people - Educational sector) @en
preferred label: Maître (Religieuses régulières - Secteur de l’enseignement) @fr
preferred label: Maestro (Religiosi regolari - Settore dell'istruzione) @it
broader: Setor do ensino
narrower: Mestre de corista
narrower: Mestre de noviço

Mestre de corista
type: Concept
scope note: Religioso regular, que tem por função ensinar os leigos professos, tendo que ter mais de 45 anos e 30 de hábito, exigindo-se experiência no exercício de funções como definidor, custódio ou guardião.
in scheme: Tesauro SIPA
preferred label: Master of choirs @en
preferred label: Maître de choriste @fr
preferred label: Maestro de corista @it
broader: Mestre (Religioso regular - setor do ensino)

Mestre de noviço
type: Concept
scope note: Religioso regular que tinha por função preparar os candidatos a religiosos leigos, num Noviciado, tendo de possuir, pelo menos, vinte anos de hábito.
in scheme: Tesauro SIPA
preferred label: Master of novice @en
preferred label: Maître de novice @fr
preferred label: Maestro di novizi @it
broader: Mestre (Religioso regular - setor do ensino)

Missionário
type: Concept
in scheme: Tesauro SIPA
preferred label: Missionnaire @fr
preferred label: Missionario @it
preferred label: Missionary; Missioner @en
broader: Setor do ensino

Noviça
type: Concept
scope note: Aspirante a religiosa regular que passa um certo tempo num mosteiro para professar.
in scheme: Tesauro SIPA
preferred label: Novice @en
preferred label: Novizio @it
broader: Setor do ensino

Noviço
type: Concept
scope note: Aspirante a religioso regular que passa um certo tempo num convento ou mosteiro até estar apto para professar.
in scheme: Tesauro SIPA
preferred label: Novice @en
preferred label: Novizia @it
broader: Setor do ensino

Passante
type: Concept
scope note: Religioso regular, com a função de mestre ou leitor substituto, os quais tinham que possuir seis anos de estudo e se encontravam habilitados a prestar provas diante do Definitórios, para serem nomeados como leitores.
in scheme: Tesauro SIPA
preferred label: Lay brother; Layman @en
preferred label: Frère convers @fr
preferred label: Frate converso @it
broader: Setor do ensino

Pregador
type: Concept
scope note: Religioso regular que pregava quer entre a comunidade quer em igrejas seculares, sendo examinados para esta competência pelos mestres e o guardião da casa.
in scheme: Tesauro SIPA
preferred label: Preacher @en
preferred label: Prêcheur @fr
preferred label: Predicatore @it
broader: Setor do ensino

Setor do governo e administração
type: Concept
in scheme: Tesauro SIPA
preferred label: Government and administration sector @en
preferred label: Secteur gouvernemental et administratif @fr
preferred label: Settore governativo e amministrativo @it
hidden label: Sector do governo e administração
broader: Religioso regular segundo o setor de atividade
narrower: Abade (Pessoas singulares do clero regular)
narrower: Abadessa
narrower: Comissário missionário
narrower: Comissário visitador
narrower: Custódio
narrower: Definidor
narrower: Discreto
narrower: Geral (Religioso regular - Setor do governo e administração)
narrower: Grã-prior
narrower: Guardião
narrower: Hebdomadário
narrower: Inquisidor
narrower: Presidente de convento
narrower: Presidente de oratório
narrower: Prior (Pessoas singulares do clero regular)
narrower: Prioresa
narrower: Procurador
narrower: Provincial
narrower: Secretário da Província
narrower: Vigário-geral (Pessoas singulares do clero regular)
narrower: Vigário local
narrower: Vigário provincial

Abade (Pessoas singulares do clero regular)
type: Concept
scope note: Título correspondente a um religioso que tem o cargo de governar uma abadia autónoma ou uma congregação ou ordem monástico-conventual. É eleito por toda a comunidade e benzido pelo bispo da região. Deriva do aramaico abba (pai), designando um diretor espiritual e, depois, o superior de uma comunidade monástica. Adotado pela regra de São Bento, sendo o que gerava e educava para a vida perfeita, a autoridade jurídica e administrativa, o representante de Cristo, aplicar-se-ia às ordens beneditinas e cistercienses. No séc. XII, as propriedades foram divididas em duas partes, a mesa abacial e a mesa conventual (para os monges), e o abade passou a ser uma dignidade, que se limitava a receber rendas, designando um prior para o governo espiritual da comunidade. No séc. XV – XVI, os abades portugueses eram todos comendatários, o que a reforma de 1567 dos beneditinos e cistercienses veio suprimir. Os abades deixaram de ser vitalícios, tornando-se trienais. Ambas as ordens tinham um abade geral, um em Alcobaça outro em Tibães.
in scheme: Tesauro SIPA
preferred label: Abbot (Regular clergy singular persons) @en
preferred label: Abbé (Personnes physiques du clergé régulier) @fr
preferred label: Abate (Persone fisiche del clero regolare) @it
broader: Setor do governo e administração

Abadessa
type: Concept
scope note: Prelada ou superiora de um mosteiro ou abadia.
in scheme: Tesauro SIPA
preferred label: Abbess @en
preferred label: Abbesse @fr
preferred label: Badessa @it
alternative label: Madre
broader: Setor do governo e administração

Comissário missionário
type: Concept
scope note: Religioso regular com plenos poderes sobre as comunidades missionárias, tendo que ser um homem letrado, prudente e com mostras de virtuoso, ex-mestre, missionário, pregador ou confessor de seculares, tendo mais de 20 anos de hábito. Tinha como função visitar as missões.
in scheme: Tesauro SIPA
preferred label: Commissioner missionary @en
preferred label: Commissaire missionnaire @fr
preferred label: Commissario missionario @it
broader: Setor do governo e administração

Comissário visitador
type: Concept
scope note: Religioso eleito pelo Geral de uma ordem religiosa para visitar os edifícios religiosos. No caso da Ordem Franciscana, normalmente os visitadores eram de uma Província distinta. Tinha que ter exercido a função de Provincial, Vigário provincial, custódio ou definidor.
in scheme: Tesauro SIPA
preferred label: Commissioner inspector @en
broader: Setor do governo e administração
narrower: Comissário delegado

Comissário delegado
type: Concept
scope note: Religioso auxiliar do comissário visitador.
in scheme: Tesauro SIPA
preferred label: Commissioner delegate @en
preferred label: Commissaire adjoint @fr
preferred label: Vice Commissario @it
broader: Comissário visitador

Custódio
type: Concept
scope note: Religioso que assumia o cargo de Vice-provincial, assumindo o cargo mais importante em caso de morte do Provincial. Era eleito em Capítulo Provincial, por três anos e presidia o Capítulo intermédio.
in scheme: Tesauro SIPA
preferred label: Custode @it
preferred label: Custodian; Guardian; Caretaker @en
preferred label: Custode; Gardien @fr
alternative label: Vice-provincial
broader: Setor do governo e administração

Definidor
type: Concept
scope note: Religioso membro do definitório, o qual tinha por função aconselhar o Provincial de uma ordem religiosa, sendo eleitos por três anos, no Capítulo Provincial. Para ser definidor, o religioso tinha de ter efetuado três guardianias ou presidências.
in scheme: Tesauro SIPA
preferred label: Definer @en
preferred label: Définiteur @fr
preferred label: Definitore @it
broader: Setor do governo e administração

Discreto
type: Concept
scope note: Religioso regular com a função de aconselhar ou assistir, no caso das Ordens mendicantes, um guardião. Era nomeado pelo provincial de entre os Pregadores, confessores, padres da Província, definidores ou custódios. Este cargo era duplo, sendo cada guardião assistido por dois discretos.
in scheme: Tesauro SIPA
preferred label: Discreet @en
preferred label: Discret @fr
broader: Setor do governo e administração

Geral (Religioso regular - Setor do governo e administração)
type: Concept
scope note: Chefe supremo de uma ordem religiosa, eleito em Capítulo Geral.
in scheme: Tesauro SIPA
preferred label: General (Regular religious people - Government and administration sector) @en
preferred label: Général (Religieuses régulières - Secteur gouvernemental et administratif) @fr
preferred label: Generale (Religiosi regolari - Settore governativo e amministrativo) @it
broader: Setor do governo e administração

Grã-prior
type: Concept
scope note: Chefe supremo de uma ordem militar, eleito em Capítulo Geral.
in scheme: Tesauro SIPA
preferred label: Grand-Prior @en
preferred label: Grand Prieur @fr
preferred label: Gran Priore @it
broader: Setor do governo e administração

Guardião
type: Concept
scope note: Superior de um convento franciscano, cujo cargo durava um ano e meio, iniciando-se no Capítulo Provincial e terminando no Capítulo intermédio, onde eram escolhidos novos dirigentes.
in scheme: Tesauro SIPA
preferred label: Gardien @fr
preferred label: Guardian @en
preferred label: Guardiano @it
broader: Setor do governo e administração

Hebdomadário
type: Concept
scope note: Religioso regular ou cónego responsável por celebrar os ofícios litúrgicos durante uma semana.
in scheme: Tesauro SIPA
preferred label: Hebdomadary @en
preferred label: Hebdomadaire @fr
preferred label: Ebdomadario @it
alternative label: Domário
broader: Setor do governo e administração

Inquisidor
type: Concept
in scheme: Tesauro SIPA
preferred label: Inquisitor @en
preferred label: Inquisiteur @fr
preferred label: Inquisitore @it
broader: Setor do governo e administração
narrower: Inquisidor-mor

Inquisidor-mor
type: Concept
in scheme: Tesauro SIPA
preferred label: Grand Inquisitor @en
preferred label: Inquisiteur général @fr
preferred label: Grande Inquisitore @it
broader: Inquisidor

Presidente de convento
type: Concept
scope note: Religioso que ajuda o superior a administrar um convento, zelando pela doutrina e pela vida dos discípulos e coristas. Era eleito simultaneamente com o guardião, sendo escolhido pelo Definitório.
in scheme: Tesauro SIPA
preferred label: Présidente d'un couvent @fr
preferred label: Presidente di un convento @it
preferred label: Covent President @en
broader: Setor do governo e administração
narrower: Presidente in capite

Presidente in capite
type: Concept
scope note: Religioso escolhido pelo guardião para o substituir na altura em que se deslocava às reuniões capitulares.
in scheme: Tesauro SIPA
preferred label: Président in capite @fr
preferred label: President in Capite @en
broader: Presidente de convento

Presidente de oratório
type: Concept
scope note: Religioso superior de um oratório, sendo eleito pelo Definitório e tendo plenos poderes, semelhantes aos do guardião. Tinha que possui 20 anos de hábito.
in scheme: Tesauro SIPA
preferred label: Oratory president @en
preferred label: Président d'un oratoire @fr
preferred label: Presidente di un oratorio @it
broader: Setor do governo e administração

Prior (Pessoas singulares do clero regular)
type: Concept
in scheme: Tesauro SIPA
preferred label: Prior (Regular clergy singular persons) @en
preferred label: Prieur (Personnes physiques du clergé régulier) @fr
preferred label: Priore (Persone fisiche del clero regolare) @it
broader: Setor do governo e administração

Prioresa
type: Concept
in scheme: Tesauro SIPA
preferred label: Prioress @en
preferred label: Prieure @fr
preferred label: Priora @it
broader: Setor do governo e administração

Procurador
type: Concept
scope note: Religioso regular responsável por tratar de assuntos, nomeadamente pleitos, referentes a uma ordem religiosa e às respetivas missões.
in scheme: Tesauro SIPA
preferred label: Prosecutor @en
preferred label: Procureur @fr
preferred label: Procuratore @it
broader: Setor do governo e administração

Provincial
type: Concept
scope note: Religioso regular que governa um conjunto autónomo de casas conventuais mendicantes, as quais formam uma Província. Era eleito por frades reunidos em Capítulo, sob a presidência de um Comissário Visitador e, no caso dos Franciscanos, tinha que obedecer aos seguintes requisitos: ter mais de 45 anos de idade, 30 de hábito e ter exercido a função de Definidor ou Custódio, ou três vezes guardião nas principais casas que compunham a Província; poderia ser, ainda, Lente de Filosofia ou Teologia, para o que lhe bastava uma guardiania nas principais casas da Província.
in scheme: Tesauro SIPA
preferred label: Padre provinciale @it
broader: Setor do governo e administração

Secretário da Província
type: Concept
scope note: Religioso regular que acompanha regularmente o Provincial, com funções notariais e jurídicas.
in scheme: Tesauro SIPA
preferred label: Province Secretary @en
preferred label: Secrétaire de la province @fr
preferred label: Segretario della Provincia @it
broader: Setor do governo e administração

Vigário-geral (Pessoas singulares do clero regular)
type: Concept
scope note: Religioso regular que assiste o Geral no governo de uma ordem religiosa.
in scheme: Tesauro SIPA
preferred label: Vicar general (Regular clergy singular persons) @en
preferred label: Vicaire général (Personnes physiques du clergé régulier) @fr
preferred label: Vicario generale (Persone fisiche del clero regolare) @it
broader: Setor do governo e administração

Vigário local
type: Concept
scope note: Religioso regular que assiste o guardião no governo de uma casa religiosa ou convento.
in scheme: Tesauro SIPA
preferred label: Local vicar @en
preferred label: Vicaire local @fr
preferred label: Vicario locale @it
broader: Setor do governo e administração

Vigário provincial
type: Concept
scope note: Religioso regular que assiste o Provincial no governo de uma ordem Província.
in scheme: Tesauro SIPA
preferred label: Provinvial Vicar @en
preferred label: Vicaire provincial @fr
preferred label: Vicario provinciale @it
broader: Setor do governo e administração

Pessoas singulares do clero secular
type: Concept
in scheme: Tesauro SIPA
preferred label: Secular clergy singular persons @en
preferred label: Personnes physiques du clergé séculier @fr
preferred label: Persone fisiche del clero secolare @it
broader: Pessoas singulares religiosas
narrower: Abade (Pessoas singulares do clero secular)
narrower: Arcebispo
narrower: Bispo
narrower: Cardeal
narrower: Cónego
narrower: Cura
narrower: Pape
narrower: Pároco
narrower: Patriarca
narrower: Prior (Pessoas singulares do clero secular)
narrower: Reitor
narrower: Vigário-geral (Pároco)
narrower: Vigário episcopal

Abade (Pessoas singulares do clero secular)
type: Concept
scope note: Religioso secular que governa uma igreja paroquial, instalada numa casa monástica-conventual, entretanto extinta.
in scheme: Tesauro SIPA
preferred label: Abbot (Secular clergy singular persons) @en
preferred label: Abbé (Personnes physiques du clergé séculier) @fr
preferred label: Abate (Persone fisiche del clero secolare) @it
broader: Pessoas singulares do clero secular

Arcebispo
type: Concept
scope note: Religioso responsável por uma arquidiocese (uma diocese metropolitana), a qual abrange, geralmente, mais que uma diocese, tendo vários bispos que dele dependem do ponto de vista jurisdicional. O cargo nasceu em períodos recuados, dando resposta à necessidade das populações que viviam mais afastadas de Roma.
in scheme: Tesauro SIPA
preferred label: Archbishop @en
preferred label: Archevêque @fr
preferred label: Arcivescovo @it
alternative label: Bispo metropolitano
broader: Pessoas singulares do clero secular
narrower: Arcebispo ad personam
narrower: Arcebispo coadjutor
narrower: Arcebispo emérito
narrower: Arcebispo primaz
narrower: Arcebispo titular

Arcebispo ad personam
type: Concept
scope note: Título honorífico com o qual se distinguem alguns bispos, os quais não têm jurisdição sobre qualquer circunscrição religiosa deste tipo.
in scheme: Tesauro SIPA
preferred label: Archbishop Ad Personam @en
preferred label: Archevêque ad personam @fr
preferred label: Arcivescovo ad personam @it
broader: Arcebispo

Arcebispo coadjutor
type: Concept
scope note: Bispo que auxilia o arcebispo no governo da arquidiocese, gozando do direito de sucessão e tendo, normalmente, o título de arcebispo.
in scheme: Tesauro SIPA
preferred label: Coadjutor archbishop @en
preferred label: Archevêque coadjuteur @fr
preferred label: Arcivescovo coadiutore @it
broader: Arcebispo

Arcebispo emérito
type: Concept
scope note: Arcebispo que renuncia às suas atividades, ao completar os 75 anos de idade.
in scheme: Tesauro SIPA
preferred label: Archbishop Emeritus @en
preferred label: Archevêque émérite @fr
preferred label: Arcivescovo emerito @it
broader: Arcebispo

Arcebispo primaz
type: Concept
scope note: Título honorífico atribuído aos responsáveis pelas arquidioceses mais antigas, tendo sido em Portugal atribuído ao arcebispo de Braga.
in scheme: Tesauro SIPA
preferred label: Primate archbishop @en
preferred label: Archevêque primat @fr
preferred label: Arcivescovo primate @it
broader: Arcebispo

Arcebispo titular
type: Concept
scope note: Arcebispo que é o titular de uma arquidiocese desaparecida ou arcebispos que não têm jurisdição sobre a mesma, por se encontrarem com outros cargos, ao serviço da Cúria Papal.
in scheme: Tesauro SIPA
preferred label: Titular archbishop @en
preferred label: Archevêque titulaire @fr
preferred label: Arcivescovo titolare @it
broader: Arcebispo

Bispo
type: Concept
scope note: Religioso da Igreja Católica que tem plenos poderes de conferir os sacramentos da confirmação e da ordem, dirigindo espiritualmente uma diocese e estando subordinado ao Papa ou, em alguns casos, a um arcebispo, sendo considerado com descendente dos discípulos de Jesus Cristo. Pode ser nomeado pelo Papa ou por outro religioso com poderes similares. Este título também existe em outros cultos cristãos, onde a organização hierárquica se aproxima da Igreja Católica, nomeadamente na Igreja Anglicana, Igreja Metodista, Igreja Ortodoxa e Igreja Protestante, sendo o dirigente de uma diocese. Na Igreja Protestante, homens ou mulheres são eleitos nos sínodos e o seu nome é aprovado no Parlamento para se encontrar à frente de uma circunscrição religiosa.
in scheme: Tesauro SIPA
preferred label: Bishop @en
preferred label: Évêque @fr
preferred label: Vescovo @it
broader: Pessoas singulares do clero secular
narrower: Bispo auxiliar
narrower: Bispo prelado
narrower: Bispo sufragâneo
narrower: Bispo titular
narrower: Bispo segundo o credo

Bispo auxiliar
type: Concept
scope note: Religioso consagrado para auxiliar o principal bispo de uma diocese, podendo substituí-lo em caso de incapacidade.
in scheme: Tesauro SIPA
preferred label: Auxiliary bishop @en
preferred label: Évêque auxiliaire @fr
preferred label: Vescovo ausiliare @it
broader: Bispo

Bispo prelado
type: Concept
scope note: Religioso secular que dirige uma prelazia.
in scheme: Tesauro SIPA
preferred label: Prelate bishop @en
preferred label: Évêque prélat @fr
preferred label: Vescovo prelato @it
broader: Bispo

Bispo sufragâneo
type: Concept
scope note: Religioso que dirige uma diocese, que integra uma arquidiocese, mas que exerce a sua autoridade plena, apenas dependendo do Papa, excepto em questões protocolares.
in scheme: Tesauro SIPA
preferred label: Suffragan bishop @en
preferred label: Évêque suffragant @fr
preferred label: Vescovo suffraganeo @it
broader: Bispo

Bispo titular
type: Concept
scope note: Religioso que governa uma diocese de forma nominal, por esta se situar em terreno não cristão.
in scheme: Tesauro SIPA
preferred label: Titular bishop @en
preferred label: Évêque titulaire @fr
preferred label: Vescovo titolare @it
broader: Bispo

Bispo segundo o credo
type: Concept
in scheme: Tesauro SIPA
preferred label: Bishop according to worship @en
preferred label: Évêque selon le credo @fr
preferred label: Vescovo secondo il credo @it
broader: Bispo
narrower: Eparca

Eparca
type: Concept
scope note: Bispo que governa uma diocese da Igreja Ortodoxa.
in scheme: Tesauro SIPA
preferred label: Eparch @en
preferred label: Éparque @fr
broader: Bispo segundo o credo

Cardeal
type: Concept
scope note: Religioso mais importante na hierarquia da Igreja Católica, apenas obedecendo ao Papa, que o nomeia, com a obrigação de o assistir nas suas funções. Considerado como um “Príncipe da Igreja” tem reservado o hábito púrpura, que apenas ele pode envergar. O termo nasceu para designar altos dignitários da Igreja Ortodoxa, tendo passado à Igreja Católica, no século IV, para distinguir os bispos das principais dioceses da cidade de Roma, sendo, inicialmente, um cargo raro fora deste âmbito. No século XVI, o Papa Sisto V fixou o número de cardeais em 76, vindo a aumentar no século XX para um total de 144, abrangendo, ainda, os titulares da Igreja Ortodoxa. Geralmente, os Cardeais apresentem demissão quando cumprem os 75 anos de idade e os que têm mais de 80, não podem participar no conclave, deixando também de ser Membros dos Escritórios da Cúria Romana ou de qualquer outro organismo ou dicastério da Cúria Romana.
in scheme: Tesauro SIPA
preferred label: Cardinal @en
preferred label: Cardinale @it
broader: Pessoas singulares do clero secular
narrower: Camerlengo
narrower: Cardeal-bispo
narrower: Cardeal diácono
narrower: Cardeal in pectore
narrower: Cardeal presbítero
narrower: Núncio

Camerlengo
type: Concept
scope note: Cardeal que desempenha as funções de administrar a propriedade e receita do Vaticano. É normalmente um cardeal, podendo, contudo, ser um presbítero, nomeado especialmente para este efeito, o qual integra o Colégio Cardinalício, assumindo as funções de secretário e tesoureiro, sendo o responsável pela gestão financeira deste órgão. Além desta função, celebra o Réquiem por um cardeal falecido e é o responsável pela redação das atas do Consistório. Tem a responsabilidade de declarar oficialmente a morte do Papa, para o qual deve seguir um ritual preciso de bater suavemente na cabeça do mesmo com um martelo de prata. Após a morte declarada, retira o anel papal, cortando-o e destruindo o selo do Sumo Pontífice, iniciando os preparativos para o funeral e para a realização do conclave. Durante este período, é o camerlengo que governa a Santa Sé, apesar de não poder assumir decisões de fundo.
in scheme: Tesauro SIPA
preferred label: Camerlingue @fr
preferred label: Camerlengo; Chamberlain @en
broader: Cardeal

Cardeal-bispo
type: Concept
scope note: Existem apenas sete, responsáveis pela governação de uma das seis paróquias de Roma (Albano, Frascati, Palestrina, Porto-Santa Rufina, Sabina-Poggio Mirteto e Velletri-Segni), sendo os outros dois externos, o bispo de Veneza e o arcebispo de Lisboa. Os seis primeiros são os responsáveis por elegerem o decano do Colégio Cardinalício, cujo nome é aprovado pelo Papa, sendo-lhe atribuída a igreja de Óstia, reservada ao Decanato.
in scheme: Tesauro SIPA
preferred label: Cardinal-bishop @en
preferred label: Cardinal-évêque @fr
preferred label: Cardinale vescovo @it
broader: Cardeal

Cardeal diácono
type: Concept
scope note: Cardeal responsável por uma diaconia na cidade de Roma.
in scheme: Tesauro SIPA
preferred label: Cardinal-deacon @en
preferred label: Cardinal diacre @fr
preferred label: Cardinale diacono @it
broader: Cardeal

Cardeal in pectore
type: Concept
scope note: Cardeal nomeado pelo Papa, mas cujo nome não é divulgado, devido ao religioso nomeado se encontrar num país onde existem perseguições ao Cristianismo ou Igreja Católica, não tendo o privilégio de reunir em conclave, mas podendo exercer a função de aconselhamento do Papa. O seu nome só pode ser divulgado após o perigo de perseguição se encontrar resolvido, sendo possível que alguns nunca conheçam a sua nomeação, quer pela sua morte, quer pela morte do Sumo Pontífice.
in scheme: Tesauro SIPA
preferred label: Cardinal In Pectore @en
preferred label: Cardinal in pectore @fr
preferred label: Cardinale in pectore @it
broader: Cardeal

Cardeal presbítero
type: Concept
scope note: Cardeal que dirige uma das principais igrejas da cidade de Roma.
in scheme: Tesauro SIPA
preferred label: Cardinal-priest @en
preferred label: Cardinal presbytre @fr
preferred label: Cardinale presbitero @it
broader: Cardeal

Núncio
type: Concept
in scheme: Tesauro SIPA
preferred label: Nonce @fr
preferred label: Nunzio @it
preferred label: Nuncio; Apostolic nuncio @en
broader: Cardeal

Cónego
type: Concept
scope note: Cada um dos membros religiosos de um Cabido de catedral ou de colegiada.
in scheme: Tesauro SIPA
preferred label: Canonico @it
preferred label: Canon @en
preferred label: Chanoine @fr
broader: Pessoas singulares do clero secular
narrower: Cónego segundo a função
narrower: Meio-cónego
related: Ecónomo

Cónego segundo a função
type: Concept
in scheme: Tesauro SIPA
preferred label: Canon according to function @en
preferred label: Canon selon la fonction @fr
preferred label: Canonico secondo la funzione @it
broader: Cónego
narrower: Abade (Cónego)
narrower: Arcedíago (Cónego)
narrower: Arcipreste
narrower: Chantre
narrower: Cónego chanceler
narrower: Cónego tesoureiro
narrower: Deão
narrower: Prior (Cónego)
narrower: Prioste

Abade (Cónego)
type: Concept
scope note: Cónego escolhido entre os mais velhos diáconos de uma catedral, tendo como função auxiliar o bispo e preparar e examinar os candidatos às ordens sacras, visitar igrejas e corrigir os erros que encontrava durante as visitações. Era ajudado pelo arcipreste, por ele nomeado com a ajuda do bispo.
in scheme: Tesauro SIPA
preferred label: Abbot (Canon) @en
preferred label: Abbé (Chanoine) @fr
preferred label: Abate (Canonico) @it
broader: Cónego segundo a função

Arcedíago (Cónego)
type: Concept
scope note: Cónego escolhido entre os mais velhos diáconos de uma catedral, tendo como função auxiliar o bispo e preparar e examinar os candidatos às ordens sacras, visitar igrejas e corrigir os erros que encontrava durante as visitações. Era ajudado pelo arcipreste, por ele nomeado com a ajuda do bispo.
in scheme: Tesauro SIPA
preferred label: Archdeacon (Canon) @en
preferred label: Archidiacre (Chanoine) @fr
preferred label: Arcidiacono (Canonico) @it
broader: Cónego segundo a função

Arcipreste
type: Concept
scope note: Cónego escolhido entre os presbíteros mais importantes de uma catedral, tendo a função de ajudar o arcediago nas visitações paroquiais e na reunião do clero para palestras mensais. Tinha a função de cobrar as rendas episcopais. Com o declínio da figura do arcediago, ocupou o seu lugar.
in scheme: Tesauro SIPA
preferred label: Archiprêtre @fr
preferred label: Arciprete @it
preferred label: Archpiest; Archpresbyter @en
alternative label: Ouvidor
alternative label: Vigário forâneo
broader: Cónego segundo a função

Chantre
type: Concept
scope note: Cónego responsável por dirigir os atos litúrgicos e procissões de uma catedral ou colegiada, selecionava os meninos do coro e ensinava-lhes a arte do Canto.
in scheme: Tesauro SIPA
broader: Cónego segundo a função
narrower: Sub-chantre

Sub-chantre
type: Concept
scope note: Cónego responsável por ajudar o chantre, sobretudo a partir do momento em que a música passou a assumir papel relevante nas cerimónias litúrgicas, a partir da Idade Média, sendo o responsável por manter e escolher uma panóplia de mestres, cantores e organistas.
in scheme: Tesauro SIPA
broader: Chantre

Cónego chanceler
type: Concept
scope note: Cónego com a função de redigir os documentos relativos ao governo da diocese, através de escribas ou notários, sendo o responsável pela sua conservação nos arquivos. Colaborava no governo da diocese e substituía o bispo em certos actos litúrgicos. No caso de morte do bispo, administra-lhe os sacramentos e preside às exéquias.
in scheme: Tesauro SIPA
preferred label: Canon Chancellor @en
preferred label: Chanoine chancelier @fr
preferred label: Canonico cancelliere @it
broader: Cónego segundo a função

Cónego tesoureiro
type: Concept
scope note: Cónego responsável pela compra, manutenção e inventariação das alfaias litúrgicas de uma catedral ou colegiada. Tinha a seu cargo vários porteiros, sacristãos e sineiros, encarregues, respetivamente, de abrir e fechar as portas, da limpeza e decoração da catedral ou igreja, fornecimento de hóstias, luminária e incenso, e pelo toque dos sinos.
in scheme: Tesauro SIPA
preferred label: Treasurer Canon @en
preferred label: Chanoine trésorier @fr
preferred label: Canonico tesoriere @it
broader: Cónego segundo a função

Deão
type: Concept
scope note: Cónego mais importante do Cabido, presidindo às reuniões do mesmo e governando a diocese em sede vacante; representava o bispo nas relações com o exterior.
in scheme: Tesauro SIPA
preferred label: Dean @en
preferred label: Doyen @fr
preferred label: Decano @it
broader: Cónego segundo a função

Prior (Cónego)
type: Concept
scope note: Chefe máximo de uma Colegiada, com a função de celebrar as missas principais e gerir os bens do templo, representando a comunidade nas relações com o exterior. Podia ser o único cónego existente numa colegiada de menores posses. Era apresentado pelo padroeiro e confirmado pelo bispo, normalmente um religioso que se desejava compensar alguns serviços prestados, passando a receber uma prebenda razoável.
in scheme: Tesauro SIPA
preferred label: Prior (Canon) @en
preferred label: Prieur (Chanoine) @fr
preferred label: Priore (Canonico) @it
broader: Cónego segundo a função

Prioste
type: Concept
scope note: Religioso que cobra as rendas eclesiásticas.
in scheme: Tesauro SIPA
broader: Cónego segundo a função

Meio-cónego
type: Concept
scope note: Cónego com ordens menores, derivando do diaconado, que assumia as responsabilidades dos vários cónegos, exceto o de proferir palavra no Capítulo, recebendo, apenas, metade, um terço ou um quarto da prebenda atribuída a um cónego.
in scheme: Tesauro SIPA
preferred label: Sous-diacre @fr
preferred label: Suddiacono @it
preferred label: Subdeacon @en
broader: Cónego

Cura
type: Concept
in scheme: Tesauro SIPA
preferred label: Curé @fr
preferred label: Prete @it
preferred label: Priest; Vicar @en
broader: Pessoas singulares do clero secular

Pape
type: Concept
scope note: Chefe supremo da Igreja Católica, eleito durante um conclave composto pelo colégio de cardeais.
in scheme: Tesauro SIPA
preferred label: Papa
preferred label: Pope @en
alternative label: Bispo de Roma
broader: Pessoas singulares do clero secular

Pároco
type: Concept
scope note: Religioso secular ou regular, que governa uma paróquia.
in scheme: Tesauro SIPA
preferred label: Parish priest @en
preferred label: Curé de paroisse @fr
preferred label: Parroco @it
broader: Pessoas singulares do clero secular
narrower: Pároco segundo o âmbito histórico
narrower: Pároco segundo o tipo

Pároco segundo o âmbito histórico
type: Concept
in scheme: Tesauro SIPA
preferred label: Parish priest according to historical field @en
preferred label: Curé de paroisse selon le contexte historique @fr
preferred label: Parroco secondo il contesto storico @it
broader: Pároco
narrower: Exorcista
narrower: Leitor
narrower: Ostiário

Exorcista
type: Concept
scope note: Sacerdote que, no século III, tinha poder sobre os maus espíritos e estava relacionado com o sacramento do batismo.
in scheme: Tesauro SIPA
preferred label: Exorciste @fr
preferred label: Esorcista @it
preferred label: Exorcist; Exorciser @en
broader: Pároco segundo o âmbito histórico

Leitor
type: Concept
scope note: Sacerdote responsável pelas leituras bíblicas, cargo que aparece no século III.
in scheme: Tesauro SIPA
preferred label: Reader @en
preferred label: Lecteur @fr
preferred label: Lettore @it
broader: Pároco segundo o âmbito histórico

Ostiário
type: Concept
scope note: Era, no século III, o sacerdote que assumia funções de porteiro, sineiro, guarda e sacristão.
in scheme: Tesauro SIPA
preferred label: Ostiary @en
preferred label: Gardien du temple @fr
preferred label: Ostiario @it
broader: Pároco segundo o âmbito histórico

Pároco segundo o tipo
type: Concept
in scheme: Tesauro SIPA
preferred label: Parish priest according to type @en
preferred label: Curé par type @fr
preferred label: Parroco per tipologia @it
broader: Pároco
narrower: Abade (Pároco)
narrower: Acólito
narrower: Arcedíago (Pároco)
narrower: Diácono
narrower: Presbítero
narrower: Vigário paroquial

Abade (Pároco)
type: Concept
scope note: Religioso secular que governa uma paróquia constituída em abadia. Por extensão, o termo é utilizado em algumas zonas de Portugal para denominar o pároco.
in scheme: Tesauro SIPA
preferred label: Abbot (Parish priest) @en
preferred label: Abate (Parroco) @it
preferred label: Abbé (Curé de paroisse) @fr
broader: Pároco segundo o tipo

Acólito
type: Concept
scope note: Religioso da Igreja Católica que recebeu o grau mais elevado das ordens menores, sendo, normalmente, um celebrante auxiliar.
in scheme: Tesauro SIPA
preferred label: Acolyte @en
preferred label: Accolito @it
broader: Pároco segundo o tipo

Arcedíago (Pároco)
type: Concept
scope note: Sacerdote que tutela um arcediagado, o qual reúne várias paróquias, tendo por função reunir os sacerdotes das mesmas, representá-los junto ao bispo e resolver problemas administrativos da sua circunscrição.
in scheme: Tesauro SIPA
preferred label: Archdeacon (Parish priest) @en
preferred label: Arcidiacono (Parroco) @it
preferred label: Archidiacre (Curé de paroisse) @fr
broader: Pároco segundo o tipo

Diácono
type: Concept
scope note: Religioso que podia, em caso de necessidade, ministrar determinados sacramentos, nomeadamente o batismo.
in scheme: Tesauro SIPA
preferred label: Deacon @en
preferred label: Diacre @fr
preferred label: Diacono @it
broader: Pároco segundo o tipo
narrower: Sub-diácono

Sub-diácono
type: Concept
scope note: Religioso secular que tomou ordens maiores, assim consideradas a partir do século XII, sendo o responsável pelas leituras e cânticos no lado da Epístola, assistindo o diácono e sendo o responsável por transportar o cálice para o altar.
in scheme: Tesauro SIPA
preferred label: Sub-Deacon @en
preferred label: Sous-diacre @fr
preferred label: Suddiacono @it
broader: Diácono

Presbítero
type: Concept
scope note: Religioso que perfez o segundo grau das Ordens Sacras, estando entre o diácono e o bispo, tendo por função ser o principal responsável por uma paróquia, podendo ser pároco ou vigário, sujeito a um presbítero mais antigo. O presbítero pode estar ao serviço de uma colegiada ou de uma catedral, tendo o título de cónego. Pode, em certos casos, assumir algumas tarefas consignadas, normalmente, aos altos dignitários, como é o caso de governar as finanças de uma diocese ou mesmo da Santa Sé. Nas igrejas reformadas e presbiterianas, o presbítero é o líder espiritual de uma comunidade.
in scheme: Tesauro SIPA
preferred label: Presbytre @fr
preferred label: Presbitero @it
preferred label: Presbyter; Elder @en
broader: Pároco segundo o tipo
narrower: Presbítero docente
narrower: Presbítero regente

Presbítero docente
type: Concept
scope note: Religioso secular responsável pelo ensino na igreja.
in scheme: Tesauro SIPA
preferred label: Presbytre enseignant @fr
preferred label: Presbitero docente @it
preferred label: Ruling presbyter/ elder @en
broader: Presbítero

Presbítero regente
type: Concept
scope note: Religioso secular que assume a responsabilidade pela administração de uma comunidade.
in scheme: Tesauro SIPA
preferred label: Presbytre régent @fr
preferred label: Presbiteroreggente @it
preferred label: Regent presbyter/ elder @en
broader: Presbítero

Vigário paroquial
type: Concept
scope note: Sacerdote que coopera com o pároco de uma freguesia, sendo nomeado pelo bispo para esta função de coadjutor, por tempo determinado. Pode servir uma zona da paróquia ou assumir o papel diretivo de um sector de apostolado, junto aos jovens, doentes, etc.
in scheme: Tesauro SIPA
preferred label: Parish vicar @en
preferred label: Vicaire paroissial @fr
preferred label: Vicario parrocchiale @it
broader: Pároco segundo o tipo

Patriarca
type: Concept
scope note: Título honorífico concedido a um arcebispo ou bispo, que assume a ascendência sobre todas as demais dignidades episcopais. Tem origem na Igreja Ortodoxa, onde sempre foi um título honorífico, transportado para a igreja latina, onde o título foi assumido pelo Papa, com os quais forma a Pentarquia (Patriarca de Roma, Patriarca de Antioquia, Patriarca de Alexandria, Patriarca de Jerusalém e Patriarca de Constantinopla). A estes, foram acrescentados alguns titulares na Igreja Católica, como o de Veneza e Lisboa, das Índias Ocidentais e das Índias Orientais.
in scheme: Tesauro SIPA
preferred label: Patriarch @en
preferred label: Patriarche @fr
broader: Pessoas singulares do clero secular

Prior (Pessoas singulares do clero secular)
type: Concept
in scheme: Tesauro SIPA
preferred label: Prior (Secular clergy singular persons) @en
preferred label: Prieur (Personnes physiques du clergé séculier) @fr
preferred label: Priore (Persone fisiche del clero secolare) @it
broader: Pessoas singulares do clero secular

Reitor
type: Concept
in scheme: Tesauro SIPA
preferred label: Rector @en
preferred label: Recteur @fr
preferred label: Rettore @it
broader: Pessoas singulares do clero secular

Vigário-geral (Pároco)
type: Concept
scope note: Religioso que colabora diretamente com o bispo no governo da diocese, tendo poder executivo. É nomeado pelo bispo por tempo definido ou indeterminado, devendo ser bispo ou presbítero e possuir mais de trinta anos, tendo que ser doutorado em Direito Canónico ou Teologia. Este cargo é antigo, apesar de só ser reconhecido pela Igreja no século XVI.
in scheme: Tesauro SIPA
preferred label: Vicar General (Parish priest) @en
preferred label: Vicaire général (Curé de paroisse) @fr
preferred label: Vicario generale (Parroco) @it
broader: Pessoas singulares do clero secular

Vigário episcopal
type: Concept
scope note: Religioso que colabora com o bispo em tarefas administrativas e pastorais, podendo ter a seu cargo uma certa zona da diocese. É escolhido pelo bispo e tem que ser bispo ou presbítero e possuir mais de trinta anos, tendo que ser doutorado em Direito Canónico ou Teologia. Este cargo é recente, tendo sido criado no Concílio Vaticano II (1963-1965).
in scheme: Tesauro SIPA
preferred label: Vicaire épiscopal @fr
preferred label: Vicario episcopale @it
preferred label: Episcopal Vicar @en
broader: Pessoas singulares do clero secular
narrower: Vigário judicial

Vigário judicial
type: Concept
scope note: Religioso com poder de julgar em termos de foro canónico. É nomeado pelo bispo por tempo determinado e tem de ser presbítero, possuir mais de trinta anos e possuir um doutoramento ou licenciatura em Direito Canónico.
in scheme: Tesauro SIPA
preferred label: Vicaire judiciaire @fr
preferred label: Vicario giudiziale @it
preferred label: Judicial Vicar @en
broader: Vigário episcopal

MATERIAIS E PRODUTOS
type: Collection
type: ConceptGroup
preferred label: MATERIALS AND PRODUCTS @en
preferred label: MATÉRIEUX ET PRODUITS @fr
preferred label: MATERIALI E PRODOTTI @it
member: Materiais e produtos
member: Adubo
member: Materiais e produtos segundo a composição
member: Materiais e produtos inorgânicos
member: Ácido
member: Hidrácidos
member: Oxiácidos
member: Alcatrão
member: Barro
member: Barro preto
member: Barro vermelho
member: Produtos derivados do barro
member: Cerâmica (Produtos derivados do barro)
member: Cerâmica segundo a função
member: Cerâmica decorativa
member: Cerâmica utilitária
member: Terracota
member: Tijolo (Produtos derivados do barro)
member: Tijolo artesanal
member: Tijolo burro
member: Tijolo de adobe
member: Tijolo lambaz
member: Tijolo pré-industrial
member: Tijolo industrial
member: Tijolo furado
member: Tijolo perfurado
member: Tijolo refratário
member: Betão
member: Betão à vista
member: Betão armado
member: Betão pigmentado
member: Betão pré-esforçado
member: Betão reforçado
member: Produtos derivados do betão
member: Areia reciclada
member: Brita corrida
member: Brita reciclada
member: Pedrisco reciclado
member: Rachão
member: Cal
member: Cal aérea
member: Cal hidratada
member: Leite de cal
member: Pasta de cal
member: Cal gorda
member: Cal magra
member: Cal pigmentada
member: Cal viva
member: Cal hidráulica
member: Cal segundo a composição
member: Cal cálcica
member: Cal dolomítica
member: Cimento
member: Cimento Portland
member: Fibrocimento
member: Gema
member: Ágata
member: Alabastro
member: Âmbar
member: Ametista
member: Azeviche
member: Diamante
member: Esmeralda
member: Granada
member: Quartzo
member: Rubi
member: Safira
member: Topázio
member: Turmalina
member: Turquesa
member: Metais (Materiais e produtos inorgânicos)
member: Alumínio (Metais)
member: Amianto
member: Arame

Materiais e produtos
type: Concept
in scheme: Tesauro SIPA
top concept of: Tesauro SIPA
preferred label: Materials and products @en
preferred label: Matériaux et produits @fr
preferred label: Materiali e prodotti @it
narrower: Adubo
narrower: Materiais e produtos segundo a composição
narrower: Materiais e produtos segundo a função
related: Isolamento
related: Atributos e propriedades
related: Compartimentos e espaços
related: Elementos arquitetónicos
related: c 2a059c3a
related: c 7e244aff
related: c 5b564278
related: c e011dd84
related: c 65005b47
modified: 2025-09-23T13:52:24

Adubo
type: Concept
in scheme: Tesauro SIPA
preferred label: Fertilizer @en
preferred label: Engrais @fr
preferred label: Concime @it
broader: Materiais e produtos

Materiais e produtos segundo a composição
type: Concept
in scheme: Tesauro SIPA
preferred label: Materials and products according to composition @en
preferred label: Matériaux et produits selon la composition @fr
preferred label: Materiali e prodotti secondo la composizione @it
broader: Materiais e produtos
narrower: Materiais e produtos inorgânicos
narrower: Materiais e produtos orgânicos

Materiais e produtos inorgânicos
type: Concept
in scheme: Tesauro SIPA
preferred label: Inorganic materials and products @en
preferred label: Matériaux et produits inorganiques @fr
preferred label: Materiali e prodotti inorganici @it
broader: Materiais e produtos segundo a composição
narrower: Ácido
narrower: Alcatrão
narrower: Barro
narrower: Betão
narrower: Cal
narrower: Cimento
narrower: Gema
narrower: Metais (Materiais e produtos inorgânicos)
narrower: Pedra
narrower: Vidro

Ácido
type: Concept
in scheme: Tesauro SIPA
preferred label: Acid @en
preferred label: Acide @fr
preferred label: Acido @it
broader: Materiais e produtos inorgânicos
narrower: Hidrácidos
narrower: Oxiácidos

Hidrácidos
type: Concept
in scheme: Tesauro SIPA
preferred label: Hydracids @en
preferred label: Hydracides @fr
preferred label: Idracidi @it
broader: Ácido

Oxiácidos
type: Concept
in scheme: Tesauro SIPA
preferred label: Oxyacids @en
preferred label: Oxacides @fr
preferred label: Ossiacidi @it
broader: Ácido

Alcatrão
type: Concept
in scheme: Tesauro SIPA
preferred label: Tarmac @en
preferred label: Goudron @fr
preferred label: Catrame @it
broader: Materiais e produtos inorgânicos

Barro
type: Concept
scope note: Terra argilosa, de grão fino, que adquire plasticidade quando misturada com água podendo ser moldada das mais variadas formas. Ao secar solidifica e se for cozida a altas temperaturas ganha forte resistência física.
in scheme: Tesauro SIPA
preferred label: Clay @en
preferred label: Argile @fr
preferred label: Argilla @it
alternative label: Pasta
broader: Materiais e produtos inorgânicos
narrower: Barro preto
narrower: Barro vermelho
narrower: Produtos derivados do barro
related: c 6409c4bb
modified: 2025-09-23T13:53:01

Barro preto
type: Concept
in scheme: Tesauro SIPA
preferred label: Black clay @en
preferred label: Argile noire @fr
preferred label: Argilla nera @it
broader: Barro

Barro vermelho
type: Concept
in scheme: Tesauro SIPA
preferred label: Red clay @en
preferred label: Argile rouge @fr
preferred label: Argilla rossa @it
broader: Barro

Produtos derivados do barro
type: Concept
in scheme: Tesauro SIPA
preferred label: Clay-based products @en
broader: Barro
narrower: Cerâmica (Produtos derivados do barro)
narrower: Terracota
narrower: Tijolo (Produtos derivados do barro)

Cerâmica (Produtos derivados do barro)
type: Concept
scope note: Peça feita em pasta argilosa que tenha sido submetida a alterações químicas devido a temperaturas iguais ou superiores a 600º.
in scheme: Tesauro SIPA
preferred label: Ceramics @en
preferred label: Céramique @fr
preferred label: Ceramica @it
broader: Produtos derivados do barro
narrower: Cerâmica segundo a função

Cerâmica segundo a função
type: Concept
in scheme: Tesauro SIPA
preferred label: Ceramics according to fuction @en
broader: Cerâmica (Produtos derivados do barro)
narrower: Cerâmica decorativa
narrower: Cerâmica utilitária

Cerâmica decorativa
type: Concept
in scheme: Tesauro SIPA
preferred label: Ornamental ceramics @en
preferred label: Céramique de décoration @fr
preferred label: Ceramica ornamentale @it
broader: Cerâmica segundo a função

Cerâmica utilitária
type: Concept
in scheme: Tesauro SIPA
preferred label: Utility ceramics @en
preferred label: Céramique utilitaire @fr
preferred label: Ceramica utile @it
broader: Cerâmica segundo a função

Terracota
type: Concept
scope note: Cerâmica decorativa que têm como característica comum a ausência de vidrado.
in scheme: Tesauro SIPA
preferred label: Terracotta @en
broader: Produtos derivados do barro

Tijolo (Produtos derivados do barro)
type: Concept
scope note: Elemento paralelepipédico feito de barro ou cimento, podendo ser maciço ou furado, muito utilizado na construção civil, para feitura de paredes e muros.
in scheme: Tesauro SIPA
preferred label: Brick @en
preferred label: Brique @fr
preferred label: Mattone @it
broader: Produtos derivados do barro
narrower: Tijolo artesanal
narrower: Tijolo pré-industrial
narrower: Tijolo industrial
related: Intonaco pastellone

Tijolo artesanal
type: Concept
in scheme: Tesauro SIPA
preferred label: Handcrafted brick @en
preferred label: Brique artisanale @fr
preferred label: Mattone artigianale @it
broader: Tijolo (Produtos derivados do barro)
narrower: Tijolo burro
narrower: Tijolo de adobe
narrower: Tijolo lambaz

Tijolo burro
type: Concept
in scheme: Tesauro SIPA
preferred label: Donkey brick @en
broader: Tijolo artesanal

Tijolo de adobe
type: Concept
scope note: Pequenos blocos de forma regular de argamassa de barro ordinário amassado com areia e palha, compactado em forma de tijolo e seco ao sol, usados na construção em zonas pobres em pedra. Antigamente a moldagem dos blocos era feita com uma forma de madeira rudimentar, normalmente construída pelo operário no local e denominada adobeira. Este método ainda é utilizado em alguns países. Atualmente existem máquinas que permitem a rápida execução destes blocos e a homogeneidade das suas dimensões.
in scheme: Tesauro SIPA
preferred label: Mudbrick @en
alternative label: Tijolo de adobo
broader: Tijolo artesanal

Tijolo lambaz
type: Concept
in scheme: Tesauro SIPA
preferred label: Lambast brick @en
broader: Tijolo artesanal

Tijolo pré-industrial
type: Concept
in scheme: Tesauro SIPA
preferred label: Pre-industrial brick @en
broader: Tijolo (Produtos derivados do barro)

Tijolo industrial
type: Concept
in scheme: Tesauro SIPA
preferred label: Industrial brick @en
broader: Tijolo (Produtos derivados do barro)
narrower: Tijolo furado
narrower: Tijolo perfurado
narrower: Tijolo refratário

Tijolo furado
type: Concept
in scheme: Tesauro SIPA
preferred label: Hollow brick @en
alternative label: Tijolo vazado
broader: Tijolo industrial

Tijolo perfurado
type: Concept
in scheme: Tesauro SIPA
preferred label: Perforated brick @en
broader: Tijolo industrial

Tijolo refratário
type: Concept
in scheme: Tesauro SIPA
preferred label: Fire brick; Refractory @en
broader: Tijolo industrial

Betão
type: Concept
scope note: Massa de cimento, gravilha, areia e água usada na construção, para fixar silhares.
in scheme: Tesauro SIPA
preferred label: Concrete @en
preferred label: Béton @fr
preferred label: Calcestruzzo @it
alternative label: Formigão
broader: Materiais e produtos inorgânicos
narrower: Betão à vista
narrower: Betão armado
narrower: Betão pigmentado
narrower: Betão pré-esforçado
narrower: Betão reforçado
narrower: Produtos derivados do betão

Betão à vista
type: Concept
scope note: Construção feita em betão, sem receber qualquer tipo de revestimento ou pintura.
in scheme: Tesauro SIPA
preferred label: Exposed concrete @en
preferred label: Béton brut de décoffrage @fr
broader: Betão

Betão armado
type: Concept
scope note: Massa de cimento, gravilha, areia e água, envolvendo uma estrutura metálica, sendo o ideal para encher lajes e pilares.
in scheme: Tesauro SIPA
preferred label: Reinforced concrete @en
alternative label: Béton
broader: Betão

Betão pigmentado
type: Concept
in scheme: Tesauro SIPA
preferred label: Pigmented concrete @en
preferred label: Béton pigmenté @fr
preferred label: Calcestruzzo pigmentato @it
broader: Betão

Betão pré-esforçado
type: Concept
scope note: Massa de cimento, gravilha, areia e água, envolvendo uma estrutura metálica, que foi sujeita a testes de compressão semelhante aos que irá receber.
in scheme: Tesauro SIPA
preferred label: Prestressed concrete @en
preferred label: Béton précontraint @fr
preferred label: Calcestruzzo precompresso @it
broader: Betão

Betão reforçado
type: Concept
in scheme: Tesauro SIPA
preferred label: Reinforced concrete @en
preferred label: Béton renforcé @fr
preferred label: Calcestruzzo rinforzato @it
broader: Betão

Produtos derivados do betão
type: Concept
in scheme: Tesauro SIPA
preferred label: Concrete-based products @en
broader: Betão
narrower: Areia reciclada
narrower: Brita corrida
narrower: Brita reciclada
narrower: Pedrisco reciclado
narrower: Rachão

Areia reciclada
type: Concept
in scheme: Tesauro SIPA
preferred label: Recycled sand @en
broader: Produtos derivados do betão

Brita corrida
type: Concept
in scheme: Tesauro SIPA
preferred label: Sleet @en
broader: Produtos derivados do betão

Brita reciclada
type: Concept
in scheme: Tesauro SIPA
preferred label: Recycled sleet @en
broader: Produtos derivados do betão

Pedrisco reciclado
type: Concept
in scheme: Tesauro SIPA
preferred label: Recycled hail @en
broader: Produtos derivados do betão

Rachão
type: Concept
in scheme: Tesauro SIPA
preferred label: Cladding stone @en
broader: Produtos derivados do betão

Cal
type: Concept
in scheme: Tesauro SIPA
preferred label: Lime @en
preferred label: Chaux @fr
preferred label: Calce @it
broader: Materiais e produtos inorgânicos
narrower: Cal aérea
narrower: Cal hidráulica
narrower: Cal segundo a composição
related: Calcário (Pedra segundo a natureza e a composição)
modified: 2025-09-23T13:55:22

Cal aérea
type: Concept
in scheme: Tesauro SIPA
preferred label: Aerial lime @en
broader: Cal
narrower: Cal hidratada
narrower: Cal pigmentada
narrower: Cal viva

Cal hidratada
type: Concept
in scheme: Tesauro SIPA
preferred label: Hydrated lime @en
alternative label: Cal apagada
alternative label: Cal extinta
broader: Cal aérea
narrower: Leite de cal
narrower: Pasta de cal

Leite de cal
type: Concept
in scheme: Tesauro SIPA
preferred label: Lime whitewash @en
alternative label: Calda de cal
broader: Cal hidratada

Pasta de cal
type: Concept
in scheme: Tesauro SIPA
preferred label: Lime slurry @en
broader: Cal hidratada
narrower: Cal gorda
narrower: Cal magra

Cal gorda
type: Concept
in scheme: Tesauro SIPA
preferred label: Fat lime; White lime @en
broader: Pasta de cal

Cal magra
type: Concept
in scheme: Tesauro SIPA
preferred label: Grey lime @en
broader: Pasta de cal

Cal pigmentada
type: Concept
in scheme: Tesauro SIPA
preferred label: Pigmented lime @en
broader: Cal aérea

Cal viva
type: Concept
in scheme: Tesauro SIPA
preferred label: Quick lime @en
alternative label: Cal pura
alternative label: Cal virgem
broader: Cal aérea

Cal hidráulica
type: Concept
in scheme: Tesauro SIPA
preferred label: Hydraulic lime @en
broader: Cal

Cal segundo a composição
type: Concept
in scheme: Tesauro SIPA
preferred label: Lime according to composition @en
broader: Cal
narrower: Cal cálcica
narrower: Cal dolomítica

Cal cálcica
type: Concept
in scheme: Tesauro SIPA
preferred label: Calcic lime @en
broader: Cal segundo a composição

Cal dolomítica
type: Concept
in scheme: Tesauro SIPA
preferred label: Dolomitic lime @en
broader: Cal segundo a composição

Cimento
type: Concept
scope note: Pó composto por silicato de alumínio e cálcio que, misturado com a água, forma uma argamassa de rápida secagem.
in scheme: Tesauro SIPA
preferred label: Cemento @it
preferred label: Cement @en
preferred label: Ciment @fr
broader: Materiais e produtos inorgânicos
narrower: Cimento Portland
narrower: Fibrocimento

Cimento Portland
type: Concept
scope note: Ligante hidráulico composto principalmente por silicatos de cálcio hidráulicos que fazem presa e endurecem em virtude de uma reação química à água chamada hidratação. Em 1825, o escocês Joseph Aspdin regista a patente de um novo tipo de cimento, com melhores qualidades que as misturas existentes até então. A este novo produto dá o nome de “cimento Portland”, pelo facto de a sua aparência e dureza serem semelhantes às das rochas do Jurássico superior existentes na região de Portland, no Sul da Inglaterra. Este material provinha de um novo processo de aquecimento dos fornos, que permitia obter temperaturas mais altas obtendo no processo de cozedura uma zona de clinquerização. Mais tarde, em 1853, Emile Dupon, fabricante francês de cimentos naturais, apoiado pelo químico Charles Demarle, consegue um notável processo de homogeneização da matéria-prima, moendo-a com o auxílio de moinhos verticais e juntando uma quantidade de água de modo a fazer uma pasta plástica. Este produto foi patenteado como um cimento hidráulico artificial análogo ao inglês. Em Portugal, após a instalação da indústria cimenteira no princípio do século XIX, o cimento Portland passa a ser usado na realização da esmagadora maioria dos rebocos de enchimento e acabamento, como ligante hidráulico das respetivas argamassas, substituindo na maioria das obras de construção civil a cal hidráulica e a cal hidratada.
in scheme: Tesauro SIPA
preferred label: Portland cement @en
preferred label: Ciment Portland @fr
preferred label: Cemento Portland @it
broader: Cimento

Fibrocimento
type: Concept
in scheme: Tesauro SIPA
preferred label: Fibrociment @fr
preferred label: Fibrocemento @it
preferred label: Fibre cement; Fibrocement @en
broader: Cimento

Gema
type: Concept
in scheme: Tesauro SIPA
preferred label: Gemstone @en
preferred label: Gemme @fr
preferred label: Gemma @it
alternative label: Pedra preciosa (Pedra - Materiais inorgânicos)
alternative label: Pedra semipreciosa (Pedra - Materiais inorgânicos)
broader: Materiais e produtos inorgânicos
narrower: Ágata
narrower: Alabastro
narrower: Âmbar
narrower: Ametista
narrower: Azeviche
narrower: Diamante
narrower: Esmeralda
narrower: Granada
narrower: Quartzo
narrower: Rubi
narrower: Safira
narrower: Topázio
narrower: Turmalina
narrower: Turquesa
related: Coral
related: Pérola

Ágata
type: Concept
scope note: Tipo de rocha derivada do sílex, muito dura, formada por calcedónia, quartzo hialino e ametista, dispostos em faixas paralelas. Apresenta cores variadas e é usada na joelharia.
in scheme: Tesauro SIPA
preferred label: Agate @en
broader: Gema

Alabastro
type: Concept
scope note: Pedra do tipo calcite estalagmítica. Apresenta cores variadas como branco, amarelo, cinza, vermelho, marrom e alaranjado, sendo translúcido e possui uma textura macia, sendo muito utilizada na feitura de estatuetas.
in scheme: Tesauro SIPA
preferred label: Alabaster @en
preferred label: Albâtre @fr
broader: Gema

Âmbar
type: Concept
scope note: Resina fóssil, da cor de mel, brilhante e translúcida, utilizada em objetos de adorno.
in scheme: Tesauro SIPA
preferred label: Amber @en
preferred label: Ambre @fr
broader: Gema

Ametista
type: Concept
in scheme: Tesauro SIPA
preferred label: Amethyst @en
preferred label: Améthyste @fr
broader: Gema

Azeviche
type: Concept
scope note: Espécie de lenhite negra e brilhante, que serve para executar objetos de adorno.
in scheme: Tesauro SIPA
preferred label: Houx @fr
preferred label: Jet-black @en
alternative label: Âmbar negro
broader: Gema

Diamante
type: Concept
in scheme: Tesauro SIPA
preferred label: Diamond @en
preferred label: Diamant @fr
broader: Gema

Esmeralda
type: Concept
in scheme: Tesauro SIPA
preferred label: Emerald @en
preferred label: Émeraude @fr
preferred label: Smeraldo @it
broader: Gema

Granada
type: Concept
in scheme: Tesauro SIPA
preferred label: Garnet @en
preferred label: Grenat @fr
preferred label: Granato @it
broader: Gema

Quartzo
type: Concept
in scheme: Tesauro SIPA
preferred label: Quartz @en
preferred label: Quarzo @it
broader: Gema

Rubi
type: Concept
in scheme: Tesauro SIPA
preferred label: Ruby @en
preferred label: Rubis @fr
preferred label: Rubino @it
broader: Gema

Safira
type: Concept
in scheme: Tesauro SIPA
preferred label: Sapphire @en
preferred label: Saphir @fr
preferred label: Zaffiro @it
broader: Gema

Topázio
type: Concept
in scheme: Tesauro SIPA
preferred label: Topaz @en
preferred label: Topaze @fr
preferred label: Topazio @it
broader: Gema

Turmalina
type: Concept
in scheme: Tesauro SIPA
preferred label: Tourmaline @en
preferred label: Tormalina @it
broader: Gema

Turquesa
type: Concept
in scheme: Tesauro SIPA
preferred label: Turquoise @en
preferred label: Turchese @it
broader: Gema

Metais (Materiais e produtos inorgânicos)
type: Concept
scope note: Elemento químico cuja característica é o transporte de corrente elétrica.
in scheme: Tesauro SIPA
preferred label: Metals (Inorganic materials and products) @en
preferred label: Métaux (Matériaux et produits inorganiques) @fr
preferred label: Metalli (Materiali e prodotti inorganici) @it
broader: Materiais e produtos inorgânicos
narrower: Alumínio (Metais)
narrower: Amianto
narrower: Arame
narrower: Chumbo (Metais)
narrower: Cobre (Metais)
narrower: Ferro (Metais)
narrower: Ouro
narrower: Platina
narrower: Prata
narrower: Ródio
narrower: Produtos derivados do metal
related: c f7df8f72

Alumínio (Metais)
type: Concept
scope note: Metal prateado e maleável. Depois de transformado é muito aplicado na construção civil, principalmente sob a forma de perfis. É o elemento metálico mais abundante na crosta terrestre mas a dificuldade da sua extração faz com que somente no século XIX se tenha começado a comercializar. É muito utilizado na construção civil sendo aplicado geralmente nos vãos e também como revestimento de fachadas em painéis. As ligas mais comuns são as do tipo Al-Mg-Si, que aliam uma boa resistência à corrosão com uma boa resistência à tração, facilidade de extrusão e de soldadura. O alumínio começou a ser utilizado como material para vãos exteriores a partir dos anos 50. No início do fabrico, o alumínio não recebia qualquer tipo de acabamento após a sua extrusão, originando corrosão. O alumínio e as suas ligas (magnésio ou manganésio) têm alguma resistência à corrosão devido ao óxido (alumina) que se forma na sua superfície. Esta película fina forma-se quando uma superfície é cortada e exposta ao contacto com o ar. Quando realizada por processos artificiais, como a anodização, a película é mais espessa e oferece uma excelente proteção à corrosão. A maior parte do alumínio produzido atualmente é extraído da bauxite (hidrato natural de alumínio e ferro descoberto em Baux (França), é o minério mais importante do alumínio). Além deste, o único minério que serve de matéria-prima para o metal é a nefelina, um silicato de sódio, potássio e alumínio. Uma das características mais importantes do alumínio é o seu baixo peso específico (2,7g.cm-3, contra 7,8 g.cm-3 para o aço e 8,8 g.cm-3 para o cobre) mas, como apresenta uma fraca resistência mecânica, não pode competir com os aços em estruturas sujeitas a grandes esforços.
in scheme: Tesauro SIPA
preferred label: Aluminium (Metals) @en
preferred label: Aluminium (Métaux) @fr
preferred label: Aluminio (Metalli) @it
broader: Metais (Materiais e produtos inorgânicos)

Amianto
type: Concept
in scheme: Tesauro SIPA
preferred label: Abestos @en
preferred label: Amiante @fr
broader: Metais (Materiais e produtos inorgânicos)

Arame
type: Concept
in scheme: Tesauro SIPA
preferred label: Wire @en
preferred label: Fil de fer @fr
preferred label: Filo @it
broader: Metais (Materiais e produtos inorgânicos)

Chumbo (Metais)
type: Concept
scope note: Metal cinzento prateado que funde aos 327ºC. A superfície do metal, brilhante quando fundida, escurece rapidamente quando entra em contacto com o ar. A sua grande maleabilidade possibilita a técnica de repuxar, mas a fraca resistência e o peso do material não permitem adelgaçá-lo muito.
in scheme: Tesauro SIPA
preferred label: Lead @en
preferred label: Plomb @fr
preferred label: Piombo @it
broader: Metais (Materiais e produtos inorgânicos)
narrower: Litargírio

Litargírio
type: Concept
in scheme: Tesauro SIPA
preferred label: Litharge @en
preferred label: Litargirio @it
alternative label: Fezes de ouro
broader: Chumbo (Metais)

Cobre (Metais)
type: Concept
scope note: Metal de coloração avermelhada, dúctil e maleável, bom condutor de eletricidade e com variadas aplicações na construção civil, devido à elevada condutibilidade elétrica e térmica, aspeto, cor, brilho e resistência à corrosão, para além de ser utilizado nas indústrias de telecomunicações, eletrónica e informática. Os fatores que condicionam o seu comportamento face à corrosão são os inerentes ao próprio metal, como a estrutura, defeitos e rugosidade. O valor médio da velocidade de corrosão do cobre em atmosfera marítima é bastante mais lenta que a dos outros metais. O cobre é um metal que, à semelhança do alumínio, tem a capacidade de formar uma película à superfície, que o protege. Esta camada protetora de produtos de corrosão, uma pátina esverdeada característica do natural envelhecimento do cobre, é constituída principalmente por sulfato básico de cobre mas, apesar de proteger o metal, não evita completamente a corrosão. A sua degradação depende da poluição do ar e da concentração de cloretos, sendo o ambiente misto (marítimo e industrial) o mais prejudicial.
in scheme: Tesauro SIPA
preferred label: Copper @en
preferred label: Cuivre @fr
preferred label: Rame @it
broader: Metais (Materiais e produtos inorgânicos)
narrower: Bronze
narrower: Latão

Bronze
type: Concept
scope note: O bronze é uma liga resultante da conjugação do cobre com o estanho. É um material muito utilizado na arquitetura, principalmente em elementos pontuais como as caixilharias. A oxidação do bronze, devida ao contacto com a atmosfera, dá-lhe uma elevada resistência à corrosão, assim como um bom efeito estético com colorações diversas. O aumento da poluição atmosférica pode levar à perda da capacidade protetora das pátinas. As pátinas formadas numa atmosfera urbana ou numa atmosfera marítima refletirão a natureza das duas atmosferas. Através de ensaios, verificam-se diferenças significativas, quer na morfologia, quer na composição das pátinas, devidas ao grau de agressividade das duas atmosferas (natureza e quantidade de poluentes e condições atmosféricas mais ou menos agressivas).
in scheme: Tesauro SIPA
preferred label: Bronzo @it
broader: Cobre (Metais)

Latão
type: Concept
scope note: O latão é uma liga resultante da conjugação do cobre com o zinco. É um material muito utilizado em ferragens e em caixilharias. É um material muito suscetível à corrosão sendo o processo mais comum a deszincificação (desaparecimento do zinco) que deixa o cobre muito poroso e com fraca resistência mecânica.
in scheme: Tesauro SIPA
preferred label: Brass @en
preferred label: Laiton @fr
preferred label: Ottone @it
broader: Cobre (Metais)

Ferro (Metais)
type: Concept
scope note: Metal branco, maleável e muito resistente, que oxida em contacto com o ar. Para o evitar, a superfície é revestida com mínio (óxido salino de chumbo conhecido como vermelhão ou zarcão).
in scheme: Tesauro SIPA
preferred label: Iron @en
preferred label: Fer @fr
preferred label: Ferro @it
broader: Metais (Materiais e produtos inorgânicos)
narrower: Aço

Aço
type: Concept
scope note: O aço é uma liga formada por vários elementos químicos, tendo o ferro e o carbono como principais componentes. Embora seja uma liga, apenas inclui um metal na sua composição, o ferro, designação pela qual é geral, e erroneamente, chamado. Existem vários tipos de aço. O termo “aço” define uma gama de ligas de ferro que engloba conteúdos de carbono entre 0,03 e 2% [4.4]. Há restrições quanto à quantidade de outros elementos na liga nos aços não ligados, geralmente menos de 2% das adições totais. A junção destes elementos não implica, em geral, grandes reduções no comportamento à corrosão. As características mecânicas não são um dado constante, já que dependem dos elementos presentes para além do carbono (manganésio, silício, fósforo, crómio, vanádio, molibdénio). As suas propriedades mecânicas (tenacidade, maleabilidade, ductilidade, soldabilidade, fragilidade e resistência) podem assim variar de modo intencional e determinante. O aço tem boas prestações em ambientes secos (atmosferas rurais), mas a taxa de corrosão aumenta rapidamente em ambiente húmidos e salinos e em atmosferas industriais. Os metais ferrosos formam durante o processo de fabrico (por oxidação a altas temperaturas) um óxido chamado “calamina”, que geralmente não se mantém intacto. Este óxido não é aderente, pois cria escamas que se soltam da superfície do metal, provocando perda de massa e deixando-o exposto e vulnerável à continuação do processo corrosivo.
in scheme: Tesauro SIPA
preferred label: Steel @en
preferred label: Acier @fr
preferred label: Acciaio @it
broader: Ferro (Metais)
narrower: Aço inoxidável

Aço inoxidável
type: Concept
scope note: Aço que contém crómio na sua composição tornando-se muito resistente aos agentes corrosivos do ambiente. O aço inoxidável é um tipo de aço que contém, pelo menos, 12% de crómio. A máxima proteção à corrosão ocorre com o aumento da percentagem de crómio que pode chegar aos 30%. Os aços inoxidáveis são resistentes à corrosão devido ao fenómeno da passividade. Não é necessário tratar quimicamente o material para que isso aconteça; os elementos de liga presentes reagem com muita facilidade com o meio ambiente e um deles em particular, o crómio, ajuda a formar uma película invisível e aderente, que protege o material da corrosão. Esta película é conhecida por “camada passiva”. A camada passiva dos aços inoxidáveis resulta da reação entre o material, a água e o oxigénio. O produto dessa reação é um oxi-hidróxido de crómio e ferro. A adição de outros elementos à liga, como o níquel, o molibdénio e o titânio, permite que o aço inoxidável seja dobrado, soldado, estampado e trabalhado de forma a poder ser utilizado nas mais variadas situações.
in scheme: Tesauro SIPA
preferred label: Stainless steel @en
preferred label: Acier inoxydable @fr
preferred label: Acciaio inossidabile @it
broader: Aço

Ouro
type: Concept
in scheme: Tesauro SIPA
preferred label: Gold @en
preferred label: Or @fr
preferred label: Oro @it
broader: Metais (Materiais e produtos inorgânicos)
narrower: Folha de ouro

Folha de ouro
type: Concept
scope note: Fina lâmina de ouro.
in scheme: Tesauro SIPA
preferred label: Gold leaf @en
preferred label: Feuille d'or @fr
preferred label: Foglia d'oro @it
broader: Ouro

Platina
type: Concept
in scheme: Tesauro SIPA
preferred label: Platine @fr
preferred label: Platino @it
preferred label: Platinum @en
broader: Metais (Materiais e produtos inorgânicos)

Prata
type: Concept
in scheme: Tesauro SIPA
preferred label: Argento @it
preferred label: Silver @en
preferred label: Argent @fr
broader: Metais (Materiais e produtos inorgânicos)
narrower: Folha de prata

Folha de prata
type: Concept
scope note: Fina lâmina de prata. Esta oxida facilmente e mostra-se enegrecida. Pode ser revestida com um verniz que lhe dá uma tonalidade de ouro pálido.
in scheme: Tesauro SIPA
preferred label: Silver leaf @en
preferred label: Feuille d’argent @fr
preferred label: Foglia d’argento @it
broader: Prata

Ródio
type: Concept
in scheme: Tesauro SIPA
preferred label: Rhodium @en
preferred label: Rodio @it
broader: Metais (Materiais e produtos inorgânicos)

Produtos derivados do metal
type: Concept
in scheme: Tesauro SIPA
preferred label: Metal-based products @en
preferred label: Produits dérivés du métal @fr
preferred label: Sottoprodotti metallici @it
broader: Metais (Materiais e produtos inorgânicos)
narrower: Escória

Escória
type: Concept
in scheme: Tesauro SIPA
preferred label: Slag @en
preferred label: Scorie @fr
preferred label: Scoria @it
broader: Produtos derivados do metal

Pedra
type: Concept
scope note: Material obtido da rocha, a massa mineral homogénea que entra na composição da crosta terrestre.
in scheme: Tesauro SIPA
preferred label: Stone @en
preferred label: Pierre @fr
preferred label: Pietra @it
broader: Materiais e produtos inorgânicos
narrower: Pedra segundo a forma
narrower: Pedra segundo a natureza e a composição
narrower: Produtos derivados da pedra
related: c 5fcef3b4
related: c fe728250
modified: 2025-09-23T13:55:51

Pedra segundo a forma
type: Concept
in scheme: Tesauro SIPA
preferred label: Stone according to shape @en
preferred label: Pierre selon la forme @fr
preferred label: Pietra secondo la forma @it
broader: Pedra
narrower: Calhau rolado
narrower: Silhar (Pedra segundo a forma)

Calhau rolado
type: Concept
in scheme: Tesauro SIPA
preferred label: Ciottolo @it
preferred label: Caillou @fr
preferred label: Pebble @en
broader: Pedra segundo a forma

Silhar (Pedra segundo a forma)
type: Concept
in scheme: Tesauro SIPA
preferred label: Ashlar (Stone according to shape) @en
preferred label: Pierre de taille (Pierre selon la forme) @fr
preferred label: Sillar (Pietra secondo la forma) @it
broader: Pedra segundo a forma
related: Alvenaria
related: Parede e muro

Pedra segundo a natureza e a composição
type: Concept
in scheme: Tesauro SIPA
preferred label: Stone according to nature and composition @en
preferred label: Pierre selon la nature et la composition @fr
preferred label: Pietra secondo la natura e la composizione @it
broader: Pedra
narrower: Ardósia
narrower: Basalto (Pedra segundo a natureza)
narrower: Calcário (Pedra segundo a natureza e a composição)
narrower: Filito (Pedra segundo a natureza)
narrower: Granito (Pedra segundo a natureza)
narrower: Mármore (Pedra)
narrower: Xisto (Pedra)

Ardósia
type: Concept
scope note: Tipo de rocha metamórfica cristalofiliana, transformada do xisto, apresentando-se em folhas de cor preta ou cinza.
in scheme: Tesauro SIPA
preferred label: Slate @en
preferred label: Ardoise @fr
preferred label: Ardesia @it
alternative label: Lousa
broader: Pedra segundo a natureza e a composição
narrower: Ardósia cinza
narrower: Ardósia cinza verde
narrower: Ardósia multicolor
narrower: Ardósia pérola
narrower: Ardósia preta
related: Filito (Pedra segundo a natureza)
related: Xisto (Pedra)
modified: 2025-09-23T13:58:33

Ardósia cinza
type: Concept
in scheme: Tesauro SIPA
preferred label: Grey slate @en
preferred label: Ardoise grise @fr
preferred label: Ardesia grigia @it
broader: Ardósia

Ardósia cinza verde
type: Concept
in scheme: Tesauro SIPA
preferred label: Greenish grey slate @en
preferred label: Ardoise grise verte @fr
preferred label: Ardesia grigia verde @it
broader: Ardósia

Ardósia multicolor
type: Concept
in scheme: Tesauro SIPA
preferred label: Multicoloured slate @en
preferred label: Ardoise multicolore @fr
preferred label: Ardesia multicolore @it
broader: Ardósia

Ardósia pérola
type: Concept
in scheme: Tesauro SIPA
preferred label: Pearl slate @en
preferred label: Ardoise perlée @fr
preferred label: Ardesia perlata @it
broader: Ardósia

Ardósia preta
type: Concept
in scheme: Tesauro SIPA
preferred label: Black slate @en
preferred label: Ardoise noire @fr
preferred label: Ardesia nera @it
broader: Ardósia

Basalto (Pedra segundo a natureza)
type: Concept
scope note: Tipo de rocha ígnea vulcânica de cor negra ou parda e de granulação fina. É composta por feldspatos cálcicos e minerais de ferro, como olivinas (silicatos de magnésio e ferro), podendo apresentar óxidos de titânio, com uma composição semelhante à do Gabro, ambos formados a partir de magmas fluidos. Utilizada na construção civil.
in scheme: Tesauro SIPA
preferred label: Basalt Stone (Stone according to nature) @en
preferred label: Basalte (Pierre selon la nature) @fr
preferred label: Basalto (Pietra secondo la natura) @it
broader: Pedra segundo a natureza e a composição
narrower: Basalto com matriz vítrea
narrower: Basalto de Ribeira Grande
narrower: Basalto malhadinho
narrower: Basalto negro
narrower: Basalto olivina

Basalto com matriz vítrea
type: Concept
in scheme: Tesauro SIPA
preferred label: Basalt with glassy matrix @en
preferred label: Basalte à matrice vitreuse @fr
preferred label: Basalto a matrice vitrea @it
broader: Basalto (Pedra segundo a natureza)

Basalto de Ribeira Grande
type: Concept
in scheme: Tesauro SIPA
preferred label: Ribeira Grande basalt @en
preferred label: Basalte de Ribeira Grande @fr
preferred label: Basalto di Ribeira Grande @it
broader: Basalto (Pedra segundo a natureza)

Basalto malhadinho
type: Concept
in scheme: Tesauro SIPA
preferred label: Spotted basalt @en
preferred label: Basalte moucheté @fr
preferred label: Basalto maculato @it
broader: Basalto (Pedra segundo a natureza)

Basalto negro
type: Concept
in scheme: Tesauro SIPA
preferred label: Black basalt @en
preferred label: Basalte noir @fr
preferred label: Basalto nero @it
broader: Basalto (Pedra segundo a natureza)

Basalto olivina
type: Concept
in scheme: Tesauro SIPA
preferred label: Olivine basalt @en
preferred label: Basalte à olivine @fr
broader: Basalto (Pedra segundo a natureza)

Calcário (Pedra segundo a natureza e a composição)
type: Concept
in scheme: Tesauro SIPA
preferred label: Limestone (Stone according to nature and composition) @en
preferred label: Calcaire (Pierre selon la nature et la composition) @fr
preferred label: Calcare (Pietra secondo la natura e la composizione) @it
broader: Pedra segundo a natureza e a composição
narrower: Brecha da Arrábida (Calcário)
narrower: Calcário branco
narrower: Calcário creme moca
narrower: Calcário de moleanos
narrower: Calcário negro
narrower: Lioz
narrower: Pedra de Ançã
related: Cal

Brecha da Arrábida (Calcário)
type: Concept
scope note: Conhecida como "mármore da Arrábida", esta pedra foi largamente utilizada na construção, passando, no séc. XV, a ser utilizada como pedra ornamental, empregue na feitura de património integrado, como pias batismais, mesas e credências. É formada por fragmentos calcários grandes e angulosos de diversas cores (branco, amarelo, vermelho, cinzento e negro), unidos por uma massa de cimentação composta de material mais fino, de matriz argilosa vermelha, particularmente vistosa após o polimento.
in scheme: Tesauro SIPA
preferred label: Arrábida breccia (Limestone) @en
preferred label: Brèche de l'Arrábida (Calcaire) @fr
preferred label: Breccia dell'Arrábida (Calcare) @it
broader: Calcário (Pedra segundo a natureza e a composição)

Calcário branco
type: Concept
in scheme: Tesauro SIPA
preferred label: White limestone @en
preferred label: Calcaire blanc @fr
preferred label: Calcare bianco @it
broader: Calcário (Pedra segundo a natureza e a composição)

Calcário creme moca
type: Concept
in scheme: Tesauro SIPA
preferred label: Cream mocha limestone @en
preferred label: Calcaire crème moka @fr
preferred label: Calcare crema moka @it
broader: Calcário (Pedra segundo a natureza e a composição)

Calcário de moleanos
type: Concept
in scheme: Tesauro SIPA
preferred label: Moleanos limestone @en
preferred label: Calcaire de Moleanos @fr
preferred label: Calcare di Moleanos @it
broader: Calcário (Pedra segundo a natureza e a composição)

Calcário negro
type: Concept
in scheme: Tesauro SIPA
preferred label: Black limestone @en
preferred label: Calcaire noir @fr
preferred label: Calcare nero @it
broader: Calcário (Pedra segundo a natureza e a composição)

Lioz
type: Concept
scope note: Variedade de calcário branco, compacto e cristalino.
in scheme: Tesauro SIPA
preferred label: Lioz (Royal stone) @en
broader: Calcário (Pedra segundo a natureza e a composição)
narrower: Lioz amarelo
narrower: Lioz azul
narrower: Lioz vermelho

Lioz amarelo
type: Concept
in scheme: Tesauro SIPA
preferred label: Yellow Lioz @en
preferred label: Lioz jaune @fr
preferred label: Lioz giallo @it
broader: Lioz

Lioz azul
type: Concept
in scheme: Tesauro SIPA
preferred label: Blue Lioz @en
preferred label: Lioz bleu @fr
preferred label: Lioz blu @it
broader: Lioz

Lioz vermelho
type: Concept
in scheme: Tesauro SIPA
preferred label: Red Lioz @en
preferred label: Lioz rouge @fr
preferred label: Lioz rosso @it
broader: Lioz

Pedra de Ançã
type: Concept
scope note: Tipo de calcário de cor clara, branco-amarelada, de granulado muito fino, compacto e homogéneo, bioclástico e calciclástico, de tendência oolítica com cimento micrítico pouco espatizado, extraído na região de Ançã, em Coimbra.
in scheme: Tesauro SIPA
preferred label: Ançã @en
broader: Calcário (Pedra segundo a natureza e a composição)

Filito (Pedra segundo a natureza)
type: Concept
scope note: Tipo de rocha que, pela sua textura, é utilizado na indústria cerâmica como fundente na fusão da massa cerâmica, aumentando a resistência mecânica dos revestimentos cerâmicos e também em alguns casos, é responsável pela cor de queima.
in scheme: Tesauro SIPA
preferred label: Phyllite (Stone according to nature) @en
preferred label: Phyllite (Pierre selon la nature) @fr
preferred label: Fillite (Pietra secondo la natura) @it
broader: Pedra segundo a natureza e a composição
related: Ardósia

Granito (Pedra segundo a natureza)
type: Concept
scope note: Tipo de rocha ígnea plutónica, cristalina, de grão fino, médio ou grosseiro, de cor negra ou mais clara, variando consoante a sua composição química. Resulta da consolidação de um magma rico em sílica, proveniente, por vezes, de uma refundição de rochas sedimentares, formada por uma mistura de quartzo, feldspato e micas, como a biotite (mica negra) e a muscovite (aluminossilicato de potássio). Os granitos negros são ricos em silicatos de ferro-magnesianos, sendo os mais claros ricos em feldspato ou quartzo. É utilizado como pedra ornamental ou em construção.
in scheme: Tesauro SIPA
preferred label: Granite Stone (Stone according to nature) @en
preferred label: Granit (Pierre selon la nature) @fr
preferred label: Granito (Pietra secondo la natura) @it
broader: Pedra segundo a natureza e a composição
narrower: Granito amarelo
narrower: Granito azul
narrower: Granito cinzento
narrower: Granito macheado
narrower: Granito preto
narrower: Granito rosa

Granito amarelo
type: Concept
in scheme: Tesauro SIPA
preferred label: Yellow granite @en
preferred label: Granit jaune @fr
preferred label: Granito giallo @it
broader: Granito (Pedra segundo a natureza)

Granito azul
type: Concept
in scheme: Tesauro SIPA
preferred label: Blue granite @en
preferred label: Granit bleu @fr
preferred label: Granito blu @it
broader: Granito (Pedra segundo a natureza)

Granito cinzento
type: Concept
in scheme: Tesauro SIPA
preferred label: Grey granite @en
preferred label: Granit gris @fr
preferred label: Granito grigio @it
broader: Granito (Pedra segundo a natureza)

Granito macheado
type: Concept
in scheme: Tesauro SIPA
preferred label: Mottled granite @en
preferred label: Granit moucheté @fr
preferred label: Granito maculato @it
broader: Granito (Pedra segundo a natureza)

Granito preto
type: Concept
in scheme: Tesauro SIPA
preferred label: Black granite @en
preferred label: Granit noir @fr
preferred label: Granito nero @it
broader: Granito (Pedra segundo a natureza)

Granito rosa
type: Concept
in scheme: Tesauro SIPA
preferred label: Pink granite @en
preferred label: Granit rose @fr
broader: Granito (Pedra segundo a natureza)

Mármore (Pedra)
type: Concept
scope note: Tipo de pedra utilizado na construção ou na estatuária, podendo ser polido.
in scheme: Tesauro SIPA
preferred label: Marble (Stone) @en
preferred label: Marbre (Pierre) @fr
preferred label: Marmo (Pietra) @it
broader: Pedra segundo a natureza e a composição
narrower: Alpinina
narrower: Azul Valverde
narrower: Brecha de Tavira
narrower: Mármore de Carrara
narrower: Mármore de Estremoz
narrower: Mármore de Moleanos
related: Intonaco marmorina

Alpinina
type: Concept
in scheme: Tesauro SIPA
preferred label: Alpinine @en
broader: Mármore (Pedra)

Azul Valverde
type: Concept
in scheme: Tesauro SIPA
preferred label: Valverde blue @en
preferred label: Bleu Valverde @fr
preferred label: Blu Valverde @it
broader: Mármore (Pedra)

Brecha de Tavira
type: Concept
in scheme: Tesauro SIPA
preferred label: Tavira breccia @en
preferred label: Brèche de Tavira @fr
preferred label: Breccia di Tavira @it
broader: Mármore (Pedra)

Mármore de Carrara
type: Concept
scope note: Tipo de mármore proveniente da região de Carrara, em Itália, que se caracteriza pelo grão fino e compacto, com uma tonalidade que pode variar entre o branco mais puro até ao branco cremoso, mantendo-se translúcido.
in scheme: Tesauro SIPA
preferred label: Carrara marble @en
preferred label: Marbre de Carrare @fr
preferred label: Marmo di Carrara @it
broader: Mármore (Pedra)

Mármore de Estremoz
type: Concept
in scheme: Tesauro SIPA
preferred label: Estremoz marble @en
preferred label: Marbre d’Estremoz @fr
preferred label: Marmo di Estremoz @it
broader: Mármore (Pedra)

Mármore de Moleanos
type: Concept
in scheme: Tesauro SIPA
preferred label: Moleanos marble @en
preferred label: Marbre de Moleanos @fr
preferred label: Marmo di Moleanos @it
broader: Mármore (Pedra)

Xisto (Pedra)
type: Concept
in scheme: Tesauro SIPA
preferred label: Schist (Stone) @en
preferred label: Schiste (Pierre) @fr
preferred label: Scisto (Pietra) @it
broader: Pedra segundo a natureza e a composição
narrower: Micaxisto
narrower: Xisto cloritico
narrower: Xisto azul
narrower: Xisto mosqueado
narrower: Xisto verde
related: Ardósia

Micaxisto
type: Concept
in scheme: Tesauro SIPA
preferred label: Mica schist @en
preferred label: Schiste micacé @fr
preferred label: Scisto micaceo @it
broader: Xisto (Pedra)

Xisto cloritico
type: Concept
in scheme: Tesauro SIPA
preferred label: Chlorite schist @en
preferred label: Schiste chloriteux @fr
preferred label: Scisto cloritico @it
broader: Xisto (Pedra)

Xisto azul
type: Concept
in scheme: Tesauro SIPA
preferred label: Blue schist @en
preferred label: Schiste bleu @fr
preferred label: Scisto blu @it
broader: Xisto (Pedra)
related: c e645d279
related: c 64b58b66
modified: 2025-09-23T13:59:20

Xisto mosqueado
type: Concept
in scheme: Tesauro SIPA
preferred label: Mottled schist @en
preferred label: Schiste moucheté @fr
preferred label: Scisto maculato @it
broader: Xisto (Pedra)

Xisto verde
type: Concept
in scheme: Tesauro SIPA
preferred label: Green schist @en
preferred label: Schiste vert @fr
preferred label: Scisto verde @it
broader: Xisto (Pedra)

Produtos derivados da pedra
type: Concept
in scheme: Tesauro SIPA
preferred label: Stone-based products @en
preferred label: Produits issus de la pierre @fr
preferred label: Prodotti derivati dalla pietra @it
broader: Pedra
narrower: Aglomerado de pedra
narrower: Brita
narrower: Cascalho
narrower: Chacota (Aglomerado de pedra)
narrower: Gravilha
narrower: Lã de rocha
narrower: Pedrisco
narrower: Pó de pedra

Aglomerado de pedra
type: Concept
scope note: Argamassa hidráulica de cimento e brita, utilizada na construção.
in scheme: Tesauro SIPA
preferred label: Stone agglomerate @en
preferred label: Agglomérat de pierre @fr
preferred label: Agglomerato di pietra @it
broader: Produtos derivados da pedra

Brita
type: Concept
scope note: Pedra partida em pequenos pedaços, utilizada na construção de pavimentos, nomeadamente em vias rodoviárias.
in scheme: Tesauro SIPA
preferred label: Ciottolo @it
preferred label: Sleet @en
preferred label: Pierre concassée @fr
broader: Produtos derivados da pedra

Cascalho
type: Concept
in scheme: Tesauro SIPA
preferred label: Rubble @en
broader: Produtos derivados da pedra

Chacota (Aglomerado de pedra)
type: Concept
in scheme: Tesauro SIPA
preferred label: Bisque (Stone agglomerate) @en
preferred label: Pâte biscuitée (Agglomérat de pierre) @fr
preferred label: Biscotto (Agglomerato di pietra) @it
broader: Produtos derivados da pedra

Gravilha
type: Concept
in scheme: Tesauro SIPA
preferred label: Gravel @en
preferred label: Gravier @fr
preferred label: Ghiaia @it
broader: Produtos derivados da pedra

Lã de rocha
type: Concept
in scheme: Tesauro SIPA
preferred label: Rockwool @en
preferred label: Lana di roccia @it
preferred label: Laine de roche/ de pierre @fr
broader: Produtos derivados da pedra

Pedrisco
type: Concept
in scheme: Tesauro SIPA
preferred label: Hail @en
preferred label: Pietrisco @it
preferred label: Caillou; Galet @fr
broader: Produtos derivados da pedra

Pó de pedra
type: Concept
in scheme: Tesauro SIPA
preferred label: Stone powder @en
broader: Produtos derivados da pedra

Vidro
type: Concept
in scheme: Tesauro SIPA
preferred label: Glass @en
preferred label: Verre @fr
preferred label: Vetro @it
broader: Materiais e produtos inorgânicos
narrower: Produtos derivados do vidro
narrower: Vidro segundo a função
narrower: Vidro segundo o tipo

Produtos derivados do vidro
type: Concept
in scheme: Tesauro SIPA
preferred label: Glass-based products @en
broader: Vidro
narrower: Lã de vidro
narrower: Ladrilho de vidro
narrower: Pastilha de vidro
narrower: Telha de vidro
narrower: Tijolo de vidro

Lã de vidro
type: Concept
in scheme: Tesauro SIPA
preferred label: Glass wool @en
preferred label: Laine de verre @fr
preferred label: Lana di vetro @it
broader: Produtos derivados do vidro

Ladrilho de vidro
type: Concept
scope note: Azulejo de parede em vidro, para aplicação em interiores. O seu acabamento pode ser colorido, metalizado ou gravado.
in scheme: Tesauro SIPA
preferred label: Moulded-glass tile @en
broader: Produtos derivados do vidro

Pastilha de vidro
type: Concept
in scheme: Tesauro SIPA
preferred label: Glass mosaic @en
broader: Produtos derivados do vidro

Telha de vidro
type: Concept
in scheme: Tesauro SIPA
preferred label: Glass tile @en
broader: Produtos derivados do vidro

Tijolo de vidro
type: Concept
in scheme: Tesauro SIPA
preferred label: Glass brick @en
broader: Produtos derivados do vidro

Vidro segundo a função
type: Concept
in scheme: Tesauro SIPA
preferred label: Glass according to funtion @en
broader: Vidro
narrower: Vidro de isolamento
narrower: Vidro de proteção

Vidro de isolamento
type: Concept
in scheme: Tesauro SIPA
preferred label: Insulating glass @en
preferred label: Verre isolant @fr
preferred label: Vetro isolante @it
broader: Vidro segundo a função
narrower: Vidro aquecido
narrower: Vidro duplo
narrower: Vidro triplo

Vidro aquecido
type: Concept
scope note: Os vidros duplos para vãos exteriores podem apresentar um revestimento de partículas metálicas na chapa interna que atua como uma resistência com ligação elétrica. Assim, o vidro interno aquece, enquanto o exterior se mantém à temperatura ambiente.
in scheme: Tesauro SIPA
preferred label: Heated glass @en
preferred label: Verre chauffé @fr
preferred label: Vetro riscaldato @it
broader: Vidro de isolamento

Vidro duplo
type: Concept
scope note: Duas chapas de vidro aplicadas num caixilho, permitindo o isolamento térmico e/ou acústico dos espaços. Vidro para aplicação exterior. É composto por duas chapas de vidro, separadas entre si por um corte térmico que impede a passagem das condições térmicas do exterior para o interior e a formação de condensação na superfície interior dos vãos. Dependendo da espessura das chapas de vidro utilizadas e do tipo de caixilho pode-se obter um isolamento acústico de até 40 dB.
in scheme: Tesauro SIPA
preferred label: Double vitrage @fr
preferred label: Doppi vetri @it
preferred label: Double-glazed glass @en
broader: Vidro de isolamento

Vidro triplo
type: Concept
in scheme: Tesauro SIPA
preferred label: Triple-glazed glass @en
preferred label: Triple vitrage @fr
preferred label: Triplo vetro @it
alternative label: Vidro termo-acústico
broader: Vidro de isolamento

Vidro de proteção
type: Concept
in scheme: Tesauro SIPA
preferred label: Protective glass @en
preferred label: Verre de protection @fr
preferred label: Vetro di protezione @it
hidden label: Vidro de protecção
broader: Vidro segundo a função
narrower: Vidro aramado
narrower: Vidro laminado
narrower: Vidro temperado

Vidro aramado
type: Concept
scope note: Vidro de segurança que apresenta no interior da chapa uma rede metálica que retém o vidro em caso de quebra, reduzindo o risco de ferimentos. É aplicado normalmente em locais, onde se necessite de uma segurança adicional em caso de quebra, tais como coberturas, guarda-corpos, portas e sacadas entre outros.
in scheme: Tesauro SIPA
preferred label: Wired glass @en
preferred label: Verre aramé @fr
preferred label: Vetro aramidico @it
broader: Vidro de proteção

Vidro laminado
type: Concept
scope note: Vidro de segurança composto por duas chapas de vidro, agregadas entre si por um filme plástico transparente, polivinil butiral (PVB). Um vidro laminado para proteção reforçada poderá ter um maior número de chapas com os respectivos filmes transparentes entre cada par. É um vidro antiferimentos que não estilhaça ao partir e impede o atravessamento de objetos.
in scheme: Tesauro SIPA
preferred label: Laminated glass @en
preferred label: Verre feuilleté @fr
preferred label: Vetro stratificato @it
broader: Vidro de proteção

Vidro temperado
type: Concept
scope note: Vidro de segurança temperado, submetido a um tratamento térmico para aumentar a sua resistência. O vidro temperado chega a ser 5 vezes mais resistente que um vidro corrente. Em caso de quebra fragmenta-se em pequenos pedaços não cortantes. Geralmente é utilizado em divisórias interiores ou exteriores.
in scheme: Tesauro SIPA
preferred label: Tempered glass @en
preferred label: Verre trempé @fr
preferred label: Vetro temperato @it
broader: Vidro de proteção

Vidro segundo o tipo
type: Concept
in scheme: Tesauro SIPA
preferred label: Glass according to type @en
preferred label: Verre selon le type @fr
preferred label: Vetro secondo la tipologia @it
broader: Vidro
narrower: Vidro biselado
narrower: Vidro colorido
narrower: Vidro com autolimpeza
narrower: Vidro de opacidade variável
narrower: Vidro despolido
narrower: Vidro espelhado
narrower: Vidro fosco
narrower: Vidro impresso
narrower: Vidro lacado
narrower: Vidro leitoso
narrower: Vidro martelado
narrower: Vidro refletido
narrower: Vidro serigrafado
narrower: Vitral (Vidro segundo o tipo)

Vidro biselado
type: Concept
scope note: Vidro com aresta rematada em cunha.
in scheme: Tesauro SIPA
preferred label: Beveled glass @en
preferred label: Verre biseauté @fr
preferred label: Vetro smussato @it
broader: Vidro segundo o tipo

Vidro colorido
type: Concept
scope note: Vidro ao qual é dada uma coloração durante o fabrico através da adição de óxidos metálicos estáveis.
in scheme: Tesauro SIPA
preferred label: Coloured glass @en
preferred label: Verre coloré @fr
preferred label: Vetro colorato @it
broader: Vidro segundo o tipo

Vidro com autolimpeza
type: Concept
scope note: Vidro que através da ação da chuva fica limpo da sujidade exterior. O vidro com autolimpeza é revestido por uma capa transparente de um material mineral hidrofílico e fotocatálico que utiliza a dupla ação do Sol e da chuva: os raios ultravioleta da luz do Sol decompõem a sujidade e a chuva elimina-as.
in scheme: Tesauro SIPA
preferred label: Auto-clean glass @en
broader: Vidro segundo o tipo

Vidro de opacidade variável
type: Concept
scope note: Vidro laminado que alterna entre transparente e opaco através da ativação de corrente elétrica. É geralmente utilizado como divisória interior por permitir privacidade imediata nos compartimentos. Entre dois vidros é aplicada uma película composta por dois filmes condutores elétricos preenchidos por cristais líquidos e polímeros. Quando a corrente elétrica está ligada as partículas ficam numa só direção deixando a luz passar e criando transparência. Quando a corrente elétrica é desligada as partículas espalham-se em várias direções, impedindo parcialmente a passagem da luz e causando opacidade.
in scheme: Tesauro SIPA
preferred label: Variable opacity glass @en
broader: Vidro segundo o tipo

Vidro despolido
type: Concept
scope note: Vidro no qual uma das faces é despolida com ácido, originando um vidro homogéneo e translúcido que difunde a luz. O seu acabamento pode ser colorido.
in scheme: Tesauro SIPA
preferred label: Ground glass @en
preferred label: Verre dépoli @fr
preferred label: Vetro smerigliato @it
broader: Vidro segundo o tipo

Vidro espelhado
type: Concept
scope note: Vidro em que sobre uma das faces é aplicada uma capa de prata ou outro metal, revestida em seguida por capas de proteção, aumentando a durabilidade do espelhado.
in scheme: Tesauro SIPA
preferred label: Mirrored glass @en
alternative label: Espelho
broader: Vidro segundo o tipo

Vidro fosco
type: Concept
scope note: Vidro tratado através da eliminação de material em uma das faces. Utilizado geralmente em interiores, a sua superfície pode ser personalizada através da gravura e foscagem de elementos decorativos.
in scheme: Tesauro SIPA
preferred label: Frosted glass @en
preferred label: Verre givré @fr
preferred label: Vetro satinato @it
broader: Vidro segundo o tipo

Vidro impresso
type: Concept
scope note: Vidro translúcido, incolor ou colorido, impresso com relevo. Aquando do fabrico, a chapa de vidro passa entre dois cilindros recebendo em uma ou em ambas as faces, a impressão de um desenho (padrão ou estampa). É um produto muito versátil, podendo ser utilizado temperado, curvado, espelhado e laminado e aplicado em janelas, portas e coberturas ou em divisórias interiores, pavimentos e degraus de escadas.
in scheme: Tesauro SIPA
preferred label: Printed glass @en
broader: Vidro segundo o tipo

Vidro lacado
type: Concept
scope note: Vidro em que na sua face inferior é aplicada uma capa lacada, obtendo-se um aspeto opaco e colorido.
in scheme: Tesauro SIPA
preferred label: Lacquered glass @en
preferred label: Verre laqué @fr
preferred label: Vetro laccato @it
broader: Vidro segundo o tipo

Vidro leitoso
type: Concept
scope note: Vidro laminado em que a película existente entre as duas chapas de vidro é opaca e de cor branco originando um vidro de cor branca leitosa.
in scheme: Tesauro SIPA
preferred label: Milk glass @en
broader: Vidro segundo o tipo

Vidro martelado
type: Concept
in scheme: Tesauro SIPA
preferred label: Hammered glass @en
preferred label: Verre martelé @fr
preferred label: Vetro martellato @it
broader: Vidro segundo o tipo

Vidro refletido
type: Concept
scope note: Vidro que reflete através da aplicação de óxidos metálicos. Os vidros refletidos recebem um tratamento com óxidos metálicos, com a finalidade de refletir os raios solares, reduzindo a entrada de calor, proporcionando ambientes mais confortáveis e economia de energia com aparelhos de ar condicionado. A privacidade dos vidros refletidos está diretamente ligada à quantidade de luz do ambiente. Estando em um ambiente menos iluminado, é possível ver através do vidro. Estando em um ambiente mais iluminado, é possível ver a reflexão da imagem, como num espelho.
in scheme: Tesauro SIPA
preferred label: Reflected glass @en
preferred label: Verre réfléchissant @fr
preferred label: Vetro riflesso @it
alternative label: Vidro metalizado
broader: Vidro segundo o tipo

Vidro serigrafado
type: Concept
in scheme: Tesauro SIPA
preferred label: Fritted glass @en
broader: Vidro segundo o tipo

Vitral (Vidro segundo o tipo)
type: Concept
scope note: Elemento que guarnece um vão, constituído por uma rede de filetes de chumbo, onde são fixadas as vidraças coloridas, constituindo, simultaneamente, o contorno das figuras que formam a composição que orna o conjunto.
in scheme: Tesauro SIPA
preferred label: Vitrail @fr
preferred label: Stained glass window @en
preferred label: Vetrata artistica @it
broader: Vidro segundo o tipo

Materiais e produtos orgânicos
type: Concept
in scheme: Tesauro SIPA
preferred label: Organic materials and products @en
preferred label: Matériaux et produits organiques @fr
preferred label: Materiali e prodotti organici @it
broader: Materiais e produtos segundo a composição
narrower: Cera
narrower: Materiais de origem animal
narrower: Materiais de origem vegetal

Cera
type: Concept
in scheme: Tesauro SIPA
preferred label: Wax @en
preferred label: Cire @fr
broader: Materiais e produtos orgânicos

Materiais de origem animal
type: Concept
in scheme: Tesauro SIPA
preferred label: Animal-based materials @en
preferred label: Matériaux d’origine animale @fr
preferred label: Materiali di origine animale @it
broader: Materiais e produtos orgânicos
narrower: Cera de abelha
narrower: Concha
narrower: Couro
narrower: Coral
narrower: Dente
narrower: Osso
narrower: Pele
narrower: Pelo
narrower: Pérola
narrower: Seda
related: c_32686101

Cera de abelha
type: Concept
in scheme: Tesauro SIPA
preferred label: Bee wax @en
preferred label: Cire d'abeille @fr
preferred label: Cera d'api @it
broader: Materiais de origem animal

Concha
type: Concept
in scheme: Tesauro SIPA
preferred label: Shell @en
preferred label: Coquille @fr
preferred label: Conchiglia @it
broader: Materiais de origem animal

Couro
type: Concept
in scheme: Tesauro SIPA
preferred label: Leather @en
preferred label: Cuir @fr
preferred label: Cuoio @it
broader: Materiais de origem animal

Coral
type: Concept
in scheme: Tesauro SIPA
preferred label: Coral (Animal-based materials) @en
preferred label: Corail (Matériaux d’origine animale) @fr
preferred label: Corallo (Materiali di origine animale) @it
broader: Materiais de origem animal
related: Gema
modified: 2025-09-23T13:59:50

Dente
type: Concept
in scheme: Tesauro SIPA
preferred label: Tooth @en
preferred label: Dent @fr
broader: Materiais de origem animal
narrower: Marfim

Marfim
type: Concept
scope note: Material ósseo, de origem animal, de cor creme ou amarelada, extraída do dente ou presa do elefante, do hipopótamo ou da morsa, utilizada para elementos escultóricos, adquirindo brilho quando polida.
in scheme: Tesauro SIPA
preferred label: Ivory @en
preferred label: Ivoire @fr
preferred label: Avorio @it
broader: Dente

Osso
type: Concept
in scheme: Tesauro SIPA
preferred label: Bone @en
preferred label: Os @fr
broader: Materiais de origem animal

Pele
type: Concept
in scheme: Tesauro SIPA
preferred label: Cuir @fr
preferred label: Pelle @it
preferred label: Skin @en
broader: Materiais de origem animal
narrower: Pergaminho

Pergaminho
type: Concept
in scheme: Tesauro SIPA
preferred label: Parchment @en
preferred label: Parchement @fr
preferred label: Pergamena @it
broader: Pele
narrower: Velino
related: c 58778b3b
modified: 2025-09-23T14:00:27

Velino
type: Concept
in scheme: Tesauro SIPA
preferred label: Vellum @en
preferred label: Vélin @fr
broader: Pergaminho

Pelo
type: Concept
in scheme: Tesauro SIPA
preferred label: Fur @en
preferred label: Poil @fr
preferred label: Pelliccia @it
broader: Materiais de origem animal
narrower: Alpaca
narrower: Lã

Alpaca
type: Concept
in scheme: Tesauro SIPA
preferred label: Alapaga @fr
broader: Pelo

Lã
type: Concept
in scheme: Tesauro SIPA
preferred label: Wool @en
preferred label: Laine @fr
preferred label: Lana @it
broader: Pelo

Pérola
type: Concept
in scheme: Tesauro SIPA
preferred label: Pearl @en
preferred label: Perle @fr
preferred label: Perla @it
broader: Materiais de origem animal
related: Gema
modified: 2025-09-23T14:01:06

Seda
type: Concept
in scheme: Tesauro SIPA
preferred label: Silk @en
preferred label: Soie @fr
preferred label: Seta @it
broader: Materiais de origem animal

Materiais de origem vegetal
type: Concept
in scheme: Tesauro SIPA
preferred label: Vegetal origin materials @en
preferred label: Matériaux d’origine végétale @fr
preferred label: Materiali di origine vegetale @it
broader: Materiais e produtos orgânicos
narrower: Açúcar
narrower: Algodão
narrower: Bambu
narrower: Cartão (Materiais de origem vegetal)
narrower: Celulose
narrower: Cera de carnaúba
narrower: Cortiça
narrower: Colmo
narrower: Folhelo
narrower: Linho
narrower: Madeira
narrower: Óleo
narrower: Palha
narrower: Papel
narrower: Papiro
narrower: Plástico
narrower: Ráfia
narrower: Resina
narrower: Sisal

Açúcar
type: Concept
in scheme: Tesauro SIPA
preferred label: Sugar @en
preferred label: Sucre @fr
preferred label: Zucchero @it
broader: Materiais de origem vegetal

Algodão
type: Concept
in scheme: Tesauro SIPA
preferred label: Cotton @en
preferred label: Coton @fr
preferred label: Cotone @it
broader: Materiais de origem vegetal

Bambu
type: Concept
in scheme: Tesauro SIPA
preferred label: Bamboo @en
preferred label: Bambou @fr
preferred label: Bambù @it
broader: Materiais de origem vegetal

Cartão (Materiais de origem vegetal)
type: Concept
in scheme: Tesauro SIPA
preferred label: Carton @fr
preferred label: Cartone @it
preferred label: Cardboard @en
broader: Materiais de origem vegetal

Celulose
type: Concept
in scheme: Tesauro SIPA
preferred label: Cellulose @en
preferred label: Cellulosa @it
broader: Materiais de origem vegetal

Cera de carnaúba
type: Concept
in scheme: Tesauro SIPA
preferred label: Carnauba wax; Palm wax @en
preferred label: Cire de carnauba/ de palme @fr
preferred label: Cera de carnauba/di palma @it
broader: Materiais de origem vegetal

Cortiça
type: Concept
in scheme: Tesauro SIPA
preferred label: Cork @en
preferred label: Liège @fr
preferred label: Sughero @it
broader: Materiais de origem vegetal

Colmo
type: Concept
in scheme: Tesauro SIPA
preferred label: Stem @en
preferred label: Chaume @fr
preferred label: Palma @it
broader: Materiais de origem vegetal
narrower: Colmo de centeio

Colmo de centeio
type: Concept
in scheme: Tesauro SIPA
preferred label: Rye stem @en
broader: Colmo

Folhelo
type: Concept
in scheme: Tesauro SIPA
preferred label: Husk @en
broader: Materiais de origem vegetal

Linho
type: Concept
in scheme: Tesauro SIPA
preferred label: Linen @en
preferred label: Lin @fr
preferred label: Lino @it
broader: Materiais de origem vegetal

Madeira
type: Concept
scope note: Material obtido da casca e tronco das árvores, utilizável em carpintaria, marcenaria, entalhe e escultura. Só a parte central (o burame) é usada nos processos escultóricos de entalhe.
in scheme: Tesauro SIPA
preferred label: Wood @en
preferred label: Bois @fr
preferred label: Legname @it
broader: Materiais de origem vegetal
narrower: Borne
narrower: Cerne
narrower: Madeira segundo o grau de dureza
narrower: Produtos derivados da madeira
related: c 2a059c3a
related: c 8383564a
modified: 2025-09-23T14:01:33

Borne
type: Concept
scope note: O borne caracteriza-se por ser a zona periférica de um toro de madeira. O toro de madeira divide-se entre o cerne e o borne. O borne é a zona com menor durabilidade, mas maior facilidade de impregnação por produtos preservadores. É normalmente identificável pela coloração mais clara que a da madeira do cerne. A utilização de madeira com uma percentagem elevada de borne sem tratamento pode ocasionar problemas, mas é inevitável no caso das resinosas. No caso das folhosas, que têm uma pequena percentagem de borne, este deve ser totalmente eliminado.
in scheme: Tesauro SIPA
preferred label: Sapwood @en
preferred label: Aubier @fr
preferred label: Alburno @it
broader: Madeira

Cerne
type: Concept
scope note: O cerne caracteriza-se por ser a zona interior de um toro de madeira. O toro de madeira divide-se entre o cerne e o borne. O cerne, parte central do tronco, geralmente só começa a formar-se a partir dos quinze anos (varia de acordo com a espécie). É a zona com madeira mais durável pois, à medida que se vai formando, os compostos químicos vão-se depositando, impedindo a entrada de água que não encontra espaço para aí se depositar. O cerne tem a cor mais viva, correspondente à coloração característica da espécie. Segundo a norma NP EN 460, nas situações de serviço onde haja um risco significativo de ataque por térmitas ou por xilófagos marinhos, somente o cerne das espécies de madeira, que é classificado na EN 350-2 como “durável” (D) ou “moderadamente durável” (M) em relação ao ataque por térmitas ou por xilófagos marinhos, pode ser utilizado sem tratamento. A escolha entre uma madeira “durável” e uma “moderadamente durável” depende das exigências definidas como, por exemplo, a função, a utilização final, a duração de serviço esperada e as consequências da rotura.
in scheme: Tesauro SIPA
preferred label: Heartwood @en
preferred label: Duramen @fr
preferred label: Durame @it
broader: Madeira

Madeira segundo o grau de dureza
type: Concept
in scheme: Tesauro SIPA
preferred label: Wood according to hardness grade @en
preferred label: Bois selon le degré de dureté @fr
preferred label: Legno per grado di durezza @it
broader: Madeira
narrower: Madeira dura
narrower: Madeira macia

Madeira dura
type: Concept
in scheme: Tesauro SIPA
preferred label: Hard wood @en
preferred label: Bois dur @fr
preferred label: Legno massello/massiccio @it
broader: Madeira segundo o grau de dureza
narrower: Castanho
narrower: Madeira de bordo

Castanho
type: Concept
scope note: Madeira proveniente do castanheiro, muito utilizada na construção, principalmente no norte do país. Encontra-se em países mediterrâneos, na América e no Japão; em Portugal, distribui-se pelo Norte e Centro, incluindo a região de Portalegre. É uma madeira de folhosa, de cor pálida ou castanha, de cerne distinto, poro em anel, textura grosseira e não uniforme, desenho venado (tem veios) e por vezes ondulado, e com anéis de crescimento bem visíveis. É dura, leve, estável, fácil de trabalhar e muito durável, e pode chegar a corroer reforços de ferro. De excelente qualidade e muito semelhante à madeira do carvalho. Apesar de ser atacada pelo caruncho, é muito usada nas construções.
in scheme: Tesauro SIPA
preferred label: Chestnut @en
preferred label: Châtaignier @fr
preferred label: Castagno @it
broader: Madeira dura

Madeira de bordo
type: Concept
in scheme: Tesauro SIPA
preferred label: Maple wood @en
broader: Madeira dura

Madeira macia
type: Concept
in scheme: Tesauro SIPA
preferred label: Soft wood @en
broader: Madeira segundo o grau de dureza
narrower: Casquinha
narrower: Tola Branca

Casquinha
type: Concept
scope note: Madeira resinosa muito utilizada na construção. É uma madeira resinosa, pálida, de desenho venado, com cerne distinto, branda, leve, fácil de trabalhar, tanto manualmente como por meios mecânicos, embora essa facilidade esteja dependente da largura média dos anéis anuais (taxa de crescimento). Cola com facilidade, recebe e fixa bem os pregos e os parafusos e pode ser pintada ou envernizada, sendo bastante durável. Através do desenrolamento de toros que sejam isentos de defeitos, obtêm-se folhas destinadas a contraplacados. A sua aplicação na construção civil é vasta, quer como madeira de toscos, quer como madeira de limpos. Para a sua utilização em exteriores, é imprescindível a aplicação de um tratamento preservador adequado. É uma madeira com mais cerne do que o pinho, pelo que absorve melhor os produtos preservadores, se necessário. A chamada “casquinha branca” não está relacionada com a casquinha verdadeira, trata-se de espruce (Picea Abeas). É uma madeira mais grosseira, em que o cerne não se distingue do borne, o toro é todo esbranquiçado, daí a designação. Não se consegue tratar e é muito atacada pelo caruncho.
in scheme: Tesauro SIPA
preferred label: Scots pine; Baltic pine @en
alternative label: Pinho de Riga
broader: Madeira macia

Tola Branca
type: Concept
scope note: Madeira clara, pouco densa e branda, muito utilizada na construção civil, em acabamentos interiores. Proveniente de uma árvore muito comum nas florestas equatoriais da África Ocidental cujos principais exportadores são o Congo, a Nigéria e Angola. É fácil de trabalhar, quer manual quer mecanicamente. Por ser pouco retráctil, ter uma elevada durabilidade natural e um comportamento mecânico satisfatório relativamente à densidade, é uma madeira que tem tido uma aplicação generalizada na construção. É muito aplicada nos trabalhos de carpintaria de limpos assim como nas indústrias de contraplacados e de mobiliário e na construção naval. Reage muito bem à colagem e recebe bem as tintas, os vernizes e o polimento, possibilitando um bom acabamento, desde que não se verifiquem posteriormente exsudações de gomas. É uma madeira que propicia a obtenção de peças de grandes dimensões sem defeitos.
in scheme: Tesauro SIPA
preferred label: Agba; White tola @en
broader: Madeira macia

Produtos derivados da madeira
type: Concept
scope note: Os produtos derivados da madeira são obtidos de desperdícios de madeira e permitem uma aplicação mais versátil e específica deste material. A transformação da madeira em derivados elimina alguns dos seus problemas, como a instabilidade dimensional e a impossibilidade de utilização de peças de grandes dimensões. Os produtos à base de madeira apresentam-se sob a forma de painéis e são geralmente classificados a partir do tipo de matéria-prima utilizada na sua produção: tábuas, folhas, partículas ou fibras. Podem ter desempenhos excelentes na faixa costeira, pois aliam o aspeto da madeira à resistência suplementar que lhes é conferida pelas colas e adesivos que são utilizados para aglomerar as partículas.
in scheme: Tesauro SIPA
preferred label: Wood-based products @en
broader: Madeira
narrower: Aglomerado
narrower: Apara de madeira
narrower: Carvão vegetal
narrower: Contraplacado
narrower: Serradura

Aglomerado
type: Concept
in scheme: Tesauro SIPA
preferred label: Chipboard; Fibreboard; Cluster @en
broader: Produtos derivados da madeira
narrower: Aglomerado de fibras
narrower: Aglomerados de partículas

Aglomerado de fibras
type: Concept
in scheme: Tesauro SIPA
preferred label: Fibreboard @en
broader: Aglomerado
narrower: Aglomerado de madeira-cimento
narrower: Painéis baquelizados

Aglomerado de madeira-cimento
type: Concept
scope note: Placas feitas a partir de fibras de madeira (20 a 25%) aglutinadas através de cimento portland (75 a 80%). As placas de aglomerado de madeira - cimento apresentam-se com várias dimensões e espessuras e não contêm amianto, formol ou sílica. As fibras de madeira ficam mineralizadas conferindo ao painel qualidades excecionais e atuando como uma armadura. É um material inalterável e resistente à humidade. Pode ser apresentado no seu aspeto natural (bruto), calibrado (lixado), ou pré-pintado com tintas de base aquosa. É um material inócuo para o meio ambiente, não é tóxico, não liberta fibras, é isento de voláteis perigosos e amianto e, com a proteção adequada, sobretudo nos topos, pode empregar-se como revestimento exterior. Este material possui um bom comportamento face a: agentes atmosféricos (dimensões praticamente inalteráveis face a variações de humidade), fogo, choque e frio (elevada resistência), fungos e insetos (deterioração praticamente nula) e som (insonorização).
in scheme: Tesauro SIPA
preferred label: Cement-bonded fibreboard @en
broader: Aglomerado de fibras

Painéis baquelizados
type: Concept
scope note: Painéis estratificados de madeira, constituídos interiormente por fibras de madeira, tratados com resinas termoendurecidas, comprimidos a altas pressões e temperaturas, que lhes conferem elevadas prestações físicas, térmicas e mecânicas, em que a camada superficial é uma folha de madeira. A aplicação de painéis baquelizados permite o aspeto de um acabamento em madeira em exteriores, sem quaisquer problemas de durabilidade, resistência e estabilidade dimensional. Estes painéis têm um processo de fabrico que os torna resistentes aos agentes atmosféricos, sem ser necessário qualquer tipo de manutenção. No entanto, como a camada superficial é constituída por madeiras nobres, as cores podem sofrer as variações naturais das madeiras.
in scheme: Tesauro SIPA
preferred label: Bakelite-based panels @en
broader: Aglomerado de fibras

Aglomerados de partículas
type: Concept
scope note: Painéis obtidos através da aglomeração de partículas de madeira a seco, com adição de um ligante (geralmente são utilizadas colas sintéticas termo-endurecíveis), seguida de aplicação de pressão e calor (em prensas de pratos quentes). Na sua constituição, podem-se incluir alguns aditivos de modo a melhorar as características das placas, tais como: catalisadores, retardadores de presa, inseticidas / fungicidas (para aumento da durabilidade) e parafina (para melhor resistência à humidade e melhoria da estabilidade dimensional).
in scheme: Tesauro SIPA
preferred label: Particle board @en
broader: Aglomerado
narrower: Aglomerados extrudidos
narrower: Aglomerados moldados

Aglomerados extrudidos
type: Concept
in scheme: Tesauro SIPA
preferred label: Extruded fibreboard @en
broader: Aglomerados de partículas

Aglomerados moldados
type: Concept
in scheme: Tesauro SIPA
preferred label: Moulded fibreboard @en
broader: Aglomerados de partículas

Apara de madeira
type: Concept
in scheme: Tesauro SIPA
preferred label: Chip; Snippet @en
broader: Produtos derivados da madeira

Carvão vegetal
type: Concept
in scheme: Tesauro SIPA
preferred label: Vegetal charcoal @en
preferred label: Charbon de bois @fr
preferred label: Carboncino @it
broader: Produtos derivados da madeira

Contraplacado
type: Concept
scope note: Os contraplacados apresentam-se sob a forma de placas que são obtidas através da colagem, a quente e sob pressão, de folhas de madeira entre si. As folhas de madeira que formam as placas de contraplacado são dispostas umas sobre as outras, com as fibras perpendicularmente em relação à folha anterior, aplicando-se sempre em número ímpar, para que a primeira e a última folha tenham as fibras na mesma direção. Esta técnica chama-se laminação cruzada e pretende conferir uma maior estabilidade dimensional e um aumento da resistência e da rigidez do painel. Os painéis de pouca espessura podem ser feitos em formas curvas. Podem-se apresentar em cru ou com uma camada final de revestimento. Os contraplacados a utilizar em exteriores deverão ter a colagem feita à base de colas fenólicas e são denominados por contraplacado marítimo.
in scheme: Tesauro SIPA
preferred label: Plywood @en
preferred label: Contreplaqué @fr
preferred label: Compensato @it
broader: Produtos derivados da madeira

Serradura
type: Concept
in scheme: Tesauro SIPA
preferred label: Sciure de bois @fr
preferred label: Segatura @it
preferred label: Sawdust; Sawmill @en
alternative label: Serrim
broader: Produtos derivados da madeira

Óleo
type: Concept
in scheme: Tesauro SIPA
preferred label: Oil @en
preferred label: Huile @fr
preferred label: Olio @it
broader: Materiais de origem vegetal
narrower: Óleo de linhaça

Óleo de linhaça
type: Concept
in scheme: Tesauro SIPA
preferred label: Huile de lin @fr
preferred label: Olio di lino @it
preferred label: Linseed oil; Flaxseed oil @en
broader: Óleo

Palha
type: Concept
in scheme: Tesauro SIPA
preferred label: Paille @fr
preferred label: Paglia @it
preferred label: Straw; Hey @en
broader: Materiais de origem vegetal

Papel
type: Concept
in scheme: Tesauro SIPA
preferred label: Paper @en
preferred label: Papier @fr
preferred label: Carta @it
broader: Materiais de origem vegetal

Papiro
type: Concept
in scheme: Tesauro SIPA
preferred label: Papyrus @en
broader: Materiais de origem vegetal

Plástico
type: Concept
in scheme: Tesauro SIPA
preferred label: Plastic @en
preferred label: Plastique @fr
preferred label: Plastica @it
broader: Materiais de origem vegetal
narrower: Plástico segundo a propriedade

Plástico segundo a propriedade
type: Concept
in scheme: Tesauro SIPA
preferred label: Plastic according to characteristics @en
broader: Plástico
narrower: Plástico termoestável
narrower: Termoplástico

Plástico termoestável
type: Concept
in scheme: Tesauro SIPA
preferred label: Heat-stable; Thermostable plastic @en
broader: Plástico segundo a propriedade
narrower: Resina epóxi

Resina epóxi
type: Concept
in scheme: Tesauro SIPA
preferred label: Epoxi resin @en
preferred label: Résine époxy @fr
preferred label: Resina epossidica @it
alternative label: Epóxi
broader: Plástico termoestável

Termoplástico
type: Concept
in scheme: Tesauro SIPA
preferred label: Thermoplastic @en
preferred label: Thermoplastique @fr
preferred label: Termoplastico @it
alternative label: Poliepóxido
broader: Plástico segundo a propriedade
narrower: Acrílico
narrower: Vinil

Acrílico
type: Concept
in scheme: Tesauro SIPA
preferred label: Acrylic @en
preferred label: Acrylique @fr
preferred label: Acrilico @it
broader: Termoplástico

Vinil
type: Concept
in scheme: Tesauro SIPA
preferred label: Vinyl @en
preferred label: Vinile @it
broader: Termoplástico
narrower: PVC

PVC
type: Concept
in scheme: Tesauro SIPA
preferred label: PVC; Polyvinyl chloride @en
broader: Vinil

Ráfia
type: Concept
in scheme: Tesauro SIPA
preferred label: Raphia @fr
preferred label: Rafia @it
preferred label: Raffia; Raphia @en
broader: Materiais de origem vegetal

Resina
type: Concept
in scheme: Tesauro SIPA
preferred label: Resin @en
preferred label: Résine @fr
broader: Materiais de origem vegetal
narrower: Borracha
narrower: Látex

Borracha
type: Concept
in scheme: Tesauro SIPA
preferred label: Rubber @en
preferred label: Gomme/ Caoutchouc @fr
preferred label: Gomma/ Caucciù @it
broader: Resina

Látex
type: Concept
in scheme: Tesauro SIPA
preferred label: Latex @en
preferred label: Lattice @it
broader: Resina

Sisal
type: Concept
in scheme: Tesauro SIPA
alternative label: Agave
alternative label: Pita
broader: Materiais de origem vegetal

Materiais e produtos segundo a função
type: Concept
in scheme: Tesauro SIPA
preferred label: Materials and products according to function @en
preferred label: Matériaux et produits selon la fonction @fr
preferred label: Materiali e prodotti secondo la funzione @it
broader: Materiais e produtos
narrower: Materiais adesivos
narrower: Materiais e produtos corantes
narrower: Materiais e produtos de acabamento, isolamento, proteção e revestimento
narrower: Materiais decorativos
narrower: Materiais fixantes
narrower: Materiais ligantes
narrower: Materiais solventes
narrower: Materiais para suporte

Materiais adesivos
type: Concept
in scheme: Tesauro SIPA
preferred label: Adhesive materials @en
preferred label: Matériaux adhésifs @fr
preferred label: Materiali adesivi @it
broader: Materiais e produtos segundo a função
narrower: Cola
narrower: Grude

Cola
type: Concept
in scheme: Tesauro SIPA
preferred label: Glue @en
preferred label: Colle @fr
preferred label: Colla @it
broader: Materiais adesivos
narrower: Cola branca

Cola branca
type: Concept
in scheme: Tesauro SIPA
preferred label: White glue @en
broader: Cola

Grude
type: Concept
in scheme: Tesauro SIPA
preferred label: Colle @fr
preferred label: Colla @it
preferred label: Goo; Glue @en
broader: Materiais adesivos

Materiais e produtos corantes
type: Concept
in scheme: Tesauro SIPA
preferred label: Dye materials and products @en
preferred label: Matériaux et produits de coloriage @fr
preferred label: Materiali e prodotti da colorare @it
broader: Materiais e produtos segundo a função
narrower: Pigmentos

Pigmentos
type: Concept
in scheme: Tesauro SIPA
preferred label: Pigments @en
preferred label: Pigmenti @it
broader: Materiais e produtos corantes
narrower: Pigmentos segundo a composição ou origem

Pigmentos segundo a composição ou origem
type: Concept
in scheme: Tesauro SIPA
preferred label: Pigments according to composition or origin @en
broader: Pigmentos
narrower: Pigmentos inorgânicos
narrower: Pigmentos orgânicos

Pigmentos inorgânicos
type: Concept
in scheme: Tesauro SIPA
preferred label: Inorganic pigments @en
preferred label: Pigments inorganiques @fr
preferred label: Pigmenti inorganici @it
broader: Pigmentos segundo a composição ou origem
narrower: Pigmentos de cádmio
narrower: Pigmentos de chumbo
narrower: Pigmentos de cobalto
narrower: Pigmentos de cobre
narrower: Pigmentos de crómio
narrower: Pigmentos de enxofre
narrower: Pigmentos de estanho
narrower: Pigmentos de ferro
narrower: Pigmentos de malaquite e azurite
narrower: Pigmentos de manganês
narrower: Pigmentos de titânio
narrower: Pigmentos de zinco

Pigmentos de cádmio
type: Concept
in scheme: Tesauro SIPA
preferred label: Cadmium pigments @en
preferred label: Pigments de cadmium @fr
preferred label: Pigmenti di cadmio @it
broader: Pigmentos inorgânicos
narrower: Amarelo de cádmio
narrower: Laranja de cádmio
narrower: Vermelho de cádmio
related: c cea5e59e
modified: 2025-09-23T14:02:05

Amarelo de cádmio
type: Concept
in scheme: Tesauro SIPA
preferred label: Cadmium yellow @en
preferred label: Jaune de cadmium @fr
preferred label: Giallo cadmio @it
broader: Pigmentos de cádmio

Laranja de cádmio
type: Concept
in scheme: Tesauro SIPA
preferred label: Cadmium orange @en
preferred label: Orange de cadmium @fr
preferred label: Arancio cadmio @it
broader: Pigmentos de cádmio

Vermelho de cádmio
type: Concept
in scheme: Tesauro SIPA
preferred label: Cadmium red @en
preferred label: Rouge de cadmium @fr
preferred label: Rosso cadmio @it
broader: Pigmentos de cádmio

Pigmentos de chumbo
type: Concept
in scheme: Tesauro SIPA
preferred label: Lead pigments @en
preferred label: Pigments de plomb @fr
preferred label: Pigmenti di piombo @it
broader: Pigmentos inorgânicos
narrower: Amarelo de chumbo-estanho
narrower: Amarelo de Nápoles
narrower: Branco de chumbo
narrower: Branco de prata
related: c e38e971c
modified: 2025-09-23T14:02:31

Amarelo de chumbo-estanho
type: Concept
in scheme: Tesauro SIPA
preferred label: Lead-tin yellow @en
broader: Pigmentos de chumbo

Amarelo de Nápoles
type: Concept
in scheme: Tesauro SIPA
preferred label: Naples yellow @en
preferred label: Jaune de Naples @fr
preferred label: Giallo napoli/ di Napoli @it
broader: Pigmentos de chumbo

Branco de chumbo
type: Concept
in scheme: Tesauro SIPA
preferred label: White lead @en
preferred label: Blanc de plomb @fr
preferred label: Bianco piombo @it
alternative label: Alvaiade
alternative label: Cerusa
broader: Pigmentos de chumbo

Branco de prata
type: Concept
in scheme: Tesauro SIPA
preferred label: White silver @en
preferred label: Blanc argenté @fr
preferred label: Bianco argento @it
broader: Pigmentos de chumbo

Pigmentos de cobalto
type: Concept
in scheme: Tesauro SIPA
preferred label: Cobalt pigments @en
preferred label: Pigments de cobalt @fr
preferred label: Pigmenti di cobalto @it
broader: Pigmentos inorgânicos
narrower: Amarelo cobalto
narrower: Azul cerúleo
narrower: Azul cerúleo-cromo
narrower: Azul cobalto
narrower: Violeta cobalto
narrower: Verde cobalto
related: c 0bd7c7f4
modified: 2025-09-23T14:06:21

Amarelo cobalto
type: Concept
in scheme: Tesauro SIPA
preferred label: Cobalt yellow @en
preferred label: Jaune cobalt @fr
preferred label: Giallo cobalto @it
alternative label: Aureolin
broader: Pigmentos de cobalto

Azul cerúleo
type: Concept
in scheme: Tesauro SIPA
preferred label: Cerulean blue @en
preferred label: Bleu céruléen @fr
preferred label: Cerulean blu @it
broader: Pigmentos de cobalto

Azul cerúleo-cromo
type: Concept
in scheme: Tesauro SIPA
preferred label: Cerulean blue- chrome @en
broader: Pigmentos de cobalto

Azul cobalto
type: Concept
in scheme: Tesauro SIPA
preferred label: Cobalt blue @en
preferred label: Bleu cobalt @fr
preferred label: Blu cobalto @it
broader: Pigmentos de cobalto

Violeta cobalto
type: Concept
in scheme: Tesauro SIPA
preferred label: Cobalt violet @en
preferred label: Violet cobalt @fr
preferred label: Viola cobalto @it
broader: Pigmentos de cobalto

Verde cobalto
type: Concept
in scheme: Tesauro SIPA
preferred label: Cobalt green @en
preferred label: Vert cobalt @fr
broader: Pigmentos de cobalto

Pigmentos de cobre
type: Concept
in scheme: Tesauro SIPA
preferred label: Copper pigments @en
preferred label: Pigments de cuivre @fr
preferred label: Pigmenti di rame @it
broader: Pigmentos inorgânicos
narrower: Óxido de cobre
narrower: Verdigris
related: c caa983dc
modified: 2025-09-23T14:06:42

Óxido de cobre
type: Concept
in scheme: Tesauro SIPA
preferred label: Copper oxide @en
preferred label: Oxyde de cuivre @fr
preferred label: Ossido di rame @it
broader: Pigmentos de cobre

Verdigris
type: Concept
in scheme: Tesauro SIPA
preferred label: Verdigris; Vert-de-gris @fr
preferred label: Verdigris; Verderame @it
broader: Pigmentos de cobre

Pigmentos de crómio
type: Concept
in scheme: Tesauro SIPA
preferred label: Chromium pigments @en
preferred label: Pigments de chrome @fr
preferred label: Pigmenti di cromo @it
broader: Pigmentos inorgânicos
narrower: Verde óxido de crómio
narrower: Viridian
related: c 79ecc43c
modified: 2025-09-23T14:07:02

Verde óxido de crómio
type: Concept
in scheme: Tesauro SIPA
preferred label: Chromium oxide green @en
preferred label: Vert oxyde de chrome @fr
preferred label: Vert ossidi di cromo @it
broader: Pigmentos de crómio

Viridian
type: Concept
in scheme: Tesauro SIPA
preferred label: Viridienne @fr
preferred label: Viridiano @it
broader: Pigmentos de crómio

Pigmentos de enxofre
type: Concept
in scheme: Tesauro SIPA
preferred label: Sulphur pigments @en
preferred label: Pigments de soufre @fr
preferred label: Pigmenti di zolfo @it
broader: Pigmentos inorgânicos
narrower: Azul ultramarino
narrower: Violeta ultramarino
related: c eac22d49
modified: 2025-09-23T14:07:30

Azul ultramarino
type: Concept
in scheme: Tesauro SIPA
preferred label: Ultramarine blue @en
preferred label: Bleu ultramarin @fr
preferred label: Blu oltremare @it
broader: Pigmentos de enxofre

Violeta ultramarino
type: Concept
in scheme: Tesauro SIPA
preferred label: Ultramarine violet @en
preferred label: Violet ultramarine @fr
preferred label: Viola ultramarina @it
broader: Pigmentos de enxofre

Pigmentos de estanho
type: Concept
in scheme: Tesauro SIPA
preferred label: Tin pigments @en
preferred label: Pigments d'étain @fr
preferred label: Pigmenti di stagno @it
broader: Pigmentos inorgânicos
narrower: Ouro musivo
narrower: Óxido de estanho
related: c 559f0bfc
modified: 2025-09-23T14:08:15

Ouro musivo
type: Concept
in scheme: Tesauro SIPA
preferred label: Or musqué @fr
preferred label: Oro muschiato @it
preferred label: Orpiment; Mosaic gold @en
broader: Pigmentos de estanho

Óxido de estanho
type: Concept
in scheme: Tesauro SIPA
preferred label: Tin oxide @en
preferred label: Oxyde d’étain @fr
preferred label: Ossido di stagno @it
broader: Pigmentos de estanho

Pigmentos de ferro
type: Concept
in scheme: Tesauro SIPA
preferred label: Iron pigments @en
preferred label: Pigments de fer @fr
preferred label: Pigmenti di ferro @it
broader: Pigmentos inorgânicos
narrower: Amarelo ocre
narrower: Azul da Prússia
narrower: Óxido férrico
narrower: Sena natural
narrower: Sena queimada
narrower: Sombra natural
narrower: Sombra queimada
narrower: Terra verte
narrower: Vermelho indiano
related: c e011dd84
modified: 2025-09-23T14:08:57

Amarelo ocre
type: Concept
in scheme: Tesauro SIPA
preferred label: Yellow ocher @en
preferred label: Jaune ocre @fr
preferred label: Gialo ocra @it
broader: Pigmentos de ferro

Azul da Prússia
type: Concept
in scheme: Tesauro SIPA
preferred label: Prussian blue @en
preferred label: Bleu de Prusse @fr
preferred label: Blu di Prussia @it
alternative label: Azul Paris
broader: Pigmentos de ferro

Óxido férrico
type: Concept
in scheme: Tesauro SIPA
preferred label: Ferric oxide @en
preferred label: Oxyde ferrique @fr
preferred label: Ossido ferrico @it
broader: Pigmentos de ferro

Sena natural
type: Concept
in scheme: Tesauro SIPA
preferred label: Raw Siena @en
broader: Pigmentos de ferro

Sena queimada
type: Concept
in scheme: Tesauro SIPA
preferred label: Burnt Siena @en
broader: Pigmentos de ferro

Sombra natural
type: Concept
in scheme: Tesauro SIPA
preferred label: Natural shade @en
preferred label: Ombre naturelle @fr
preferred label: Ombra naturale @it
broader: Pigmentos de ferro

Sombra queimada
type: Concept
in scheme: Tesauro SIPA
preferred label: Burnt shade @en
preferred label: Ombre brûlée @fr
preferred label: Ombra bruciata @it
broader: Pigmentos de ferro

Terra verte
type: Concept
in scheme: Tesauro SIPA
broader: Pigmentos de ferro

Vermelho indiano
type: Concept
in scheme: Tesauro SIPA
preferred label: Indian red @en
preferred label: Rouge indien @fr
preferred label: Rosso indiano @it
alternative label: Vermelho de Veneza
broader: Pigmentos de ferro

Pigmentos de malaquite e azurite
type: Concept
in scheme: Tesauro SIPA
preferred label: Malachite and azurite pigments @en
preferred label: Pigments de malachite et d'azurite @fr
preferred label: Pigmenti di malachite e di azzurrite @it
broader: Pigmentos inorgânicos
narrower: Verde azulado

Verde azulado
type: Concept
in scheme: Tesauro SIPA
preferred label: Bluish-green (Malachite and azurite) @en
preferred label: Vert bleuâtre (malachite et azurite) @fr
preferred label: Verde bluastro (malachite e azzurrite) @it
broader: Pigmentos de malaquite e azurite

Pigmentos de manganês
type: Concept
in scheme: Tesauro SIPA
preferred label: Manganese pigments @en
preferred label: Pigments de manganèse @fr
preferred label: Pigmenti di manganese @it
broader: Pigmentos inorgânicos
narrower: Azul manganês
narrower: Roxo manganês
related: c 4a4221f4
modified: 2025-09-23T14:09:22

Azul manganês
type: Concept
in scheme: Tesauro SIPA
preferred label: Manganese blue @en
preferred label: Bleu manganèse @fr
preferred label: Blu manganese @it
broader: Pigmentos de manganês

Roxo manganês
type: Concept
in scheme: Tesauro SIPA
preferred label: Manganese purple @en
preferred label: Violet / Pourpre manganèse @fr
preferred label: Viola/ Porpora manganese @it
broader: Pigmentos de manganês

Pigmentos de titânio
type: Concept
in scheme: Tesauro SIPA
preferred label: Titanium pigments @en
preferred label: Pigments de titane @fr
preferred label: Pigmenti di titanio @it
broader: Pigmentos inorgânicos
narrower: Amarelo de níquel-titânio
narrower: Branco de titânio
related: c d8e9c107
modified: 2025-09-23T14:09:49

Amarelo de níquel-titânio
type: Concept
in scheme: Tesauro SIPA
preferred label: Nickel-titanium yellow @en
preferred label: Jaune nickel-titane @fr
preferred label: Gialo nichel-totanio @it
broader: Pigmentos de titânio

Branco de titânio
type: Concept
in scheme: Tesauro SIPA
preferred label: Titanium white @en
preferred label: Blanc titane @fr
preferred label: Bianco titanio @it
broader: Pigmentos de titânio

Pigmentos de zinco
type: Concept
in scheme: Tesauro SIPA
preferred label: Zinc pigment @en
preferred label: Pigments de zinc @fr
preferred label: Pigmenti di zinco @it
broader: Pigmentos inorgânicos
narrower: Branco de zinco

Branco de zinco
type: Concept
in scheme: Tesauro SIPA
preferred label: White zinc @en
preferred label: Blanc zinc @fr
preferred label: Bianco di zinco @it
broader: Pigmentos de zinco

Pigmentos orgânicos
type: Concept
in scheme: Tesauro SIPA
preferred label: Organic pigments @en
preferred label: Pigments organiques @fr
preferred label: Pigmenti organici @it
broader: Pigmentos segundo a composição ou origem
narrower: Pigmentos orgânicos de origem animal
narrower: Pigmentos orgânicos de origem vegetal
narrower: Pigmentos orgânicos sintéticos

Pigmentos orgânicos de origem animal
type: Concept
in scheme: Tesauro SIPA
preferred label: Organic pigments of animal origin @en
preferred label: Pigments organiques d'origine animale @fr
preferred label: Pigmenti organici di origine animale @it
broader: Pigmentos orgânicos
narrower: Carmim
narrower: Cochonilha
narrower: Goma-laca
narrower: Laca de Quermes
narrower: Murex

Carmim
type: Concept
in scheme: Tesauro SIPA
preferred label: Carmin @fr
preferred label: Carmine; Crimson @en
preferred label: Carminio/ Cremisi @it
broader: Pigmentos orgânicos de origem animal

Cochonilha
type: Concept
scope note: Inseto de que se estrai uma tinta escarlate, utilizada na pintura durante a Idade Média.
in scheme: Tesauro SIPA
preferred label: Cochineal @en
preferred label: Cochenille @fr
preferred label: Cocciniglia @it
alternative label: Cochonila
alternative label: Coconilha
broader: Pigmentos orgânicos de origem animal

Goma-laca
type: Concept
in scheme: Tesauro SIPA
preferred label: Shellac @en
preferred label: Gomme-laque @fr
preferred label: Gommalacca @it
alternative label: Lacra
alternative label: Laca indiana
broader: Pigmentos orgânicos de origem animal

Laca de Quermes
type: Concept
in scheme: Tesauro SIPA
preferred label: Kermes dye @en
alternative label: Grã
alternative label: Quermes
broader: Pigmentos orgânicos de origem animal

Murex
type: Concept
in scheme: Tesauro SIPA
broader: Pigmentos orgânicos de origem animal

Pigmentos orgânicos de origem vegetal
type: Concept
in scheme: Tesauro SIPA
preferred label: Organic pigments of vegetal origin @en
preferred label: Pigments organiques d’origine végétale @fr
preferred label: Pigmenti organici di origine vegetale @it
broader: Pigmentos orgânicos
narrower: Pigmentos orgânicos de origem vegetal segundo a cor

Pigmentos orgânicos de origem vegetal segundo a cor
type: Concept
in scheme: Tesauro SIPA
preferred label: Organic pigments of vegetal origin according to colour @en
broader: Pigmentos orgânicos de origem vegetal
narrower: Pigmentos amarelos
narrower: Pigmentos azuis
narrower: Pigmentos verdes
narrower: Pigmentos vermelhos

Pigmentos amarelos
type: Concept
in scheme: Tesauro SIPA
preferred label: Yellow pigments @en
preferred label: Pigments jaunes @fr
preferred label: Pigmenti gialli @it
broader: Pigmentos orgânicos de origem vegetal segundo a cor
narrower: Açafrão
narrower: Fustete
narrower: Giesta-dos-tintureiros
narrower: Lírio-dos-tintureiros

Açafrão
type: Concept
in scheme: Tesauro SIPA
preferred label: Saffron @fr
preferred label: Zafferano @it
preferred label: Saffron; Crocus @en
alternative label: Crocus sativus
broader: Pigmentos amarelos

Fustete
type: Concept
in scheme: Tesauro SIPA
preferred label: Thorn plum @en
preferred label: Fustet @fr
preferred label: Sommacco @it
broader: Pigmentos amarelos

Giesta-dos-tintureiros
type: Concept
in scheme: Tesauro SIPA
preferred label: Dyer ‘s greenweed @en
alternative label: Genista tinctorum
broader: Pigmentos amarelos

Lírio-dos-tintureiros
type: Concept
in scheme: Tesauro SIPA
preferred label: Dyer’s rocker weed; Yellow weed @en
alternative label: Gauda
alternative label: Gonda
alternative label: Reseda luteola
broader: Pigmentos amarelos

Pigmentos azuis
type: Concept
in scheme: Tesauro SIPA
preferred label: Blue pigments @en
preferred label: Pigments bleus @fr
preferred label: Pigmenti blu @it
broader: Pigmentos orgânicos de origem vegetal segundo a cor
narrower: Pastel-dos-tintureiros

Pastel-dos-tintureiros
type: Concept
in scheme: Tesauro SIPA
preferred label: Pastel d'Isatis tinctoria @fr
preferred label: Dyer’s woad; Glastum @en
preferred label: Lana di tintura @it
alternative label: Anileira
alternative label: Índigo
alternative label: Isatis tinctória
broader: Pigmentos azuis

Pigmentos verdes
type: Concept
in scheme: Tesauro SIPA
preferred label: Green pigments @en
preferred label: Pigments verts @fr
preferred label: Pigmenti verdi @it
broader: Pigmentos orgânicos de origem vegetal segundo a cor
narrower: Verde-de-espinheiro
narrower: Verde-de-íris

Verde-de-espinheiro
type: Concept
in scheme: Tesauro SIPA
preferred label: Aubépine @fr
preferred label: Common hawthorn; Mayblossom; Motherdie @en
preferred label: Biancospino/ Fiordimaggio @it
broader: Pigmentos verdes

Verde-de-íris
type: Concept
in scheme: Tesauro SIPA
preferred label: Iris green @en
preferred label: Vert d'iris @fr
preferred label: Verde iris @it
broader: Pigmentos verdes

Pigmentos vermelhos
type: Concept
in scheme: Tesauro SIPA
preferred label: Red pigments @en
preferred label: Pigments rouges @fr
preferred label: Pigmenti rossi @it
broader: Pigmentos orgânicos de origem vegetal segundo a cor
narrower: Açafrão-bastardo
narrower: Brasil
narrower: Folium
narrower: Garança
narrower: Pau-brasil
narrower: Urzela
narrower: Vermelho Sangue de Dragão

Açafrão-bastardo
type: Concept
in scheme: Tesauro SIPA
preferred label: Safflower @en
preferred label: Safran @fr
preferred label: Zafferano-bastardo @it
alternative label: Carthamus tinctorus
broader: Pigmentos vermelhos

Brasil
type: Concept
in scheme: Tesauro SIPA
preferred label: Brasil (Pigments) @en
preferred label: Brésil (Pigments) @fr
preferred label: Brasile (Pigmenti) @it
alternative label: Carmim
broader: Pigmentos vermelhos

Folium
type: Concept
in scheme: Tesauro SIPA
preferred label: Tournesol @fr
preferred label: Tursole; Folium @en
alternative label: Morella
broader: Pigmentos vermelhos

Garança
type: Concept
in scheme: Tesauro SIPA
preferred label: Garance @fr
preferred label: Rose madder; Turkey red @en
preferred label: Robbia/ Garanza @it
alternative label: Carmim
alternative label: Alizarina
alternative label: Granza
alternative label: Rubia tinctorum
alternative label: Ruiva-dos-tintureiros-da-Índia
broader: Pigmentos vermelhos

Pau-brasil
type: Concept
in scheme: Tesauro SIPA
preferred label: Bois du Brésil (Brésilette) @fr
preferred label: Brazilwood; Redwood @en
preferred label: Legno rosso del Brasile @it
broader: Pigmentos vermelhos

Urzela
type: Concept
in scheme: Tesauro SIPA
preferred label: Orchil @en
preferred label: Orseille @fr
preferred label: Oricello @it
alternative label: Roccella tinctoria
broader: Pigmentos vermelhos

Vermelho Sangue de Dragão
type: Concept
in scheme: Tesauro SIPA
preferred label: Dragon’s blood red resin @en
alternative label: Dragoeiro
broader: Pigmentos vermelhos

Pigmentos orgânicos sintéticos
type: Concept
in scheme: Tesauro SIPA
preferred label: Synthetic organic pigments @en
preferred label: Pigments organiques synthétiques @fr
preferred label: Pigmenti organici sintetici @it
hidden label: Pigmentos orgânicos sintécticos
broader: Pigmentos orgânicos
narrower: Antraquinona
narrower: Azo
narrower: Dioxazina
narrower: Ftalocianina
narrower: Isoindolina
narrower: Quinacridona
narrower: Perileno
narrower: Pirrol

Antraquinona
type: Concept
in scheme: Tesauro SIPA
preferred label: Anthraquinone @en
preferred label: Antrachinone @it
broader: Pigmentos orgânicos sintéticos

Azo
type: Concept
in scheme: Tesauro SIPA
broader: Pigmentos orgânicos sintéticos

Dioxazina
type: Concept
in scheme: Tesauro SIPA
preferred label: Dioxazine @en
preferred label: Diosazina @it
broader: Pigmentos orgânicos sintéticos

Ftalocianina
type: Concept
in scheme: Tesauro SIPA
preferred label: Phthalocyanine @en
broader: Pigmentos orgânicos sintéticos

Isoindolina
type: Concept
in scheme: Tesauro SIPA
preferred label: Isoindoline @en
alternative label: Isoindolinona
broader: Pigmentos orgânicos sintéticos

Quinacridona
type: Concept
in scheme: Tesauro SIPA
preferred label: Quinacridone @en
broader: Pigmentos orgânicos sintéticos

Perileno
type: Concept
in scheme: Tesauro SIPA
preferred label: Perylene @en
preferred label: Perylène @fr
preferred label: Perilene @it
broader: Pigmentos orgânicos sintéticos

Pirrol
type: Concept
in scheme: Tesauro SIPA
preferred label: Pyrrole @en
preferred label: Pirro @it
broader: Pigmentos orgânicos sintéticos

Materiais e produtos de acabamento, isolamento, proteção e revestimento
type: Concept
in scheme: Tesauro SIPA
preferred label: Finishing; insulation, protection and covering materials and products @en
preferred label: Matériaux et produits de finition, d'isolation, de protection et de revêtement @fr
preferred label: Materiali e prodotti di finitura, isolamento, protezione e rivestimento @it
hidden label: Materiais e produtos de acabamento, isolamento, protecção e revestimento
broader: Materiais e produtos segundo a função
narrower: Argamassa
narrower: Papel de parede
narrower: Poliestireno expandido
narrower: Poliestireno extrudido
narrower: Tela (Materiais e produtos de acabamento, isolamento, proteção e revestimento)
narrower: Tecido
narrower: Tinta
narrower: Velatura (Materiais e produtos de acabamento, isolamento, proteção e revestimento)
narrower: Verniz
narrower: Produtos de revestimento genéricos
narrower: Produtos de revestimento segundo o material

Argamassa
type: Concept
scope note: Mistura de cal, areia e água, ou cimento, areia e água, que se coloca nas juntas dos silhares, dando consistência a uma construção.
in scheme: Tesauro SIPA
preferred label: Mortar @en
preferred label: Mortiers @fr
preferred label: Mortai @it
broader: Materiais e produtos de acabamento, isolamento, proteção e revestimento
narrower: Argamassa de gesso
narrower: Argamassa de cal
narrower: Argamassa de cimento
related: c 3b722b4a

Argamassa de gesso
type: Concept
in scheme: Tesauro SIPA
preferred label: Gypsum mortar @en
broader: Argamassa

Argamassa de cal
type: Concept
scope note: Mistura de cal, areia e água, que se coloca nas juntas dos silhares, dando consistência a uma construção.
in scheme: Tesauro SIPA
preferred label: Lime mortar @en
broader: Argamassa

Argamassa de cimento
type: Concept
scope note: Mistura de cimento, areia e água, que se coloca nas juntas dos silhares, dando consistência a uma construção.
in scheme: Tesauro SIPA
preferred label: Cement mortar @en
broader: Argamassa
narrower: Opus cementicium

Opus cementicium
type: Concept
scope note: Argamassa romana, antecessora do betão, utilizada a partir do séc. II a.C., formada por cal, misturada com areia e pozolana ou pedaços de tijolo e turfa, ou mais simplesmente uma mistura de areia vulcânica com calcário e ladrilhos quebrados.
in scheme: Tesauro SIPA
preferred label: Opus caementicium @en
broader: Argamassa de cimento

Papel de parede
type: Concept
in scheme: Tesauro SIPA
preferred label: Wall paper @en
preferred label: Papier peint @fr
preferred label: Carta da parati/ Sfondo @it
broader: Materiais e produtos de acabamento, isolamento, proteção e revestimento

Poliestireno expandido
type: Concept
in scheme: Tesauro SIPA
preferred label: Expanded polystyrene @en
preferred label: Polistirene @it
preferred label: Polystyrène (Styromousse) @fr
alternative label: Esferovite
alternative label: EPS
broader: Materiais e produtos de acabamento, isolamento, proteção e revestimento

Poliestireno extrudido
type: Concept
in scheme: Tesauro SIPA
preferred label: Extruded polystrene @en
alternative label: Wallmate
alternative label: XPS
broader: Materiais e produtos de acabamento, isolamento, proteção e revestimento

Tela (Materiais e produtos de acabamento, isolamento, proteção e revestimento)
type: Concept
in scheme: Tesauro SIPA
preferred label: Mesh (Finishing; insulation, protection and covering materials and products) @en
preferred label: Écran d'isolation (Matériaux et produits de finition, d'isolation, de protection et de revêtement) @fr
preferred label: Tela impermeabile (Materiali e prodotti di finitura, isolamento, protezione e rivestimento) @it
broader: Materiais e produtos de acabamento, isolamento, proteção e revestimento
narrower: Tela betuminosa
narrower: Tela de alumínio
narrower: Tela em PVC
narrower: Tinta de borracha

Tela betuminosa
type: Concept
in scheme: Tesauro SIPA
preferred label: Bituminous mesh @en
broader: Tela (Materiais e produtos de acabamento, isolamento, proteção e revestimento)

Tela de alumínio
type: Concept
in scheme: Tesauro SIPA
preferred label: Aluminium mesh @en
broader: Tela (Materiais e produtos de acabamento, isolamento, proteção e revestimento)

Tela em PVC
type: Concept
in scheme: Tesauro SIPA
preferred label: PVC mesh @en
broader: Tela (Materiais e produtos de acabamento, isolamento, proteção e revestimento)

Tinta de borracha
type: Concept
in scheme: Tesauro SIPA
preferred label: Rubber paint @en
preferred label: Peinture en caoutchouc @fr
preferred label: Vernice gommata/ di gomma @it
broader: Tela (Materiais e produtos de acabamento, isolamento, proteção e revestimento)

Tecido
type: Concept
in scheme: Tesauro SIPA
preferred label: Fabric @en
preferred label: Tissu @fr
preferred label: Tessuto @it
broader: Materiais e produtos de acabamento, isolamento, proteção e revestimento

Tinta
type: Concept
in scheme: Tesauro SIPA
preferred label: Encre @fr
preferred label: Vernice @it
preferred label: Paint; Ink @en
broader: Materiais e produtos de acabamento, isolamento, proteção e revestimento
narrower: Tinta de água
narrower: Tinta de esmalte
narrower: Tinta de óleo

Tinta de água
type: Concept
in scheme: Tesauro SIPA
preferred label: Water-based paint @en
preferred label: Encre d'eau @fr
preferred label: Vernice all'acqua @it
broader: Tinta

Tinta de esmalte
type: Concept
in scheme: Tesauro SIPA
preferred label: Enamel paint @en
preferred label: Vernice smaltato @it
preferred label: Encre d'émail @fr
broader: Tinta

Tinta de óleo
type: Concept
in scheme: Tesauro SIPA
preferred label: Oil ink @en
preferred label: Encre à l'huile @fr
preferred label: Pastelli a olio @it
broader: Tinta

Velatura (Materiais e produtos de acabamento, isolamento, proteção e revestimento)
type: Concept
scope note: Produto de pintura que, quando aplicado sobre a madeira, pode ser totalmente absorvido pelo substrato ou formar uma película não contínua, transparente ou semitransparente, dotada de propriedades protetoras e decorativas, podendo distinguir-se o veio da madeira. As velaturas penetram na madeira, mas não formam película contínua na superfície, conferem decoração e proteção contra o desgaste e permitem uma manutenção simples. São consideradas revestimentos adequados para um grande conjunto de aplicações, em particular exteriores, graças às suas propriedades hidrorreguladoras que deixam respirar a madeira, mas a mantêm impermeável à chuva. Existem velaturas de espessura fina e velaturas de espessura média.
in scheme: Tesauro SIPA
preferred label: Glaze (Finishing; insulation, protection and covering materials and products) @en
preferred label: Teinté (Matériaux et produits de finition, d'isolation, de protection et de revêtement) @fr
preferred label: Velatura (Materiali e prodotti di finitura, isolamento, protezione e rivestimento) @it
broader: Materiais e produtos de acabamento, isolamento, proteção e revestimento

Verniz
type: Concept
scope note: Produto de pintura, composto de resinas sintéticas ou naturais, que, quando aplicado sobre a madeira, forma uma película sólida, contínua, transparente, dotada de propriedades protetoras e decorativas. Os vernizes são produtos algo dispendiosos e que, em aplicações no exterior, requerem uma manutenção mais frequente do que as tintas e as velaturas. No entanto, dos produtos de revestimento, são os que favorecem mais a madeira: não encobrem o seu veio e aprofundam a cor. Estes produtos, em condições de exposição plena, têm geralmente uma baixa durabilidade. Isto deve-se ao facto de as películas de espessura grossa terem pouca permeabilidade, podendo assim ocorrer o arranque da camada superficial da madeira, situação frequente no caso de introdução de água sob a película de verniz, a partir de topos não protegidos. Por outro lado, os raios UV passam através da película e podem branquear ou degradar a superfície da madeira subjacente, originando o destacamento do verniz. Devido a estes factores, após o aparecimento das velaturas, o uso dos vernizes decaiu. Atualmente, existem no mercado vernizes que possuem alguma permeabilidade ao vapor de água, uma vez que a sua composição é à base de solventes orgânicos ou aquosos.
in scheme: Tesauro SIPA
preferred label: Varnish @en
preferred label: Vernis @fr
preferred label: Smalto @it
broader: Materiais e produtos de acabamento, isolamento, proteção e revestimento

Produtos de revestimento genéricos
type: Concept
in scheme: Tesauro SIPA
preferred label: Generic coating products @en
preferred label: Produits de revêtement génériques @fr
preferred label: Prodotti di rivestimento generici @it
broader: Materiais e produtos de acabamento, isolamento, proteção e revestimento
narrower: Telha (Produtos de revestimento genéricos)

Telha (Produtos de revestimento genéricos)
type: Concept
scope note: Elemento empregue no revestimento de uma cobertura exterior, em cerâmica vidrada, terracota, metal, vidro, ardósia ou madeira.
in scheme: Tesauro SIPA
preferred label: Tile (Ceramic coating products) @en
preferred label: Tuile (Produits de revêtement génériques) @fr
preferred label: Tegola (Prodotti di rivestimento generici) @it
broader: Produtos de revestimento genéricos
narrower: Telha segundo a forma
narrower: Telha segundo o material

Telha segundo a forma
type: Concept
in scheme: Tesauro SIPA
preferred label: Tile according to shape @en
preferred label: Tuile selon la forme @fr
preferred label: Tegola secondo la forma @it
broader: Telha (Produtos de revestimento genéricos)
narrower: Telha de aba e canudo
narrower: Telha de canudo
narrower: Telha decorativa
narrower: Telha Marselha
narrower: Telha plana

Telha de aba e canudo
type: Concept
scope note: Telha composta por um canudo hemisférico e por um elemento horizontal, onde encaixa a que lhe fica imediata.
in scheme: Tesauro SIPA
preferred label: Flap and straw tile @en
broader: Telha segundo a forma

Telha de canudo
type: Concept
scope note: Telha com forma hemisférica, colocada em fiadas alternadas côncavas e convexas. Pode apresentar-se com duas peças, o elemento côncavo (tégula) colocado sobre um elemento plano, o ímbrice.
in scheme: Tesauro SIPA
preferred label: Half-pipe tile @en
broader: Telha segundo a forma
narrower: Ímbrice
narrower: Tégula

Ímbrice
type: Concept
in scheme: Tesauro SIPA
preferred label: Imbrex @en
broader: Telha de canudo

Tégula
type: Concept
scope note: Grande telha de rebordo, utilizada nos telhados gregos e romanos.
in scheme: Tesauro SIPA
preferred label: Tegula @en
broader: Telha de canudo

Telha decorativa
type: Concept
in scheme: Tesauro SIPA
preferred label: Decorative tile @en
broader: Telha segundo a forma

Telha Marselha
type: Concept
in scheme: Tesauro SIPA
preferred label: Marseille tile @en
broader: Telha segundo a forma

Telha plana
type: Concept
in scheme: Tesauro SIPA
preferred label: Flat tile @en
broader: Telha segundo a forma

Telha segundo o material
type: Concept
in scheme: Tesauro SIPA
preferred label: Tile according to material @en
preferred label: Tuile selon le matériau @fr
preferred label: Tegola secondo il materiale @it
broader: Telha (Produtos de revestimento genéricos)
narrower: Telha de cerâmica
narrower: Telha de cimento
narrower: Telha de vidro

Telha de cerâmica
type: Concept
in scheme: Tesauro SIPA
preferred label: Ceramic tile @en
preferred label: Tuile en céramique @fr
preferred label: Tegola in ceramica @it
broader: Telha segundo o material

Telha de cimento
type: Concept
in scheme: Tesauro SIPA
preferred label: Cement/ Concrete tile @en
broader: Telha segundo o material

Telha de vidro
type: Concept
in scheme: Tesauro SIPA
preferred label: Glass tile @en
preferred label: Tuile en verre @fr
preferred label: Tegola in vetro @it
broader: Telha segundo o material

Produtos de revestimento segundo o material
type: Concept
in scheme: Tesauro SIPA
preferred label: Coating materials according to material @en
broader: Materiais e produtos de acabamento, isolamento, proteção e revestimento
narrower: Produtos de revestimento cerâmicos

Produtos de revestimento cerâmicos
type: Concept
in scheme: Tesauro SIPA
preferred label: Ceramic coating materials @en
preferred label: Matériaux de revêtement céramique @fr
preferred label: Materiali di rivestimento ceramico @it
broader: Produtos de revestimento segundo o material
narrower: Alfardon
narrower: Alicer
narrower: Azulejo
narrower: Forcada
narrower: Lambrilha
narrower: Loseta
narrower: Placa cerâmica
narrower: Tijoleira
narrower: Produtos de revestimento em cimento
related: Cerâmica
related: c fc3bd8f4
modified: 2025-09-23T14:10:34

Alfardon
type: Concept
scope note: Peça cerâmica, com decoração policroma ou não, destinada ao revestimento de pavimentos. Tem forma hexagonal e é aplicada em combinação com losetas quadradas formando composições octogonais. Este tipo de revestimento foi muito utilizado nos séculos XV e XVI em Manises (Valência/Espanha) e em Itália.
in scheme: Tesauro SIPA
preferred label: Alfardón; Alfardon @en
broader: Produtos de revestimento cerâmicos

Alicer
type: Concept
scope note: Peça cerâmica, vidrada ou não, em geral monocroma, de formas variadas e de pequenas dimensões, utilizada em revestimentos cerâmicos dos quais se referem composições em alicatado.
in scheme: Tesauro SIPA
preferred label: Tacelo @en
broader: Produtos de revestimento cerâmicos

Azulejo
type: Concept
scope note: Peça em pasta argilosa, submetida a alterações químicas, advenientes da exposição a temperaturas iguais ou superiores a 600º, que lhe conferem forte resistência física. De forma quadrada, vidrada ou não numa das faces, destina-se essencialmente ao revestimento parietal. Pode ter espessuras e dimensões variáveis, sendo que, em Portugal, entre os séculos XVI e XIX, a dimensão estabelecida fosse de 14 x 14 cm. O azulejo pode ser liso ou relevado, monocromo ou polícromo. Nas composições mais complexas, como as cenas de temática figurativa/narrativa, o tardoz (face não vidrada a aplicar na parede) é identificado com letras e números que permitem a colocação correta dos azulejos.
in scheme: Tesauro SIPA
preferred label: Ceramic tile @en
preferred label: Piastrella @it
preferred label: Carrelage @fr
broader: Produtos de revestimento cerâmicos
narrower: Azulejo segundo o contexto de aplicação
narrower: Azulejo segundo o contexto de produção
narrower: Chacota (Azulejo)
related: Processos e técnicas específicos de fabricação de cerâmica
modified: 2025-09-23T14:11:39

Azulejo segundo o contexto de aplicação
type: Concept
in scheme: Tesauro SIPA
preferred label: Tiles according to application context @en
preferred label: Carrelage selon le contexte d'application @fr
preferred label: Piastrelle secondo il contesto applicativo @it
broader: Azulejo
narrower: Azulejo de fachada
narrower: Azulejo de figura avulsa
narrower: Azulejo de padrão
narrower: Azulejo enxaquetado
narrower: Azulejo figurativo
narrower: Azulejo relevado
narrower: Azulejo tipo tapete
narrower: Figura de convite

Azulejo de fachada
type: Concept
scope note: Azulejos formando uma composição decorativa constituída pela repetição de um ou vários módulos, bastante utilizados nos revestimentos das fachadas dos edifícios, durante os séculos XIX e XX.
in scheme: Tesauro SIPA
preferred label: Façade "Azulejo" craft @en
preferred label: Carrelage de façade @fr
preferred label: Piastrella per facciate @it
broader: Azulejo segundo o contexto de aplicação

Azulejo de figura avulsa
type: Concept
scope note: Designação aplicada ao azulejo de composição autónoma. Pode ser simples - flor, fruto, animal, barco, construção - ou mais complexa: várias figuras numa paisagem, cena campestre, cena religiosa, ou qualquer outra temática. Em Portugal divulgou-se a figura avulsa mais simples, com o respetivo motivo desenhado a cor (em geral a azul) em fundo branco, pintando-se nos quatro cantos do azulejo pequenos ornatos (uma estrela, cinco pintinhas, etc.), usados como elo de ligação entre os vários azulejos. A figura avulsa mais complexa, com uma composição incluindo vários elementos, foi divulgada através da azulejaria holandesa, de execução mais minuciosa. Ambas foram utilizadas durante todo o século XVIII em revestimentos parietais, destinados sobretudo a áreas de serviço: cozinhas, copas, refeitórios ou lances de escada, embora se encontrem também em revestimentos parietais de igrejas. No século XX, o azulejo de figura avulsa é recuperado e muito utilizado durante o Estado Novo, representando figurinhas folclóricas, campestres ou elementos do quotidiano.
in scheme: Tesauro SIPA
preferred label: Isolated figure tile @en
preferred label: Carrelage à motif isolé @fr
preferred label: Piastrella con figura isolata @it
broader: Azulejo segundo o contexto de aplicação

Azulejo de padrão
type: Concept
scope note: Composição decorativa composta pela repetição de um ou vários módulos. O azulejo de padrão pode ter módulos de 2 x 2 até 16 x 16 azulejos. Foi largamente utilizado durante o século XVII e na primeira metade do século XVIII, em revestimentos parietais formando os chamados “tapetes”. No século 19 e 20 o azulejo de padrão foi utilizado como revestimento de fachadas.
in scheme: Tesauro SIPA
preferred label: Pattern "Azulejo" craft @en
preferred label: Carrelage à motifs @fr
preferred label: Piastrella con motivi @it
broader: Azulejo segundo o contexto de aplicação
narrower: Azulejo de albarradas

Azulejo de albarradas
type: Concept
scope note: Revestimento de azulejos representando motivos ornamentais em séries consecutivas, tendo como princípio a repetição dos mesmos módulos, composto por jarra ou vaso que pode ser ladeado por pássaros, figuras infantis, ou golfinhos. Utilizado como motivo decorativo autónomo no século XVII, vulgarizou-se no século XVIII, sendo aplicado em módulos repetitivos, por vezes separados uns dos outros por motivos vegetalistas ou arquitetónicos, constituindo silhares de forte efeito decorativo.
in scheme: Tesauro SIPA
preferred label: Albarrada tile @en
preferred label: Carrelage de albarrada @fr
preferred label: Piastrella di albarrada @it
broader: Azulejo de padrão

Azulejo enxaquetado
type: Concept
scope note: Técnica de composição geométrica constituída por azulejos de duas ou mais cores, utilizados alternadamente, separados por secções retangulares de azulejo, geralmente de cores lisas. Estas composições, aplicadas essencialmente em revestimentos murais, foram utilizadas em Portugal a partir de finais do século XVI até meados do século XVIII.
in scheme: Tesauro SIPA
preferred label: Checkerboard tile @en
preferred label: Carrelage enchequé @fr
preferred label: Piastrella a scacchi @it
broader: Azulejo segundo o contexto de aplicação
narrower: Azulejo enxaquetado compósito

Azulejo enxaquetado compósito
type: Concept
scope note: Técnica de composição geométrica semelhante ao enxaquetado simples, conjugando azulejos decorados, geralmente de padrão, com os azulejos lisos.
in scheme: Tesauro SIPA
preferred label: Composite checkerboard tile @en
preferred label: Carrelage enchequé composite @fr
preferred label: Piastrella a scacchi composita @it
broader: Azulejo enxaquetado

Azulejo figurativo
type: Concept
in scheme: Tesauro SIPA
preferred label: Figurative "Azulejo" @en
preferred label: Carrelage glacée figurative @fr
preferred label: Piastrelle figurative @it
broader: Azulejo segundo o contexto de aplicação
narrower: Azulejo figurativo profano
narrower: Azulejo figurativo religioso

Azulejo figurativo profano
type: Concept
in scheme: Tesauro SIPA
preferred label: Profane figurative "Azulejo" @en
preferred label: Carrelage glacée figuratif profane @fr
preferred label: Piastrelle figurative profane @it
broader: Azulejo figurativo

Azulejo figurativo religioso
type: Concept
in scheme: Tesauro SIPA
preferred label: Religious figurative "Azulejo" @en
preferred label: Carrelage glacée religieuse figurative @fr
preferred label: Piastrelle religiose figurative @it
broader: Azulejo figurativo

Azulejo relevado
type: Concept
scope note: Quadrado de barro relevado, vidrado numa das faces, policromo ou monocromo, destinado essencialmente ao revestimento parietal. Em geral, a decoração relevada é formada pela marcação de formas em volume no barro ainda cru, por meio de moldes. No azulejo hispano-mourisco destacam-se os azulejos de aresta e corda seca.
in scheme: Tesauro SIPA
preferred label: High relief "Azulejo" @en
preferred label: Carrelage glacée en relief @fr
preferred label: Piastrelle a rilievo @it
broader: Azulejo segundo o contexto de aplicação

Azulejo tipo tapete
type: Concept
scope note: Revestimento de azulejo utilizado na cobertura de vastas superfícies murais, constituído por conjuntos de azulejos de padrão delimitados por frisos, cercaduras ou barras formando molduras e formando um “tapete".
in scheme: Tesauro SIPA
preferred label: Carpet tile @en
preferred label: Carrelage de tapis @fr
preferred label: Piastrella tipo tappeto @it
broader: Azulejo segundo o contexto de aplicação

Figura de convite
type: Concept
scope note: Painel de azulejos recortados que representa uma figura humana em tamanho natural. São em geral lacaios, alabardeiros, guerreiros, fidalgos ou damas, vestidos a rigor, que, colocados nos patamares das escadas, em pátios ou átrios, geralmente integrados em silhares nos quais se destacam, parecem acolher os visitantes. Estas figuras foram produzidas nos séculos XVIII e XIX.
in scheme: Tesauro SIPA
preferred label: Invitation motif @en
preferred label: Figure d'invitation @fr
preferred label: Figura di invito @it
broader: Azulejo segundo o contexto de aplicação

Azulejo segundo o contexto de produção
type: Concept
in scheme: Tesauro SIPA
preferred label: Tile according to production context @en
preferred label: Carrelage selon le contexte de production @fr
preferred label: Piastrella secondo il contesto di produzione @it
broader: Azulejo
narrower: Azulejo holandês
narrower: Azulejo português

Azulejo holandês
type: Concept
in scheme: Tesauro SIPA
preferred label: Dutch ceramic tile works @en
preferred label: Carrelage hollandais @fr
preferred label: Piastrellatura olandese @it
broader: Azulejo segundo o contexto de produção

Azulejo português
type: Concept
in scheme: Tesauro SIPA
preferred label: Portuguese "Azulejo" craft @en
preferred label: Carrelage portugais @fr
preferred label: Piastrellatura portoghese @it
broader: Azulejo segundo o contexto de produção

Chacota (Azulejo)
type: Concept
scope note: Peça de azulejo que já teve uma primeira cozedura, mas que ainda não foi vidrado.
in scheme: Tesauro SIPA
preferred label: Biscuit tile @en
preferred label: Carrelage biscuit @fr
preferred label: Piastrella biscotto @it
broader: Azulejo

Forcada
type: Concept
scope note: Peça em pasta argilosa que, submetida a temperaturas iguais ou superiores a 600º, sofre alterações químicas, adquirindo forte resistência física. Pode ou não ser vidrada, lisa ou relevada, com ou sem decoração. Destina-se a peças de carácter funcional (pratos, chávenas e outros) ou decorativo. É igualmente utilizada em equipamentos domésticos e revestimentos de arquitetura.
in scheme: Tesauro SIPA
broader: Produtos de revestimento cerâmicos

Lambrilha
type: Concept
scope note: Quadrado cerâmico, mais pequeno que um azulejo, decorado em corda seca ou aresta e utilizado nos séculos XV e XVI para a decoração de pavimentos. Conjugava-se geralmente com placas cerâmicas lisas.
in scheme: Tesauro SIPA
preferred label: Lambrilha tile; Olambrilla @en
broader: Produtos de revestimento cerâmicos

Loseta
type: Concept
scope note: Quadrado cerâmico, decorado ou não, destinado ao revestimento de pavimentos. É utilizado juntamente com alfardons, formando conjuntos simétricos de forte impacto decorativo.
in scheme: Tesauro SIPA
preferred label: Loseta; Floor tile @en
broader: Produtos de revestimento cerâmicos

Placa cerâmica
type: Concept
scope note: Peça cerâmica de maiores dimensões do que o azulejo, de espessura e forma variáveis, composta por argila, lisa ou modelada. Pode ser decorada e vitrificada numa das faces.
in scheme: Tesauro SIPA
preferred label: Ceramic plate @en
broader: Produtos de revestimento cerâmicos

Tijoleira
type: Concept
in scheme: Tesauro SIPA
preferred label: Floor tile; Terrazzo floor @en
preferred label: Carrelage en brique @fr
preferred label: Mattonelle; Piastrella di mattoni @it
broader: Produtos de revestimento cerâmicos

Produtos de revestimento em cimento
type: Concept
in scheme: Tesauro SIPA
preferred label: Cement-based coating materials @en
preferred label: Matériaux de revêtement en ciment @fr
preferred label: Materiali di rivestimento in cemento @it
broader: Produtos de revestimento cerâmicos
narrower: Betonilha

Betonilha
type: Concept
in scheme: Tesauro SIPA
preferred label: Cement brick @en
broader: Produtos de revestimento em cimento

Materiais decorativos
type: Concept
in scheme: Tesauro SIPA
preferred label: Decorative materials @en
preferred label: Matériaux décoratifs @fr
preferred label: Materiali decorativi @it
broader: Materiais e produtos segundo a função
narrower: Estuque decorativo

Estuque decorativo
type: Concept
in scheme: Tesauro SIPA
preferred label: Plâtre décoratif @fr
preferred label: Intonaco decorativo @it
preferred label: Decorative stucco @en
broader: Materiais decorativos
related: c 3b722b4a

Materiais fixantes
type: Concept
in scheme: Tesauro SIPA
preferred label: Fixing materials @en
preferred label: Matériaux de fixation @fr
preferred label: Materiali di fissaggio @it
broader: Materiais e produtos segundo a função
narrower: Agrafo
narrower: Gato
narrower: Parafuso
narrower: Prego

Agrafo
type: Concept
in scheme: Tesauro SIPA
preferred label: Staple @en
preferred label: Agrafe @fr
preferred label: Graffetta @it
broader: Materiais fixantes

Gato
type: Concept
in scheme: Tesauro SIPA
preferred label: Cramp @en
preferred label: Crochet; Crampe @fr
preferred label: Gancio; Uncino @it
broader: Materiais fixantes

Parafuso
type: Concept
in scheme: Tesauro SIPA
preferred label: Screw; Bolt @en
preferred label: Vis; Boulon @fr
preferred label: Vite; Bulonne @it
broader: Materiais fixantes

Prego
type: Concept
in scheme: Tesauro SIPA
preferred label: Nail @en
preferred label: Clou @fr
preferred label: Chiodo; Unghia @it
broader: Materiais fixantes
narrower: Prego coutar
narrower: Prego de costado
narrower: Prego de galeota
narrower: Prego de rumo
narrower: Prego de setia
narrower: Prego palmar

Prego coutar
type: Concept
in scheme: Tesauro SIPA
preferred label: Wooden floor nail @en
broader: Prego

Prego de costado
type: Concept
in scheme: Tesauro SIPA
preferred label: Broadside nail @en
broader: Prego

Prego de galeota
type: Concept
in scheme: Tesauro SIPA
preferred label: Galiota nail @en
alternative label: Prego caibral
broader: Prego

Prego de rumo
type: Concept
in scheme: Tesauro SIPA
preferred label: Bearing nail @en
broader: Prego

Prego de setia
type: Concept
in scheme: Tesauro SIPA
preferred label: Beam nail; Setia nail; Wire nail @en
broader: Prego

Prego palmar
type: Concept
in scheme: Tesauro SIPA
preferred label: Palmar nail @en
broader: Prego

Materiais ligantes
type: Concept
in scheme: Tesauro SIPA
preferred label: Fixing materials @en
preferred label: Matériaux liants @fr
preferred label: Materiali leganti @it
broader: Materiais e produtos segundo a função

Materiais solventes
type: Concept
in scheme: Tesauro SIPA
preferred label: Solvent materials @en
preferred label: Matériaux solvants @fr
preferred label: Materiali solventi @it
broader: Materiais e produtos segundo a função
narrower: Aguarrás
narrower: Álcool
narrower: Amoníaco
narrower: Benzina
narrower: Etileno
narrower: Materiais solventes alcalinos

Aguarrás
type: Concept
in scheme: Tesauro SIPA
preferred label: Turpentine @en
preferred label: Térébenthine @fr
preferred label: Trementina/ Acquaragia @it
broader: Materiais solventes

Álcool
type: Concept
in scheme: Tesauro SIPA
preferred label: Alcohol @en
preferred label: Alcool @fr
broader: Materiais solventes
narrower: Álcool etílico
narrower: Etanol
narrower: Metanol

Álcool etílico
type: Concept
in scheme: Tesauro SIPA
preferred label: Ethyl alcohol @en
preferred label: Alcool éthylique @fr
preferred label: Alcool etilico @it
broader: Álcool

Etanol
type: Concept
in scheme: Tesauro SIPA
preferred label: Ethanol @en
preferred label: Éthanol @fr
preferred label: Etanolo @it
broader: Álcool

Metanol
type: Concept
in scheme: Tesauro SIPA
preferred label: Methanol @en
preferred label: Métanol @fr
preferred label: Metanolo @it
broader: Álcool

Amoníaco
type: Concept
in scheme: Tesauro SIPA
preferred label: Ammonia @en
preferred label: Ammoniac @fr
preferred label: Ammoniaca @it
broader: Materiais solventes

Benzina
type: Concept
in scheme: Tesauro SIPA
preferred label: Benzene @en
preferred label: Benzine @fr
broader: Materiais solventes

Etileno
type: Concept
in scheme: Tesauro SIPA
preferred label: Ethylene @en
preferred label: Éthylène @fr
preferred label: Etilene @it
broader: Materiais solventes

Materiais solventes alcalinos
type: Concept
in scheme: Tesauro SIPA
preferred label: Solvent alkaline materials @en
preferred label: Matériaux alcalins solvants @fr
preferred label: Materiali alcalini solventi @it
broader: Materiais solventes
narrower: Barrilha

Barrilha
type: Concept
in scheme: Tesauro SIPA
preferred label: Barrille @fr
preferred label: Kelp (Soda ash) @en
broader: Materiais solventes alcalinos

Materiais para suporte
type: Concept
in scheme: Tesauro SIPA
preferred label: Support materials @en
preferred label: Matériaux de support @fr
preferred label: Materiali di supporto @it
broader: Materiais e produtos segundo a função
narrower: Lápide (Materiais para suporte)
narrower: Tela (Materiais para suporte)

Lápide (Materiais para suporte)
type: Concept
in scheme: Tesauro SIPA
preferred label: Pierre tombale (Matériaux de support) @fr
preferred label: Tombstone (Support materials) @en
preferred label: Lapide (Materiali di supporto) @it
broader: Materiais para suporte

Tela (Materiais para suporte)
type: Concept
scope note: Elemento de proteção da construção contra a humidade. É utilizado como revestimento exterior contra a ação direta dos agentes atmosféricos em zonas de terraço, empenas ou isolamento de pontos sensíveis da construção (chaminés, trapeiras, telhados) ou ainda como membrana interior de isolamento para paredes ou coberturas.
in scheme: Tesauro SIPA
preferred label: Mesh (Support materials) @en
preferred label: Écran (Matériaux de support) @fr
preferred label: Telaio (Materiali di supporto) @it
broader: Materiais para suporte

OBJETOS, EQUIPAMENTOS, MOBILIÁRIO E VEÍCULOS
type: Collection
type: ConceptGroup
preferred label: OBJECTS, EQUIPMENTS, FURNITURE AND VEHICLES @en
preferred label: OBJETS, ÉQUIPEMENTS, MEUBLIER ET VÉHICULES @fr
preferred label: OGGETTI, ATTREZZATURA, MOBILI E VEICOLI @it
member: Objetos, Equipamentos, Mobiliário e Veículos
member: Equipamentos
member: Equipamentos específicos
member: Equipamentos cénicos
member: Cortina de boca
member: Cortina de boca segundo a forma de abrir
member: Cortina de boca à “polichinelo”
member: Cortina de boca de abrir para cima
member: Cortina de boca de abrir para os cantos
member: Cortina de boca de abrir para os lados
member: Cena preta
member: Bambolina
member: Bastidor
member: Fraldão
member: Fundo (Equipamentos cénicos)
member: Perna
member: Ciclorama
member: Concha acústica
member: Equipamentos de segurança
member: Cortina de segurança
member: Equipamentos mecânicos de cena
member: Malagueta
member: Palco rotativo
member: Plataforma elevatória
member: Vara (Equipamentos mecânicos de cena)
member: Vara contrapesada
member: Vara manual
member: Vara motorizada
member: Linóleo para dança
member: Praticável
member: Equipamentos de conservação e restauro
member: Mesa de higienização de documentos
member: Equipamentos de deslocar objetos
member: Guindaste
member: Guindaresa
member: Equipamentos oficinais e industriais
member: Alambique
member: Câmara frigorífica (Equipamentos oficinais e industriais)
member: Equipamentos de carpintaria e marcenaria
member: Banco de ensamblagem
member: Banco de pinchar
member: Equipamentos de corte
member: Mesa de corte
member: Mesa de corte de materiais cerâmicos
member: Equipamentos de transformação de produtos
member: Equipamentos de produção de azeite
member: Equipamentos de encapachamento
member: Seira
member: Adufa (Seira)
member: Equipamentos de moenda
member: Moinho de pedra
member: Galga
member: Moinho de martelo
member: Equipamentos de prensagem
member: Agulhão
member: Agulheira
member: Alçapremas
member: Prensa
member: Prensa de vara
member: Concha da vara
member: Fuso da vara
member: Maquinaria oficinal e industrial
member: Maquinaria oficinal e industrial específica
member: Máquinas para armazenamento
member: Tremonha
member: Máquinas para tratamento da madeira
member: Autoclave
member: Maquinaria oficinal e industrial genérica
member: Amassadeira
member: Balança industrial
member: Batedeira industrial
member: Embaladoura
member: Fatiadora industrial
member: Forno (Maquinaria oficinal e industrial genérica)

Objetos, Equipamentos, Mobiliário e Veículos
type: Concept
scope note: A hierarquia Objetos e equipamentos integra descritores que representam objetos materiais e desmaterializados de grandeza e escala variáveis - desde os complexos arquitetónicos até aos documentos ou ferramentas -, objetos esses que ora são recurso e instrumento de suporte das diversas Atividades, ora objeto das mesmas
in scheme: Tesauro SIPA
top concept of: Tesauro SIPA
preferred label: Objects, equipments, furniture and vehicles @en
preferred label: Objets, équipements, meublier et véhicules @fr
preferred label: Oggetti, attrezzatura, mobili e veicoli @it
hidden label: Objectos, Equipamentos, Mobiliário e Veículos
narrower: Equipamentos
narrower: Ferramentas e instrumentos
narrower: Mobiliário
narrower: Objetos
narrower: c c53b57f5
narrower: c 1bbed0eb
related: Atividades, eventos, fenómenos, processos e técnicas
related: Compartimentos e espaços
related: Elementos arquitetónicos
related: c 46f3f69b
related: c 65005b47
modified: 2025-09-23T14:13:31

Equipamentos
type: Concept
in scheme: Tesauro SIPA
preferred label: Equipments @en
preferred label: Équipements @fr
preferred label: Attrezzature @it
broader: Objetos, Equipamentos, Mobiliário e Veículos
narrower: Equipamentos específicos
narrower: Equipamentos genéricos

Equipamentos específicos
type: Concept
in scheme: Tesauro SIPA
preferred label: Specific equipment @en
preferred label: Équipement spécifique @fr
preferred label: Attrezzature specifiche @it
broader: Equipamentos
narrower: Equipamentos cénicos
narrower: Equipamentos de conservação e restauro
narrower: Equipamentos de deslocar objetos
narrower: Equipamentos oficinais e industriais

Equipamentos cénicos
type: Concept
in scheme: Tesauro SIPA
preferred label: Scenic equipment @en
preferred label: Équipement de scène @fr
preferred label: Attrezzatura scenica @it
broader: Equipamentos específicos
narrower: Cortina de boca
narrower: Cena preta
narrower: Ciclorama
narrower: Concha acústica
narrower: Equipamentos de segurança
narrower: Equipamentos mecânicos de cena
narrower: Linóleo para dança
narrower: Praticável

Cortina de boca
type: Concept
scope note: Primeira cortina montada e visível na caixa de palco, normalmente de montagem permanente, que permite fechar a boca de cena
in scheme: Tesauro SIPA
preferred label: Stage curtain @en
preferred label: Rideau de bouche @fr
preferred label: Tenda per la bocca @it
alternative label: Pano de boca
broader: Equipamentos cénicos
narrower: Cortina de boca segundo a forma de abrir

Cortina de boca segundo a forma de abrir
type: Concept
in scheme: Tesauro SIPA
preferred label: Stage curtain according to way of opening up @en
broader: Cortina de boca
narrower: Cortina de boca à “polichinelo”
narrower: Cortina de boca de abrir para cima
narrower: Cortina de boca de abrir para os cantos
narrower: Cortina de boca de abrir para os lados

Cortina de boca à “polichinelo”
type: Concept
scope note: Forma de abertura da primeira cortina da caixa de palco, que enrola para cima
in scheme: Tesauro SIPA
preferred label: Polichinelo-style stage curtain @en
broader: Cortina de boca segundo a forma de abrir

Cortina de boca de abrir para cima
type: Concept
scope note: Forma de abertura da primeira cortina da caixa de palco, deslizando para cima
in scheme: Tesauro SIPA
preferred label: Up-and-downers curtain (German-style stage curtain) @en
alternative label: Cortina de boca à alemã
broader: Cortina de boca segundo a forma de abrir

Cortina de boca de abrir para os cantos
type: Concept
scope note: Forma de abertura da primeira cortina da caixa de palco, que enrola a parte inferior para os lados, deixando um enquadramento central
in scheme: Tesauro SIPA
preferred label: Italian opening stage curtain @en
alternative label: Cortina de boca à italiana
broader: Cortina de boca segundo a forma de abrir

Cortina de boca de abrir para os lados
type: Concept
scope note: Forma de abertura da primeira cortina da caixa de palco, deslizando para os lados
in scheme: Tesauro SIPA
preferred label: Traveller curtain greek opening @en
alternative label: Cortina de boca à grega
broader: Cortina de boca segundo a forma de abrir

Cena preta
type: Concept
scope note: Conjunto de pernas, bambolinas e fundos que permitem ocultar do público a caixa de palco e os seus sistemas e equipamentos cénicos
in scheme: Tesauro SIPA
preferred label: Black scene @en
broader: Equipamentos cénicos
narrower: Bambolina
narrower: Bastidor
narrower: Fraldão
narrower: Fundo (Equipamentos cénicos)
narrower: Perna

Bambolina
type: Concept
scope note: Peça de pano, normalmente de cor preta, em flanela ou veludo, mais larga do que alta e com atilhos na parte superior, que se suspende em varas de um lado ao outro do palco, para ocultar os projetores e cenários suspensos em varas fora de cena
in scheme: Tesauro SIPA
preferred label: Cyclorama @en
broader: Cena preta

Bastidor
type: Concept
scope note: Peça de pano armada numa estrutura de madeira ou metal, colocada na vertical e com o lado inferior sobre o pavimento do palco. É mantido na vertical através de espias ou de escoras colocadas na face não visível pelo público
in scheme: Tesauro SIPA
preferred label: Embroidery frame (Backstage) @en
broader: Cena preta

Fraldão
type: Concept
scope note: Peça de tecido para colocação em plano longitudinal ao palco, normalmente fixo na primeira varanda esquerda e direita, configurando uma cena fechada lateralmente
in scheme: Tesauro SIPA
preferred label: Gambeson @en
broader: Cena preta

Fundo (Equipamentos cénicos)
type: Concept
in scheme: Tesauro SIPA
preferred label: Backroom @en
broader: Cena preta

Perna
type: Concept
scope note: Peça de pano, normalmente de cor preta, em flanela ou veludo, mais larga do que alta e com atilhos na parte superior, que se suspende em varas de um lado ao outro do palco, para ocultar os projetores e cenários suspensos em varas fora de cena
in scheme: Tesauro SIPA
preferred label: Theatre curtain; Stage curtain @en
broader: Cena preta

Ciclorama
type: Concept
scope note: Peça de pano armada numa estrutura de madeira ou metal, colocada na vertical e com o lado inferior sobre o pavimento do palco. É mantido na vertical através de espias ou de escoras colocadas na face não visível pelo público
in scheme: Tesauro SIPA
preferred label: Cyclorama @en
broader: Equipamentos cénicos

Concha acústica
type: Concept
scope note: Peça de tecido para colocação em plano longitudinal ao palco, normalmente fixo na primeira varanda esquerda e direita, configurando uma cena fechada lateralmente
in scheme: Tesauro SIPA
preferred label: Acoustic shell @en
broader: Equipamentos cénicos

Equipamentos de segurança
type: Concept
in scheme: Tesauro SIPA
preferred label: Safety equipment @en
preferred label: Équipement de sécurité @fr
preferred label: Attrezzature di sicurezza @it
broader: Equipamentos cénicos
narrower: Cortina de segurança

Cortina de segurança
type: Concept
scope note: Superfície plana que corre ao longo de guias verticais junto à boca de cena, permitindo a compartimentação corta-fogo entre o palco e as áreas de assistência
in scheme: Tesauro SIPA
preferred label: Safety curtain @en
preferred label: Rideau de sécurité @fr
preferred label: Tenda di sicurezza @it
alternative label: Cortina de ferro
alternative label: Pano de ferro
broader: Equipamentos de segurança

Equipamentos mecânicos de cena
type: Concept
in scheme: Tesauro SIPA
preferred label: Mechanical stage equipment @en
preferred label: Équipement mécanique de scène @fr
preferred label: Attrezzature meccaniche di scena @it
broader: Equipamentos cénicos
narrower: Malagueta
narrower: Palco rotativo
narrower: Plataforma elevatória
narrower: Vara (Equipamentos mecânicos de cena)

Malagueta
type: Concept
scope note: Elementos em forma de vara que servem para prender as cordas que sustentam os cenários, feitas de madeira ou ferro Cada uma das pequenas varas de madeira ou de ferro chanfrado nas extremidades, dispostas em série contínua nas traves da varanda, nas quais se amarram as cordas que sustentam os cenários do urdimento
in scheme: Tesauro SIPA
preferred label: Small pin rail rope system @en
broader: Equipamentos mecânicos de cena

Palco rotativo
type: Concept
scope note: Tipo de palco móvel, associado a mecanismos que permitem rápidas mudanças cénicas durante um espetáculo
in scheme: Tesauro SIPA
preferred label: Rotating stage @en
preferred label: Scène tournante @fr
preferred label: Palco rotante @it
broader: Equipamentos mecânicos de cena

Plataforma elevatória
type: Concept
in scheme: Tesauro SIPA
preferred label: Tail lift @en
preferred label: Plate-forme de levage @fr
preferred label: Piattaforma di sollevamento @it
broader: Equipamentos mecânicos de cena

Vara (Equipamentos mecânicos de cena)
type: Concept
scope note: Elemento preso ao urdimento, onde se fixam os elementos cénicos
in scheme: Tesauro SIPA
preferred label: Rod @en
broader: Equipamentos mecânicos de cena
narrower: Vara contrapesada
narrower: Vara manual
narrower: Vara motorizada

Vara contrapesada
type: Concept
in scheme: Tesauro SIPA
preferred label: Counterweight rod @en
broader: Vara (Equipamentos mecânicos de cena)

Vara manual
type: Concept
in scheme: Tesauro SIPA
preferred label: Manual counterweighing rod system @en
broader: Vara (Equipamentos mecânicos de cena)

Vara motorizada
type: Concept
in scheme: Tesauro SIPA
preferred label: Motorized counterweighing rod system @en
broader: Vara (Equipamentos mecânicos de cena)

Linóleo para dança
type: Concept
in scheme: Tesauro SIPA
preferred label: Stage linoleum @en
broader: Equipamentos cénicos

Praticável
type: Concept
in scheme: Tesauro SIPA
preferred label: Stage platform @en
preferred label: Praticable @fr
preferred label: Praticabile @it
broader: Equipamentos cénicos

Equipamentos de conservação e restauro
type: Concept
in scheme: Tesauro SIPA
preferred label: Conservation and restoration equipment @en
preferred label: Équipements de conservation et de restauration @fr
preferred label: Attrezzature per la conservazione e il restauro @it
broader: Equipamentos específicos
narrower: Mesa de higienização de documentos

Mesa de higienização de documentos
type: Concept
in scheme: Tesauro SIPA
preferred label: Document sanitising table @en
preferred label: Table de nettoyage de documents @fr
preferred label: Tavolo per la sanificazione dei documenti @it
broader: Equipamentos de conservação e restauro

Equipamentos de deslocar objetos
type: Concept
in scheme: Tesauro SIPA
preferred label: Equipment for moving objects @en
preferred label: Équipements pour déplacer des objets @fr
preferred label: Attrezzature per lo spostamento di oggetti @it
hidden label: Equipamentos de deslocar objectos
broader: Equipamentos específicos
narrower: Guindaste

Guindaste
type: Concept
in scheme: Tesauro SIPA
preferred label: Crane @en
preferred label: Grue @fr
preferred label: Gru @it
broader: Equipamentos de deslocar objetos
narrower: Guindaresa

Guindaresa
type: Concept
in scheme: Tesauro SIPA
preferred label: Crane @en
alternative label: Guinda
alternative label: Guindareta
broader: Guindaste

Equipamentos oficinais e industriais
type: Concept
in scheme: Tesauro SIPA
preferred label: Workshop and industrial equipment @en
preferred label: Atelier et équipement industriel @fr
preferred label: Attrezzature per officina e industriali @it
broader: Equipamentos específicos
narrower: Alambique
narrower: Câmara frigorífica (Equipamentos oficinais e industriais)
narrower: Equipamentos de carpintaria e marcenaria
narrower: Equipamentos de corte
narrower: Equipamentos de transformação de produtos
narrower: Maquinaria oficinal e industrial

Alambique
type: Concept
scope note: Elemento usado no processo de destilação, especialmente na produção de bebidas alcoólicas e óleos essenciais. É composto por uma caldeira onde se aquece o líquido a ser destilado, uma serpentina, onde se processa o arrefecimento do líquido, condensando os vapores, e um recipiente para coletar o produto destilado
in scheme: Tesauro SIPA
preferred label: Alembic @en
preferred label: Alambic @fr
preferred label: Alambicco @it
broader: Equipamentos oficinais e industriais

Câmara frigorífica (Equipamentos oficinais e industriais)
type: Concept
in scheme: Tesauro SIPA
preferred label: Cold room storage (Workshop and industrial equipment) @en
preferred label: Chambre froid (Atelier et équipement industriel) @fr
preferred label: Celle frigorifere (Attrezzature per officina e industriali ) @it
broader: Equipamentos oficinais e industriais

Equipamentos de carpintaria e marcenaria
type: Concept
in scheme: Tesauro SIPA
preferred label: Framework and carpentry equipment @en
preferred label: Équipement de menuiserie et d'ébénisterie @fr
preferred label: Attrezzature per carpenteria e falegnameria @it
broader: Equipamentos oficinais e industriais
narrower: Banco de ensamblagem
narrower: Banco de pinchar

Banco de ensamblagem
type: Concept
scope note: Área de trabalho onde se monta ou se encaixam componentes de um objeto, especialmente na marcenaria ou entalhe de madeira
in scheme: Tesauro SIPA
preferred label: Assembly bench @en
preferred label: Banc d'assemblage @fr
preferred label: Banco di montaggio @it
broader: Equipamentos de carpintaria e marcenaria

Banco de pinchar
type: Concept
in scheme: Tesauro SIPA
preferred label: Turning lathe machine @en
preferred label: Banc de tournage @fr
preferred label: Banco di tornitura @it
alternative label: Banco de tornear
alternative label: Banco pinchado
broader: Equipamentos de carpintaria e marcenaria

Equipamentos de corte
type: Concept
in scheme: Tesauro SIPA
preferred label: Cutting equipment @en
preferred label: Équipement de coupe @fr
preferred label: Attrezzature da taglio @it
broader: Equipamentos oficinais e industriais
narrower: Mesa de corte

Mesa de corte
type: Concept
in scheme: Tesauro SIPA
preferred label: Cutting table @en
preferred label: Table de coupe @fr
preferred label: Tavolo da taglio @it
broader: Equipamentos de corte
narrower: Mesa de corte de materiais cerâmicos

Mesa de corte de materiais cerâmicos
type: Concept
in scheme: Tesauro SIPA
preferred label: Cutting table for ceramics @en
preferred label: Table de coupe en céramique @fr
preferred label: Tavolo da taglio per ceramica @it
broader: Mesa de corte

Equipamentos de transformação de produtos
type: Concept
in scheme: Tesauro SIPA
preferred label: Product processing equipment @en
preferred label: Équipements de transformation des produits @fr
preferred label: Attrezzature per la trasformazione dei prodotti @it
broader: Equipamentos oficinais e industriais
narrower: Equipamentos de produção de azeite

Equipamentos de produção de azeite
type: Concept
in scheme: Tesauro SIPA
preferred label: Olive oil production mechanisms @en
preferred label: Mécanismes de production d'huile d'olive @fr
preferred label: Meccanismi di produzione dell’olio d’oliva @it
broader: Equipamentos de transformação de produtos
narrower: Equipamentos de encapachamento
narrower: Equipamentos de moenda
narrower: Equipamentos de prensagem

Equipamentos de encapachamento
type: Concept
in scheme: Tesauro SIPA
preferred label: Mat-packing mechanisms @en
preferred label: Mécanismes d'encapachage @fr
preferred label: Meccanismi di insaccatura con stuoie @it
broader: Equipamentos de produção de azeite
narrower: Seira

Seira
type: Concept
in scheme: Tesauro SIPA
preferred label: Mat (Seira) @en
preferred label: Scourtin (Seira) @fr
preferred label: Stuoia (Seira) @it
alternative label: Capacho
broader: Equipamentos de encapachamento
narrower: Adufa (Seira)

Adufa (Seira)
type: Concept
scope note: Tampa ou porta de forma circular em madeira que se coloca sobre as seiras, com a função de distribuir uniformemente a pressão exercida pela vara sobre as mesma
in scheme: Tesauro SIPA
preferred label: Adufa (Mat wrapper) @en
preferred label: Adufa (Gaine de scourtin) @fr
preferred label: Adufa (Rivestimento della stuoia) @it
broader: Seira

Equipamentos de moenda
type: Concept
scope note: Na generalidade, é formado por um recipiente cilíndrico designado por vasa ou pio, onde giram a(s) galga(s), e serve para moer a azeitona, transformando-a em massa
in scheme: Tesauro SIPA
preferred label: Milling mechanisms @en
preferred label: Mécanismes de mouture @fr
preferred label: Meccanismi di macinazione @it
broader: Equipamentos de produção de azeite
narrower: Moinho de pedra

Moinho de pedra
type: Concept
in scheme: Tesauro SIPA
preferred label: Stone mill @en
preferred label: Moulin en pierre @fr
preferred label: Mulino in pietra @it
broader: Equipamentos de moenda
narrower: Galga
narrower: Moinho de martelo

Galga
type: Concept
scope note: Pedra ou mó do moinho de azeite que pode ser em forma cilíndrica ou cónica e de tamanhos variáveis, estas pedras rodam sobre a azeitona que se encontra na vasa
in scheme: Tesauro SIPA
preferred label: Millstone runner @en
preferred label: Meule tournante @fr
preferred label: Macina mobile @it
broader: Moinho de pedra

Moinho de martelo
type: Concept
in scheme: Tesauro SIPA
preferred label: Hammer mill @en
preferred label: Broyeur à marteaux @fr
preferred label: Mulino a martelli @it
broader: Moinho de pedra

Equipamentos de prensagem
type: Concept
in scheme: Tesauro SIPA
preferred label: Pressing mechanisms @en
preferred label: Mécanismes de pressage @fr
preferred label: Meccanismi di pressatura @it
broader: Equipamentos de produção de azeite
narrower: Agulhão
narrower: Agulheira
narrower: Alçapremas
narrower: Prensa

Agulhão
type: Concept
scope note: Haste grossa, de ferro ou de madeira que entra nas agulheiras para segurar a vara, também designada por agulha
in scheme: Tesauro SIPA
preferred label: Large spindle (Olive spike) @en
preferred label: Poinçon @fr
preferred label: Aguglione @it
alternative label: Agulha
broader: Equipamentos de prensagem

Agulheira
type: Concept
scope note: Elemento que suporta a vara do lagar, correspondendo a duas pedras furadas, colocadas em posição vertical nas quais se enfia a agulha
in scheme: Tesauro SIPA
preferred label: Spindle support @en
broader: Equipamentos de prensagem

Alçapremas
type: Concept
in scheme: Tesauro SIPA
preferred label: Press lift system (Archaic press lever) @en
preferred label: Dispositif de levée de presse @fr
preferred label: Sollevatore della pressa @it
broader: Equipamentos de prensagem

Prensa
type: Concept
in scheme: Tesauro SIPA
preferred label: Press @en
preferred label: Pressa @it
preferred label: Presse @fr
broader: Equipamentos de prensagem
narrower: Prensa de vara

Prensa de vara
type: Concept
scope note: Corresponde a um grande tronco de árvore que de um lado encaixa na parede do lagar, fixa entre as agulheiras através de uma agulha, ficando a outra extremidade livre podendo esta ser ou não mais grossa, quando é mais grossa esta corresponde à raiz da árvore, chamada cabeça da vara, onde encaixa a concha que funciona como porca onde enrosca o fuso, este por seu lado faz-se girar, através de um pau comprido introduzido num orifício aberto abaixo da rosca. Na parte inferior está fixo a um peso de pedra que serve para ajudar a aumentar a potência da vara. A vara mantém-se equilibrada entre dois prumos verticais também designados por virgens, ligados por travessas que os mantém equilibrados
in scheme: Tesauro SIPA
preferred label: Beam press @en
preferred label: Presse à levier @fr
preferred label: Pressa a leva @it
broader: Prensa
narrower: Concha da vara
narrower: Fuso da vara

Concha da vara
type: Concept
scope note: Peça de madeira furada que atravessa a vara, próximo da cabeça da vara, e na qual enrosca o fuso
in scheme: Tesauro SIPA
preferred label: Beam socket @en
preferred label: Douille du levier @fr
preferred label: Incavo della leva @it
broader: Prensa de vara

Fuso da vara
type: Concept
scope note: Parafuso grosso de madeira, geralmente de sobreiro ou de azinheira, que enrosca na concha, o qual constitui o acionamento do sistema da prensa da vara, também conhecido por parafuso ou tarraxão
in scheme: Tesauro SIPA
preferred label: Shaft @en
preferred label: Fuseau @fr
preferred label: Fuso @it
broader: Prensa de vara

Maquinaria oficinal e industrial
type: Concept
in scheme: Tesauro SIPA
preferred label: Workshop and industrial machinery @en
preferred label: Machines d'atelier et industrielles @fr
preferred label: Macchinari per officine e industriali @it
broader: Equipamentos oficinais e industriais
narrower: Maquinaria oficinal e industrial específica
narrower: Maquinaria oficinal e industrial genérica

Maquinaria oficinal e industrial específica
type: Concept
in scheme: Tesauro SIPA
preferred label: Specific workshop and industrial machinery @en
preferred label: Machines d'atelier et industrielles spécifiques @fr
preferred label: Macchinari specifici per officine e industriali @it
broader: Maquinaria oficinal e industrial
narrower: Máquinas para armazenamento
narrower: Máquinas para tratamento da madeira

Máquinas para armazenamento
type: Concept
in scheme: Tesauro SIPA
preferred label: Storage machines @en
preferred label: Machines de stockage @fr
preferred label: Macchine per l'archiviazione @it
broader: Maquinaria oficinal e industrial específica
narrower: Tremonha

Tremonha
type: Concept
scope note: Equipamento industrial, em forma de funil, utilizado para armazenar temporariamente determinada matéria-prima e dosear a saída da mesma para a fase seguinte do processo, podendo ser dotado de sistema vibrador para garantir maior eficiência e ter integrado vários tipos de transportadores.
in scheme: Tesauro SIPA
preferred label: Hopper @en
preferred label: Trémie @fr
preferred label: Tramoggia @it
broader: Máquinas para armazenamento

Máquinas para tratamento da madeira
type: Concept
in scheme: Tesauro SIPA
preferred label: Wood processing machines @en
preferred label: Machines pour le traitement du bois @fr
preferred label: Macchine per la lavorazione del legno @it
broader: Maquinaria oficinal e industrial específica
narrower: Autoclave

Autoclave
type: Concept
scope note: Conjunto de aparelhos que trabalham a frio e fazem ciclos de vácuo e/ou pressão de forma a forçar a entrada de produtos preservadores na madeira. O tratamento em autoclave, ou impregnação por pressão, confere à madeira uma grande durabilidade e resistência face à humidade e ao ataque de organismos xilófagos. Com este método, obtêm-se, de forma rápida e económica, as maiores retenções em produto preservador, qualquer que seja a espécie de madeira a tratar. Este tratamento pode ser de dois tipos: com sais hidrossolúveis, que contêm cobre e deixam uma cor esverdeada na madeira e os orgânicos (creosote) que respeitam a sua cor natural. As peças utilizadas em aros de vãos exteriores, ou em quaisquer guarnecimentos expostos ao tempo, onde haja o perigo frequente de absorção de humidade, ou sempre que a madeira fique embebida em massames, devem receber um tratamento que utilize pressão de forma que seja assegurada a penetração profunda do produto
in scheme: Tesauro SIPA
broader: Máquinas para tratamento da madeira

Maquinaria oficinal e industrial genérica
type: Concept
in scheme: Tesauro SIPA
preferred label: General workshop and industrial machinery @en
preferred label: Machines d'atelier et industrielles génériques @fr
preferred label: Macchinari generici per officine e industria @it
broader: Maquinaria oficinal e industrial
narrower: Amassadeira
narrower: Balança industrial
narrower: Batedeira industrial
narrower: Embaladoura
narrower: Fatiadora industrial
narrower: Forno (Maquinaria oficinal e industrial genérica)
narrower: Frigorífico industrial
narrower: Laminador
narrower: Máquina de torra de café

Amassadeira
type: Concept
scope note: Máquina industrial automática utilizada para misturar, amassar e sovar de forma homogénea grandes quantidades de massas densas e pesadas, facilitando a produção em larga escala e garantindo uma consistência uniforme na qualidade dos produtos finais.
in scheme: Tesauro SIPA
preferred label: Kneading tray @en
preferred label: Pétrisseuse @fr
preferred label: Impastatrice @it
broader: Maquinaria oficinal e industrial genérica

Balança industrial
type: Concept
scope note: Equipamento utilizado na indústria para medir a massa de matéria-prima, peças, produtos ou mercadorias embaladas, em relação a certa unidade de medida.
in scheme: Tesauro SIPA
preferred label: Industrial scale @en
preferred label: Balance industrielle @fr
preferred label: Bilancia industriale @it
broader: Maquinaria oficinal e industrial genérica

Batedeira industrial
type: Concept
scope note: Equipamento automático utilizado na indústria alimentícia para misturar e bater de forma eficiente diversos tipos de ingredientes necessários à preparação de massas leves e areadas, características da confeitaria.
in scheme: Tesauro SIPA
preferred label: Industrial mixer @en
preferred label: Mélangeur industriel @fr
preferred label: Impastatrice industriale @it
broader: Maquinaria oficinal e industrial genérica

Embaladoura
type: Concept
scope note: Máquina automática ou manual que serve para embalar produtos, podendo dispor de mecanismos para depositá-los no interior da embalagem e fechá-la ou selá-la
in scheme: Tesauro SIPA
preferred label: Packaging machine @en
preferred label: Machine d’emballage @fr
broader: Maquinaria oficinal e industrial genérica

Fatiadora industrial
type: Concept
scope note: Equipamento utilizado para cortar diferentes tipos de produtos, com espessura padrão ou regulável, de forma prática e rápida.
in scheme: Tesauro SIPA
preferred label: Industrial slicer @en
preferred label: Trancheuse industrielle @fr
preferred label: Affettatrice industriale @it
broader: Maquinaria oficinal e industrial genérica

Forno (Maquinaria oficinal e industrial genérica)
type: Concept
in scheme: Tesauro SIPA
preferred label: Oven (General workshop and industrial machinery) @en
preferred label: Four (Machines d'atelier et industrielles génériques) @fr
preferred label: Forno (Macchinari generici per officine e industria) @it
broader: Maquinaria oficinal e industrial genérica
narrower: Bateria de fornos
narrower: Forno contínuo
narrower: Forno segundo a fonte de energia

Bateria de fornos
type: Concept
in scheme: Tesauro SIPA
preferred label: Battery of ovens @en
preferred label: Batterie de fours @fr
preferred label: Batteria di forni @it
broader: Forno (Maquinaria oficinal e industrial genérica)

Forno contínuo
type: Concept
scope note: Forno industrial composto por vários módulos, concebido para processar produtos de forma ininterrupta, com sistemas de controle da temperatura, tempo de exposição ao calor e ventilação, que lhes permitem ser cozidos de forma homogénea à medida que se movem continuamente através do forno.
in scheme: Tesauro SIPA
preferred label: Continuous oven @en
preferred label: Four continu @fr
preferred label: Forno continuo @it
broader: Forno (Maquinaria oficinal e industrial genérica)

Forno segundo a fonte de energia
type: Concept
in scheme: Tesauro SIPA
preferred label: Oven by energy source @en
preferred label: Four selon la source d’énergie @fr
preferred label: Forno secondo la fonte di energia @it
broader: Forno (Maquinaria oficinal e industrial genérica)
narrower: Forno a lenha
narrower: Forno elétrico

Forno a lenha
type: Concept
in scheme: Tesauro SIPA
preferred label: Wood-fired oven @en
preferred label: Four à bois @fr
preferred label: Forno a legna @it
broader: Forno segundo a fonte de energia

Forno elétrico
type: Concept
scope note: Equipamento industrial com câmara aquecida para processar diferentes tipos de produtos, podendo ter configuração e tamanho distintos e ser alimentados por diferentes fontes de energia. Possuem sofisticado sistema de controle de temperatura, de modo a garantir o aquecimento consistente e uniforme do produto.
in scheme: Tesauro SIPA
preferred label: Electric oven @en
preferred label: Four électrique @fr
preferred label: Forno elettrico @it
hidden label: Forno eléctrico
broader: Forno segundo a fonte de energia

Frigorífico industrial
type: Concept
scope note: Equipamento utilizado para refrigerar e conservar em larga escala diferentes tipos de produtos perecíveis, utilizando sistemas de refrigeração para manter as temperaturas baixas e controladas.
in scheme: Tesauro SIPA
preferred label: Industrial refrigerator @en
preferred label: Réfrigérateur industriel @fr
preferred label: Frigorifero industriale @it
broader: Maquinaria oficinal e industrial genérica

Laminador
type: Concept
scope note: Equipamento utilizado num processo de transformação do material, em que se faz passar a matéria-prima por dois rolos laminadores, que o comprimem em lâminas, deformando-o, mas sem alterar as suas propriedades.
in scheme: Tesauro SIPA
preferred label: Rolling mill @en
preferred label: Laminoir @fr
preferred label: Laminatoio @it
broader: Maquinaria oficinal e industrial genérica

Máquina de torra de café
type: Concept
scope note: Equipamento industrial onde são colocados os grão de café para serem torrados a altas temperaturas, antes do processo de moagem.
in scheme: Tesauro SIPA
preferred label: Roasting machine @en
preferred label: Machine à torréfier @fr
preferred label: Macchina per la tostatura @it
broader: Maquinaria oficinal e industrial genérica

Equipamentos genéricos
type: Concept
in scheme: Tesauro SIPA
preferred label: Generic equipment @en
preferred label: Attrezzature generiche @it
preferred label: Équipement générique @fr
broader: Equipamentos
narrower: Equipamentos genéricos segundo a função

Equipamentos genéricos segundo a função
type: Concept
in scheme: Tesauro SIPA
preferred label: Generic equipment according to function @en
broader: Equipamentos genéricos
narrower: Equipamentos de extração
narrower: Equipamentos de higienização, de desinfeção e de desinfestação

Equipamentos de extração
type: Concept
in scheme: Tesauro SIPA
preferred label: Extraction equipment @en
preferred label: Équipement d'extraction @fr
preferred label: Attrezzature per l'estrazione @it
hidden label: Equipamentos de extracção
broader: Equipamentos genéricos segundo a função
narrower: Bomba de água

Bomba de água
type: Concept
scope note: Máquina elevatória, fixa ou móvel, acionada pela força da água ou com a ajuda de um motor alimentado por uma outra fonte de energia. A água é deslocada por aspiração (bomba de aspiração) ou por refluxo. As bombas de água são frequentemente dissimuladas em elementos construídos
in scheme: Tesauro SIPA
preferred label: Water pump @en
preferred label: Pompe à eau @fr
preferred label: Pompa dell'acqua @it
broader: Equipamentos de extração

Equipamentos de higienização, de desinfeção e de desinfestação
type: Concept
in scheme: Tesauro SIPA
preferred label: Hygiene, disinfection and disinfestation equipment @en
preferred label: Équipement d'assainissement, de désinfection et de désinsectisation @fr
preferred label: Attrezzature per la sanificazione, disinfezione e disinfestazione @it
hidden label: Equipamentos de higienização, de desinfecção e de desinfestação
broader: Equipamentos genéricos segundo a função
narrower: Balcão de higiene
narrower: Câmara de desinfeção

Balcão de higiene
type: Concept
in scheme: Tesauro SIPA
preferred label: Hygiene counter @en
preferred label: Compteur d'hygiène @fr
preferred label: Banco d'igiene @it
broader: Equipamentos de higienização, de desinfeção e de desinfestação

Câmara de desinfeção
type: Concept
in scheme: Tesauro SIPA
preferred label: Disinfection chamber @en
preferred label: Chambre de désinfection @fr
preferred label: Camera di disinfezione @it
hidden label: Câmara de desinfecção
broader: Equipamentos de higienização, de desinfeção e de desinfestação

Ferramentas e instrumentos
type: Concept
in scheme: Tesauro SIPA
preferred label: Tools and instruments @en
preferred label: Outils et instruments @fr
preferred label: Strumenti e utensili @it
broader: Objetos, Equipamentos, Mobiliário e Veículos
narrower: Ferramentas
narrower: Instrumentos

Ferramentas
type: Concept
in scheme: Tesauro SIPA
preferred label: Tools @en
preferred label: Outils @fr
preferred label: Utensili @it
broader: Ferramentas e instrumentos
narrower: Ferramentas genéricas
narrower: Ferramentas segundo a função

Ferramentas genéricas
type: Concept
in scheme: Tesauro SIPA
preferred label: Generic tools @en
preferred label: Outils génériques @fr
preferred label: Utensili generici @it
broader: Ferramentas
narrower: Turquês

Turquês
type: Concept
scope note: Ferramenta metálica, com várias funções e assemelhando-se a uma tenaz, servindo para agarrar, segurar ou arrancar um objeto, ou mesmo para cortar
in scheme: Tesauro SIPA
preferred label: Pincers; Nippers (Cutting tools) @en
broader: Ferramentas genéricas

Ferramentas segundo a função
type: Concept
in scheme: Tesauro SIPA
preferred label: Tools by function @en
preferred label: Outils selon la fonction @fr
preferred label: Strumenti secondo la funzione @it
broader: Ferramentas
narrower: Ferramentas de afiação
narrower: Ferramentas de apertar
narrower: Ferramentas de aspersão
narrower: Ferramentas de corte
narrower: Ferramentas de desbaste e alisamento
narrower: Ferramentas de enchimento e regularização
narrower: Ferramentas de furo
narrower: Ferramentas de lavoura
narrower: Ferramentas de limpeza
narrower: Ferramentas de movimento e acerto
narrower: Ferramentas de peneira
narrower: Ferramentas de percussão
narrower: Ferramentas de torção

Ferramentas de afiação
type: Concept
in scheme: Tesauro SIPA
preferred label: Sharpening tools @en
preferred label: Outils d'affûtage @fr
preferred label: Strumenti di affilatura @it
broader: Ferramentas segundo a função
narrower: Aguçadeira

Aguçadeira
type: Concept
scope note: Ferramenta constituída por uma pedra de aguçar, de afiar ou de amolar
in scheme: Tesauro SIPA
preferred label: Grindstone @en
preferred label: Aiguisoir @fr
preferred label: Affilatoio @it
broader: Ferramentas de afiação

Ferramentas de apertar
type: Concept
in scheme: Tesauro SIPA
preferred label: Tightening tools @en
preferred label: Outils de serrage @fr
preferred label: Strumenti di serraggio @it
broader: Ferramentas segundo a função
narrower: Chave de parafusos
narrower: Gastalho

Chave de parafusos
type: Concept
scope note: Ferramenta manual utilizada para apertar ou desapertar parafusos
in scheme: Tesauro SIPA
preferred label: Screwdriver @en
preferred label: Tournevis @fr
preferred label: Cacciavite @it
broader: Ferramentas de apertar
narrower: Chave Allen
narrower: Chave de fendas
narrower: Chave Phillips
narrower: Chave Pozidriv
narrower: Chave Robertson
narrower: Chave Spanner
narrower: Chave Tri-Wing
narrower: Chave Torq-Set
narrower: Chave Torx

Chave Allen
type: Concept
scope note: Ferramenta manual em formato de L com uma ponta hexagonal em cada extremidade, utilizada para apertar e soltar parafusos com encaixe interno também hexagonal, inventado por William G. Allen
in scheme: Tesauro SIPA
preferred label: Allen screwdriver @en
broader: Chave de parafusos

Chave de fendas
type: Concept
scope note: Ferramenta manual utilizada para apertar ou desapertar parafusos com uma ranhura na cabeça
in scheme: Tesauro SIPA
preferred label: Spanner; Screwdriver @en
broader: Chave de parafusos

Chave Phillips
type: Concept
scope note: Ferramenta manual utilizada para apertar ou soltar parafusos com uma cabeça em forma de cruz
in scheme: Tesauro SIPA
preferred label: Phillips screwdriver @en
broader: Chave de parafusos

Chave Pozidriv
type: Concept
in scheme: Tesauro SIPA
preferred label: Pozidriv screwdriver @en
broader: Chave de parafusos

Chave Robertson
type: Concept
scope note: Ferramenta manual de encaixe quadrado, utilizada para apertar e desapertar parafusos com cabeça quadrada
in scheme: Tesauro SIPA
preferred label: Robertson screwdriver @en
broader: Chave de parafusos

Chave Spanner
type: Concept
scope note: Ferramenta manual utilizada para apertar ou desapertar porcas e parafusos, com uma abertura ajustável para se adaptar a diferentes dimensões
in scheme: Tesauro SIPA
preferred label: Spanner screwdriver @en
broader: Chave de parafusos

Chave Tri-Wing
type: Concept
in scheme: Tesauro SIPA
preferred label: Tri-Wing screwdriver @en
broader: Chave de parafusos

Chave Torq-Set
type: Concept
scope note: Ferramenta manual utilizada para apertar ou afrouxar parafusos com cabeça em forma de estrela
in scheme: Tesauro SIPA
preferred label: Torq-Set screwdriver @en
broader: Chave de parafusos

Chave Torx
type: Concept
in scheme: Tesauro SIPA
preferred label: Torx screwdriver @en
broader: Chave de parafusos

Gastalho
type: Concept
scope note: Tipo de grampo utilizado em trabalhos de marcenaria
in scheme: Tesauro SIPA
preferred label: Cramp; Clamp @en
broader: Ferramentas de apertar

Ferramentas de aspersão
type: Concept
in scheme: Tesauro SIPA
preferred label: Sprinkler tools @en
preferred label: Outils d'arrosage @fr
preferred label: Strumenti per irrigazione @it
broader: Ferramentas segundo a função

Ferramentas de corte
type: Concept
in scheme: Tesauro SIPA
preferred label: Cutting tools @en
preferred label: Outils de coupe @fr
preferred label: Strumenti da taglio @it
broader: Ferramentas segundo a função
narrower: Serra (Ferramentas de corte)
narrower: Serrote

Serra (Ferramentas de corte)
type: Concept
scope note: Ferramenta utilizada para cortar vários materiais, assumindo especificidades para cada um deles
in scheme: Tesauro SIPA
preferred label: Saw (Cutting tools) @en
preferred label: Scie (Outils de coupe) @fr
preferred label: Sega (Strumenti da taglio) @it
broader: Ferramentas de corte
narrower: Componentes da serra
narrower: Serra braçal
narrower: Serra de cabelo
narrower: Serra de ferro
narrower: Serra de ourives
narrower: Serra de rodear

Componentes da serra
type: Concept
in scheme: Tesauro SIPA
preferred label: Saw components @en
broader: Serra (Ferramentas de corte)
narrower: Alfeizar

Alfeizar
type: Concept
scope note: Peça de madeira, mais ou menos longa, que se encaixa nos testicos de uma serra de carpinteiro, entre o cairo e a lâmina, para os manter firmes
in scheme: Tesauro SIPA
preferred label: Frame rod between wingnuts @en
broader: Componentes da serra

Serra braçal
type: Concept
scope note: Tipo de serra de grandes dimensões, composta por uma lâmina longa, operada por duas pessoas, uma de cada lado, utilizando a força dos braços para o corte
in scheme: Tesauro SIPA
preferred label: Hacksaw @en
preferred label: Scie de scieur de long @fr
broader: Serra (Ferramentas de corte)

Serra de cabelo
type: Concept
scope note: Tipo de serra, com lâmina dentada, executada em aço
in scheme: Tesauro SIPA
preferred label: Hair saw @en
broader: Serra (Ferramentas de corte)

Serra de ferro
type: Concept
scope note: Tipo de serra para cortar metal, de lâmina fina e com dentes muito afiados
in scheme: Tesauro SIPA
preferred label: Iron saw @en
broader: Serra (Ferramentas de corte)

Serra de ourives
type: Concept
scope note: Tipo de serra utilizada na ourivesaria de lâmina muito fina, própria para trabalhos minuciosos
in scheme: Tesauro SIPA
preferred label: Fret saw @en
broader: Serra (Ferramentas de corte)

Serra de rodear
type: Concept
in scheme: Tesauro SIPA
preferred label: Band saw; Jigsaw @en
alternative label: Serra de recorte
broader: Serra (Ferramentas de corte)

Serrote
type: Concept
scope note: Ferramenta para cortar madeira com uma lâmina larga e dentes afiados
in scheme: Tesauro SIPA
preferred label: Handsaw @en
preferred label: Scie à main @fr
preferred label: Saracco @it
broader: Ferramentas de corte
narrower: Serrote de costas
narrower: Serrote de espada
narrower: Serrote de ponta
narrower: Serrote de traçar

Serrote de costas
type: Concept
scope note: Tipo de serrote com lâmina fina e dorso reforçado, usado para cortes precisos
in scheme: Tesauro SIPA
preferred label: Back saw @en
broader: Serrote

Serrote de espada
type: Concept
scope note: Tipo de serrote com lâmina larga e curta e pega em madeira
in scheme: Tesauro SIPA
preferred label: Pruning saw @en
alternative label: Serrote universal
broader: Serrote

Serrote de ponta
type: Concept
scope note: Tipo de serrote utilizado em trabalhos de precisão, de carpintaria e de marcenaria, especialmente em curvas e contornos
in scheme: Tesauro SIPA
preferred label: Keyhole saw @en
broader: Serrote

Serrote de traçar
type: Concept
scope note: Tipo de serrote utilizado em trabalhos de precisão, de carpintaria e de marcenaria, especialmente em curvas e contornos
in scheme: Tesauro SIPA
preferred label: Crosscut saw @en
broader: Serrote

Ferramentas de desbaste e alisamento
type: Concept
in scheme: Tesauro SIPA
preferred label: Roughing and smoothing tools @en
broader: Ferramentas segundo a função
narrower: Cinzel
narrower: Corteché
narrower: Escacilhadeira
narrower: Escopro
narrower: Formão
narrower: Goiva
narrower: Guilho
narrower: Lima
narrower: Lixa
narrower: Pico
narrower: Picola
narrower: Plaina
narrower: Ponteiro
narrower: Talhadeira
narrower: Talhadoura

Cinzel
type: Concept
scope note: Ferramenta em forma de cunha com uma aresta de corte, utilizada para esculpir ou cortar materiais duros, como a madeira, pedra ou metal
in scheme: Tesauro SIPA
preferred label: Chisel @en
preferred label: Scalpello @it
preferred label: Ciseau @fr
broader: Ferramentas de desbaste e alisamento

Corteché
type: Concept
scope note: Ferramenta usada em carpintaria para alisar superfícies, especialmente curvas, com duas pegas laterais e uma lâmina ajustável
in scheme: Tesauro SIPA
preferred label: Drawknife @en
alternative label: Raspadeira
broader: Ferramentas de desbaste e alisamento
narrower: Corteché americano

Corteché americano
type: Concept
in scheme: Tesauro SIPA
preferred label: American drawknife @en
broader: Corteché

Escacilhadeira
type: Concept
scope note: Ferramenta de percussão, utilizada no desbaste da pedra, criando um acabamento muito rugoso
in scheme: Tesauro SIPA
preferred label: Chipper; Pitcher @en
broader: Ferramentas de desbaste e alisamento

Escopro
type: Concept
in scheme: Tesauro SIPA
preferred label: Chisel @en
preferred label: Scalpel @fr
preferred label: Scalpello @it
broader: Ferramentas de desbaste e alisamento
narrower: Escopro de ponta
narrower: Escopro lâmina
narrower: Escopro largo
narrower: Escopro pico

Escopro de ponta
type: Concept
in scheme: Tesauro SIPA
preferred label: Pointed chisel @en
broader: Escopro

Escopro lâmina
type: Concept
in scheme: Tesauro SIPA
preferred label: Blade chisel @en
broader: Escopro

Escopro largo
type: Concept
in scheme: Tesauro SIPA
preferred label: Wide chisel @en
broader: Escopro

Escopro pico
type: Concept
in scheme: Tesauro SIPA
preferred label: Scope @en
broader: Escopro

Formão
type: Concept
scope note: Ferramenta utilizada em carpintaria e em entalhe para trabalhar madeira
in scheme: Tesauro SIPA
preferred label: Spokeshave @en
broader: Ferramentas de desbaste e alisamento
narrower: Bedame (Ferramentas de desbaste e alisamento)

Bedame (Ferramentas de desbaste e alisamento)
type: Concept
scope note: Tipo de formão estreito e comprido, de secção quadrada, usado para abrir encaixes na madeira
in scheme: Tesauro SIPA
preferred label: Crosscut chisel (Roughing and smoothing tools) @en
broader: Formão

Goiva
type: Concept
scope note: Ferramenta para trabalhar a madeira com a parte superior delgada, própria para talhar zonas curvas
in scheme: Tesauro SIPA
preferred label: Gouge @en
preferred label: Sgorbia @it
broader: Ferramentas de desbaste e alisamento
narrower: Goiva em V

Goiva em V
type: Concept
in scheme: Tesauro SIPA
preferred label: V-shaped gouge @en
broader: Goiva

Guilho
type: Concept
scope note: Ferramenta em forma de cunha, para fender pedra
in scheme: Tesauro SIPA
preferred label: Chisel point @en
broader: Ferramentas de desbaste e alisamento

Lima
type: Concept
scope note: Ferramenta em aço com estrias dispostas regularmente, utilizado no desbaste ou polimento de materiais duros
in scheme: Tesauro SIPA
preferred label: File @en
preferred label: Lime @fr
broader: Ferramentas de desbaste e alisamento
narrower: Grosa
narrower: Lima bastarda
narrower: Lima paralela

Grosa
type: Concept
scope note: Tipo de lima para desbastar madeira, couro ou ferro
in scheme: Tesauro SIPA
preferred label: Rasp @en
broader: Lima

Grosa quadrada
type: Concept
in scheme: Tesauro SIPA
preferred label: Square rasp @en
narrower: Grosa redonda

Grosa redonda
type: Concept
in scheme: Tesauro SIPA
preferred label: Round rasp @en
broader: Grosa quadrada

Lima bastarda
type: Concept
scope note: Tipo de lima utilizada para desbaste de materiais, especialmente metais, onde é necessário remover uma quantidade significativa de material de forma rápida e eficiente
in scheme: Tesauro SIPA
preferred label: Bastard cut file @en
preferred label: Lime demi-douce @fr
preferred label: Lima a taglio bastardo @it
broader: Lima

Lima paralela
type: Concept
in scheme: Tesauro SIPA
preferred label: Parallel file @en
broader: Lima

Lixa
type: Concept
scope note: Folha de papel com material de superfície abrasiva composta geralmente por minerais, utilizado para polir madeira e metais
in scheme: Tesauro SIPA
preferred label: Sand paper @en
preferred label: Papier de verre (sablé) @fr
preferred label: Carta vetrata @it
broader: Ferramentas de desbaste e alisamento

Pico
type: Concept
in scheme: Tesauro SIPA
preferred label: Spike @en
broader: Ferramentas de desbaste e alisamento

Picola
type: Concept
scope note: Ferramenta usada por canteiros, composta por uma cunha de ferro com cabo, utilizada para alisar a pedra
in scheme: Tesauro SIPA
preferred label: Small chisel @en
broader: Ferramentas de desbaste e alisamento

Plaina
type: Concept
scope note: Ferramenta utilizada para alisar, nivelar e determinar a espessura de peças de madeira, composta por um corpo com base plana, dotado de uma lâmina ou ferro, utilizado para desbastar materiais
in scheme: Tesauro SIPA
preferred label: Rabot @fr
preferred label: Pialla @it
preferred label: Planer @en
broader: Ferramentas de desbaste e alisamento
narrower: Cepilho
narrower: Garlopa
narrower: Meia-garlopa
narrower: Guilherme
narrower: Plaina de dentes
narrower: Plaina de topejar

Cepilho
type: Concept
scope note: Tipo de plaina utilizada para alisar madeira
in scheme: Tesauro SIPA
preferred label: Plane @en
broader: Plaina

Garlopa
type: Concept
scope note: Tipo de plaina de grandes dimensões, utilizada para alisar e endireitar peças de madeira, dando-lhe acabamento
in scheme: Tesauro SIPA
preferred label: Large plane @en
broader: Plaina

Meia-garlopa
type: Concept
scope note: Tipo de garlopa de menores dimensões
in scheme: Tesauro SIPA
preferred label: Half plane @en
broader: Plaina
narrower: Goivete

Goivete
type: Concept
scope note: Tipo de plaina com dois ferros, utilizada para fazer encaixes em madeira
in scheme: Tesauro SIPA
preferred label: Plane @en
broader: Meia-garlopa

Guilherme
type: Concept
scope note: Tipo de plaina estreita utilizada para trabalhos de precisão em carpintaria e marcenaria
in scheme: Tesauro SIPA
preferred label: Grooving plane @en
broader: Plaina

Plaina de dentes
type: Concept
scope note: Tipo de plaina que tem a base serrilhada com pequenos dentes, visando tornar a superfície da madeira mais áspera, facilitando os processos de colagem
in scheme: Tesauro SIPA
preferred label: Tooth plane @en
broader: Plaina

Plaina de topejar
type: Concept
in scheme: Tesauro SIPA
preferred label: Top planer @en
broader: Plaina

Ponteiro
type: Concept
in scheme: Tesauro SIPA
preferred label: Pointer @en
broader: Ferramentas de desbaste e alisamento
narrower: Meio-pontão
narrower: Pontão (Ponteiro)

Meio-pontão
type: Concept
in scheme: Tesauro SIPA
preferred label: Half-pont @en
broader: Ponteiro

Pontão (Ponteiro)
type: Concept
in scheme: Tesauro SIPA
preferred label: Pointer @en
broader: Ponteiro

Talhadeira
type: Concept
scope note: Ferramenta de corte e desbaste, utilizada para talhar, ou abrir fendas, buracos ou mesmo demolir materiais duros como betão, pedra e tijolo
in scheme: Tesauro SIPA
preferred label: Anvil @en
preferred label: Tranchet @fr
preferred label: Tagliaferro @it
broader: Ferramentas de desbaste e alisamento

Talhadoura
type: Concept
scope note: Ferramenta composta por uma ponta afiada, que afunila, utilizada para cortar, dar forma ou desbastar materiais como madeira ou metal
in scheme: Tesauro SIPA
preferred label: Point chisel @en
preferred label: Ciseau de tailleur @fr
preferred label: Scalpello appuntito @it
broader: Ferramentas de desbaste e alisamento
narrower: Talhadoura dupla

Talhadoura dupla
type: Concept
in scheme: Tesauro SIPA
preferred label: Double-pointed chisel @en
preferred label: Ciseau à double pointe @fr
preferred label: Scalpello a doppia punta @it
broader: Talhadoura

Ferramentas de enchimento e regularização
type: Concept
in scheme: Tesauro SIPA
preferred label: Filling and levelling tools @en
broader: Ferramentas segundo a função
narrower: Colher de pedreiro
narrower: Falcão
narrower: Talocha
narrower: Pá

Colher de pedreiro
type: Concept
scope note: Ferramenta em forma de espátula triangular e um cabo, usada para aplicar e espalhar argamassa, cimento, gesso, etc.
in scheme: Tesauro SIPA
preferred label: Mason's trowel @en
preferred label: Truelle de maçon @fr
broader: Ferramentas de enchimento e regularização
narrower: Colher de folha
narrower: Colher redonda

Colher de folha
type: Concept
in scheme: Tesauro SIPA
preferred label: Sheet spoon @en
broader: Colher de pedreiro

Colher redonda
type: Concept
in scheme: Tesauro SIPA
preferred label: Round spoon; Shovel @en
broader: Colher de pedreiro

Falcão
type: Concept
scope note: Ferramenta plana e quadrada usada por estucadores e ladrilhadores para colocar gesso, argamassa ou materiais semelhantes, durante a aplicação da mesma
in scheme: Tesauro SIPA
preferred label: Hawk tool @en
broader: Ferramentas de enchimento e regularização

Talocha
type: Concept
scope note: Ferramenta utilizada para nivelar superfícies revestidas com argamassa, estuque ou reboco
in scheme: Tesauro SIPA
preferred label: Trowel @en
broader: Ferramentas de enchimento e regularização
narrower: Desempenadeira
narrower: Talocha de remates

Desempenadeira
type: Concept
scope note: Tipo de prancheta retangular, de madeira, metal ou plástico, com uma empunhadura ao centro, que serve para espalhar ou alisar substâncias de massa como argamassa, estuque, reboco, areia ou gesso numa superfície
in scheme: Tesauro SIPA
preferred label: Smoothing planer @en
broader: Talocha

Talocha de remates
type: Concept
in scheme: Tesauro SIPA
preferred label: Trimming trowel @en
broader: Talocha

Pá
type: Concept
in scheme: Tesauro SIPA
preferred label: Shovel @en
preferred label: Pelle @fr
preferred label: Pala @it
broader: Ferramentas de enchimento e regularização
narrower: Pá de bico
narrower: Pá de corte
narrower: Pá de valar
narrower: Pá quadrada

Pá de bico
type: Concept
in scheme: Tesauro SIPA
preferred label: Mouth shovel @en
broader: Pá

Pá de corte
type: Concept
in scheme: Tesauro SIPA
preferred label: Cutting spade @en
preferred label: Bêche de coupe @fr
preferred label: Vanga da taglio @it
broader: Pá

Pá de valar
type: Concept
in scheme: Tesauro SIPA
preferred label: Trenching spade @en
preferred label: Pelle à tranchée @fr
preferred label: Vanga per trincea @it
broader: Pá

Pá quadrada
type: Concept
in scheme: Tesauro SIPA
preferred label: Border spade; Square shovel @en
broader: Pá

Ferramentas de furo
type: Concept
in scheme: Tesauro SIPA
preferred label: Drilling tools @en
preferred label: Outils de perçage @fr
preferred label: Strumenti di perforazione @it
broader: Ferramentas segundo a função
narrower: Arco de pua
narrower: Berbequim
narrower: Furador
narrower: Verruma

Arco de pua
type: Concept
scope note: Ferramenta utilizada para fazer furos na madeira. É composta por uma broca e uma manivela que provoca o movimento giratório da broca, fazendo o orifício
in scheme: Tesauro SIPA
preferred label: Point drill @en
broader: Ferramentas de furo

Berbequim
type: Concept
scope note: Ferramenta utilizada para fazer furos em vários materiais, sendo dotado de brocas adaptáveis de formas distintas
in scheme: Tesauro SIPA
preferred label: Drill machine @en
preferred label: Perceuse @fr
preferred label: Trapano @it
broader: Ferramentas de furo
narrower: Berbequim elétrico
narrower: Berbequim manual
narrower: Componentes do berbequim

Berbequim elétrico
type: Concept
scope note: Tipo de berbequim com motor interno, ligado à eletricidade
in scheme: Tesauro SIPA
preferred label: Electric drill machine @en
hidden label: Berbequim eléctrico
broader: Berbequim

Berbequim manual
type: Concept
scope note: Tipo de berbequim, que funciona com uma manivela
in scheme: Tesauro SIPA
preferred label: Manual drill machine @en
alternative label: Borquim
broader: Berbequim

Componentes do berbequim
type: Concept
in scheme: Tesauro SIPA
preferred label: Screwdriver components @en
broader: Berbequim
narrower: Broca

Broca
type: Concept
scope note: Instrumento que serve para abrir furos
in scheme: Tesauro SIPA
preferred label: Vrille @fr
preferred label: Succhiello @it
preferred label: Gimlet @en
broader: Componentes do berbequim

Furador
type: Concept
in scheme: Tesauro SIPA
preferred label: Drill @en
broader: Ferramentas de furo

Verruma
type: Concept
scope note: Ferramenta de pequenas dimensões de ponta aguda, destinado a abrir furos na madeira
in scheme: Tesauro SIPA
preferred label: Auger @en
preferred label: Foret @fr
preferred label: Verrina @it
broader: Ferramentas de furo

Ferramentas de lavoura
type: Concept
in scheme: Tesauro SIPA
preferred label: Farmers tools @en
broader: Ferramentas segundo a função
narrower: Ancinho com penteacos
narrower: Enxada
narrower: Marra

Ancinho com penteacos
type: Concept
scope note: Ferramenta agrícola constituída por uma travessa denteadas, presa a um cabo longo, e que se destina a juntar palha ou folhas secas
in scheme: Tesauro SIPA
preferred label: Rake with combs @en
broader: Ferramentas de lavoura

Enxada
type: Concept
in scheme: Tesauro SIPA
preferred label: Hoe @en
preferred label: Houe @fr
preferred label: Zappa @it
broader: Ferramentas de lavoura

Marra
type: Concept
scope note: Ferramenta agrícola semelhante a um sacho, usada para mondar ou limpar terrenos
in scheme: Tesauro SIPA
preferred label: Hoe @en
broader: Ferramentas de lavoura

Ferramentas de limpeza
type: Concept
in scheme: Tesauro SIPA
preferred label: Cleaning tools @en
broader: Ferramentas segundo a função
narrower: Vassoura

Vassoura
type: Concept
in scheme: Tesauro SIPA
preferred label: Balai @fr
preferred label: Scopa @it
preferred label: Brush; Broom @en
broader: Ferramentas de limpeza

Ferramentas de movimento e acerto
type: Concept
in scheme: Tesauro SIPA
preferred label: Movement and setting tools @en
broader: Ferramentas segundo a função
narrower: Alavanca
narrower: Pé de cabra
narrower: Virador

Alavanca
type: Concept
in scheme: Tesauro SIPA
preferred label: Lever @en
preferred label: Levier @fr
preferred label: Leva @it
broader: Ferramentas de movimento e acerto
narrower: Alavanca oitavada
narrower: Alavanca redonda
narrower: Alavanca sextavada
narrower: Ferro de acento

Alavanca oitavada
type: Concept
in scheme: Tesauro SIPA
preferred label: Octagonal lever @en
broader: Alavanca

Alavanca redonda
type: Concept
in scheme: Tesauro SIPA
preferred label: Round lever @en
broader: Alavanca

Alavanca sextavada
type: Concept
in scheme: Tesauro SIPA
preferred label: Hexagon lever @en
broader: Alavanca

Ferro de acento
type: Concept
in scheme: Tesauro SIPA
preferred label: Setting iron @en
preferred label: Fer d’ajustement @fr
preferred label: Ferro di assestamento @it
broader: Alavanca

Pé de cabra
type: Concept
in scheme: Tesauro SIPA
preferred label: Crowbar @en
preferred label: Pied-de-biche @fr
preferred label: Leva a piede di capra @it
broader: Ferramentas de movimento e acerto

Virador
type: Concept
scope note: Cabo náutico para levantar pesos ou reboque
in scheme: Tesauro SIPA
preferred label: Bow rope; Tow cable @en
broader: Ferramentas de movimento e acerto

Ferramentas de peneira
type: Concept
in scheme: Tesauro SIPA
preferred label: Sifting tools @en
broader: Ferramentas segundo a função
narrower: Crivo
narrower: Peneira

Crivo
type: Concept
scope note: Ferramenta composta por uma malha de arame, usada para separar sólidos de diferentes tamanhos ou para filtrar líquidos, removendo impurezas
in scheme: Tesauro SIPA
preferred label: Sieve @en
preferred label: Crible @fr
preferred label: Vaglio @it
broader: Ferramentas de peneira

Peneira
type: Concept
scope note: Tipo de crivo, de pequenas dimensões
in scheme: Tesauro SIPA
preferred label: Sifter @en
preferred label: Tamis @fr
preferred label: Staccio @it
alternative label: Ciranda
alternative label: Joeira
broader: Ferramentas de peneira

Ferramentas de percussão
type: Concept
in scheme: Tesauro SIPA
preferred label: Percussion tools @en
broader: Ferramentas segundo a função
narrower: Bita
narrower: Maceta
narrower: Maço (Ferramentas de percussão)
narrower: Marrão
narrower: Marreta
narrower: Martelo
narrower: Picadeira
narrower: Picareta
narrower: Tira-teimas

Bita
type: Concept
scope note: Ferramenta de madeira utilizada para bater o balastro na construção de ferrovias
in scheme: Tesauro SIPA
preferred label: Stone chiselling pick @en
broader: Ferramentas de percussão

Maceta
type: Concept
in scheme: Tesauro SIPA
preferred label: Maul @en
broader: Ferramentas de percussão

Maço (Ferramentas de percussão)
type: Concept
in scheme: Tesauro SIPA
preferred label: Maillet (Outils de percussion) @fr
preferred label: Maglio (Strumenti a percussione) @it
preferred label: Mallet (Percussion tools) @en
alternative label: Calçadeira
broader: Ferramentas de percussão
narrower: Maço de madeira

Maço de madeira
type: Concept
in scheme: Tesauro SIPA
preferred label: Wood mallet @en
broader: Maço (Ferramentas de percussão)

Marrão
type: Concept
scope note: Ferramenta semelhante a um martelo de ferro, de grandes dimensões, usado para quebrar pedras
in scheme: Tesauro SIPA
preferred label: Club hammer @en
broader: Ferramentas de percussão

Marreta
type: Concept
in scheme: Tesauro SIPA
preferred label: Sledgehammer @en
broader: Ferramentas de percussão
narrower: Marreta de pena
narrower: Marreta oitavada
narrower: Marreta quadrada
narrower: Marreta sextavada

Marreta de pena
type: Concept
in scheme: Tesauro SIPA
preferred label: Quill sledgehammer @en
broader: Marreta

Marreta oitavada
type: Concept
in scheme: Tesauro SIPA
preferred label: Octave sledgehammer @en
broader: Marreta

Marreta quadrada
type: Concept
in scheme: Tesauro SIPA
preferred label: Square sledgehammer @en
broader: Marreta

Marreta sextavada
type: Concept
in scheme: Tesauro SIPA
preferred label: Hexagonal sledgehammer @en
broader: Marreta

Martelo
type: Concept
in scheme: Tesauro SIPA
preferred label: Hammer @en
preferred label: Marteau @fr
preferred label: Martello @it
broader: Ferramentas de percussão
narrower: Martelo manual
narrower: Martelo mecânico

Martelo manual
type: Concept
in scheme: Tesauro SIPA
preferred label: Hammer (Manual) @en
broader: Martelo
narrower: Martelo de bico
narrower: Martelo de bola
narrower: Martelo de calceteiro
narrower: Martelo de campo com cabro
narrower: Martelo de cofrador
narrower: Martelo de orelhas
narrower: Martelo de pena

Martelo de bico
type: Concept
in scheme: Tesauro SIPA
preferred label: Roofer hammer @en
broader: Martelo manual

Martelo de bola
type: Concept
in scheme: Tesauro SIPA
preferred label: Ball Pein hammer @en
broader: Martelo manual

Martelo de calceteiro
type: Concept
in scheme: Tesauro SIPA
preferred label: Boiler scaling hammer @en
broader: Martelo manual

Martelo de campo com cabro
type: Concept
in scheme: Tesauro SIPA
preferred label: Rubber hammer @en
broader: Martelo manual

Martelo de cofrador
type: Concept
in scheme: Tesauro SIPA
preferred label: Framing hammer @en
broader: Martelo manual

Martelo de orelhas
type: Concept
in scheme: Tesauro SIPA
preferred label: Claw hammer @en
preferred label: Marteau à dents @fr
broader: Martelo manual

Martelo de pena
type: Concept
in scheme: Tesauro SIPA
preferred label: Pattern maker hammer @en
broader: Martelo manual

Martelo mecânico
type: Concept
in scheme: Tesauro SIPA
preferred label: Mechanichal hammer @en
broader: Martelo
narrower: Martelo pneumático

Martelo pneumático
type: Concept
in scheme: Tesauro SIPA
preferred label: Marteau pneumatique @fr
preferred label: Martello pneumatico @it
preferred label: Pneumatic hammer; Jackhammer @en
broader: Martelo mecânico

Picadeira
type: Concept
in scheme: Tesauro SIPA
preferred label: Bush hammer @en
preferred label: Boucharde (Marteau à pointes) @fr
preferred label: Martello bocciardato @it
broader: Ferramentas de percussão

Picareta
type: Concept
in scheme: Tesauro SIPA
preferred label: Pickaxe @en
preferred label: Marteau à piquer @fr
preferred label: Piccone @it
broader: Ferramentas de percussão
narrower: Alferça
narrower: Picão

Alferça
type: Concept
scope note: Tipo de picareta
in scheme: Tesauro SIPA
preferred label: Stone splitting pickaxe @en
broader: Picareta

Picão
type: Concept
in scheme: Tesauro SIPA
preferred label: Pick mattock @en
preferred label: Pic à deux pointes @fr
preferred label: Piccone pesante @it
broader: Picareta

Tira-teimas
type: Concept
scope note: Tipo de martelo
in scheme: Tesauro SIPA
preferred label: Aligning bar @en
preferred label: Barre d’alignement @fr
preferred label: Barra di allineamento @it
broader: Ferramentas de percussão

Ferramentas de torção
type: Concept
in scheme: Tesauro SIPA
preferred label: Twisting tools @en
broader: Ferramentas segundo a função
narrower: Torna

Torna
type: Concept
in scheme: Tesauro SIPA
preferred label: Lathe @en
alternative label: Tornadoura
broader: Ferramentas de torção

Instrumentos
type: Concept
in scheme: Tesauro SIPA
preferred label: Tools @en
preferred label: Outils @fr
preferred label: Strumenti @it
broader: Ferramentas e instrumentos
narrower: Instrumentos segundo a função

Instrumentos segundo a função
type: Concept
in scheme: Tesauro SIPA
preferred label: Outils selon la fonction @fr
preferred label: Strumenti secondo la funzione @it
preferred label: Tools according to function @en
broader: Instrumentos
narrower: Instrumentos agrícolas
narrower: Instrumentos de medir
narrower: Instrumentos de registo gráfico
narrower: Instrumentos de verificar planos
narrower: Instrumentos musicais

Instrumentos agrícolas
type: Concept
in scheme: Tesauro SIPA
preferred label: Agricultural tools @en
preferred label: Outils agricoles @fr
preferred label: Strumenti agricoli @it
broader: Instrumentos segundo a função
narrower: Arado

Arado
type: Concept
scope note: Alfaia agrícola para arar o solo, podendo ter tração a sangue (humano ou animal) ou mecânica, nos exemplares mais recentes.
in scheme: Tesauro SIPA
preferred label: Plough @en
preferred label: Araire/ Charrue @fr
preferred label: Aratro @it
broader: Instrumentos agrícolas

Instrumentos de medir
type: Concept
in scheme: Tesauro SIPA
preferred label: Measuring instruments @en
broader: Instrumentos segundo a função
narrower: Instrumentos de medir ângulos
narrower: Instrumentos de medir comprimentos
narrower: Instrumentos de medir distâncias
narrower: Instrumentos de medir elementos climáticos
narrower: Instrumentos de medir o tempo
narrower: Instrumentos de medir superfícies
narrower: Instrumentos de medir temperatura
narrower: Instrumentos de medir velocidades
narrower: Instrumentos de medir viscosidade
narrower: Instrumentos de medir volumes

Instrumentos de medir ângulos
type: Concept
in scheme: Tesauro SIPA
preferred label: Tools for measuring angles @en
broader: Instrumentos de medir
narrower: Esquadro
narrower: Inclinómetro
narrower: Transferidor

Esquadro
type: Concept
in scheme: Tesauro SIPA
preferred label: Set square @en
preferred label: Équerre @fr
preferred label: Squadra @it
broader: Instrumentos de medir ângulos
narrower: Esquadro de ângulos
narrower: Esquadro de encosto com nível
narrower: Suta

Esquadro de ângulos
type: Concept
in scheme: Tesauro SIPA
preferred label: Angle iron @en
broader: Esquadro

Esquadro de encosto com nível
type: Concept
in scheme: Tesauro SIPA
preferred label: Angle bracket with level @en
broader: Esquadro

Suta
type: Concept
scope note: Tipo de esquadro com partes móveis que permite medir e traçar ângulos, sendo muito utilizada em trabalhos como carpintaria e marcenaria para transferir ângulos entre peças
in scheme: Tesauro SIPA
preferred label: Bevel @en
broader: Esquadro

Inclinómetro
type: Concept
scope note: Instrumento utilizado para medir ângulos de inclinação
in scheme: Tesauro SIPA
preferred label: Inclinometer @en
preferred label: Inclinomètre @fr
preferred label: Inclinometro @it
broader: Instrumentos de medir ângulos

Transferidor
type: Concept
in scheme: Tesauro SIPA
preferred label: Protractor @en
preferred label: Rapporteur @fr
preferred label: Goniometro @it
broader: Instrumentos de medir ângulos

Instrumentos de medir comprimentos
type: Concept
in scheme: Tesauro SIPA
preferred label: Length measuring tools @en
broader: Instrumentos de medir
narrower: Fita métrica
narrower: Metro
narrower: Régua

Fita métrica
type: Concept
in scheme: Tesauro SIPA
preferred label: Tape measure @en
preferred label: Ruban à mesurer @fr
preferred label: Metro a nastro @it
broader: Instrumentos de medir comprimentos

Metro
type: Concept
in scheme: Tesauro SIPA
preferred label: Meter @en
preferred label: Mètre @fr
preferred label: Metre @it
broader: Instrumentos de medir comprimentos
narrower: Metro articulado

Metro articulado
type: Concept
in scheme: Tesauro SIPA
preferred label: Folding ruler @en
broader: Metro

Régua
type: Concept
in scheme: Tesauro SIPA
preferred label: Ruler @en
preferred label: Règle graduée @fr
preferred label: Regolo @it
broader: Instrumentos de medir comprimentos
narrower: Escala metálica

Escala metálica
type: Concept
in scheme: Tesauro SIPA
preferred label: Metal ruler @en
broader: Régua

Instrumentos de medir distâncias
type: Concept
in scheme: Tesauro SIPA
preferred label: Distance measuring tools @en
broader: Instrumentos de medir
narrower: Distanciómetro

Distanciómetro
type: Concept
scope note: Aparelho eletrónico que serve para medir distâncias, utilizado em topografia e construção civil. Utiliza feixes de luz, como lasers, ou ondas de rádio para determinar a distância entre o aparelho e o ponto desejado
in scheme: Tesauro SIPA
preferred label: Distance meter @en
preferred label: Télémètre @fr
preferred label: Distanziometro @it
broader: Instrumentos de medir distâncias

Instrumentos de medir elementos climáticos
type: Concept
in scheme: Tesauro SIPA
preferred label: Tools for measuring hygrometric condition @en
broader: Instrumentos de medir
narrower: Higrógrafo
narrower: Termohigrómetro

Higrógrafo
type: Concept
scope note: Instrumento utilizado para a medição contínua da humidade relativa do ar
in scheme: Tesauro SIPA
preferred label: Hygrograph @en
preferred label: Hygrographe @fr
preferred label: Igrografo @it
broader: Instrumentos de medir elementos climáticos

Termohigrómetro
type: Concept
scope note: Instrumento que mede a temperatura e humidade relativa do ar de forma contínua, sendo particularmente útil na monitorização destes valores em espaços que armazenam produtos sensíveis à oscilação destes fatores
in scheme: Tesauro SIPA
preferred label: Thermo-hygrograph @en
preferred label: Thermo-hygrographe @fr
preferred label: Termoigrografo @it
broader: Instrumentos de medir elementos climáticos

Instrumentos de medir o tempo
type: Concept
in scheme: Tesauro SIPA
preferred label: Time measuring instruments @en
broader: Instrumentos de medir
narrower: Ampulheta
narrower: Cronómetro
narrower: Relógio

Ampulheta
type: Concept
scope note: Instrumento de medição de intervalos de tempo. É composta por dois bolbos de vidro, ligados por um canal estreito, por onde passa a areia, através da gravidade e com um fluxo fixo
in scheme: Tesauro SIPA
preferred label: Hourglass @en
preferred label: Ampoulette @fr
preferred label: Ampollina @it
broader: Instrumentos de medir o tempo

Cronómetro
type: Concept
in scheme: Tesauro SIPA
preferred label: Chronometer @en
preferred label: Chronomètre @fr
preferred label: Cronometro @it
broader: Instrumentos de medir o tempo

Relógio
type: Concept
in scheme: Tesauro SIPA
preferred label: Montre @fr
preferred label: Orologio @it
preferred label: Watch; Clock @en
broader: Instrumentos de medir o tempo

Instrumentos de medir superfícies
type: Concept
in scheme: Tesauro SIPA
preferred label: Tools for measuring surfaces @en
broader: Instrumentos de medir
narrower: Planímetro

Planímetro
type: Concept
scope note: Instrumento utilizado para medir a área de uma superfície plana arbitrária, em desenho técnico
in scheme: Tesauro SIPA
preferred label: Planimeter @en
preferred label: Planimètre @fr
broader: Instrumentos de medir superfícies

Instrumentos de medir temperatura
type: Concept
in scheme: Tesauro SIPA
preferred label: Temperature measuring tools @en
broader: Instrumentos de medir
narrower: Termómetro

Termómetro
type: Concept
scope note: Instrumento utilizado para medir a temperatura
in scheme: Tesauro SIPA
preferred label: Thermometer @en
preferred label: Thermomètre @fr
preferred label: Termometro @it
broader: Instrumentos de medir temperatura

Instrumentos de medir velocidades
type: Concept
in scheme: Tesauro SIPA
preferred label: Speed measuring tools @en
broader: Instrumentos de medir
narrower: Anemómetro
narrower: Velocímetro

Anemómetro
type: Concept
scope note: Instrumento utilizado para medir a velocidade do vento, sendo particularmente utilizado em estações ou postos meteorológicos
in scheme: Tesauro SIPA
preferred label: Anemometer @en
preferred label: Anémomètre @fr
preferred label: Anemometro @it
broader: Instrumentos de medir velocidades

Velocímetro
type: Concept
scope note: Instrumento utilizado para medir a velocidade de deslocação de um corpo
in scheme: Tesauro SIPA
preferred label: Tachymètre @fr
preferred label: Tachimetro @it
preferred label: Speedometer; Velocimeter @en
broader: Instrumentos de medir velocidades

Instrumentos de medir viscosidade
type: Concept
in scheme: Tesauro SIPA
preferred label: Viscosity measuring tools @en
broader: Instrumentos de medir
narrower: Viscosímetro

Viscosímetro
type: Concept
in scheme: Tesauro SIPA
preferred label: Viscosimètre @fr
preferred label: Viscosimetro @it
preferred label: Viscometer; Viscosimeter @en
broader: Instrumentos de medir viscosidade

Instrumentos de medir volumes
type: Concept
in scheme: Tesauro SIPA
preferred label: Volume measuring tools @en
broader: Instrumentos de medir
narrower: Fanga

Fanga
type: Concept
scope note: Objeto correspondente a uma antiga unidade de medida de capacidade portuguesa, equivalendo a quatro alqueires
in scheme: Tesauro SIPA
preferred label: Fanègue @fr
preferred label: Bushel; Coomb @en
broader: Instrumentos de medir volumes

Instrumentos de registo gráfico
type: Concept
in scheme: Tesauro SIPA
preferred label: Graphic recording tools @en
broader: Instrumentos segundo a função
narrower: Bedame (Instrumentos de registo gráfico)
narrower: Cálamo
narrower: Caneta
narrower: Compasso de marcação ou de desenho
narrower: Estilete
narrower: Graminho
narrower: Lápis
narrower: Pena de ave
narrower: Pincel
narrower: Riscador

Bedame (Instrumentos de registo gráfico)
type: Concept
in scheme: Tesauro SIPA
preferred label: Crosscut chisel (Graphic recording tools) @en
preferred label: Bédane @fr
broader: Instrumentos de registo gráfico

Cálamo
type: Concept
scope note: Instrumento obtido de uma cana ou junco, cortado obliquamente, usado para escrever em superfícies como o papiro ou o pergaminho
in scheme: Tesauro SIPA
preferred label: Calamus @en
preferred label: Calame @fr
preferred label: Calamo @it
broader: Instrumentos de registo gráfico

Caneta
type: Concept
in scheme: Tesauro SIPA
preferred label: Penna @it
preferred label: Pen @en
preferred label: Stylo @fr
broader: Instrumentos de registo gráfico

Compasso de marcação ou de desenho
type: Concept
in scheme: Tesauro SIPA
preferred label: Compass for marking or drawing @en
preferred label: Compas @fr
preferred label: Compasso @it
broader: Instrumentos de registo gráfico
narrower: Compasso de ponta de ferro
narrower: Compasso de ponta de lápis

Compasso de ponta de ferro
type: Concept
in scheme: Tesauro SIPA
preferred label: Iron point compass @en
broader: Compasso de marcação ou de desenho

Compasso de ponta de lápis
type: Concept
in scheme: Tesauro SIPA
preferred label: Pencil point compass @en
broader: Compasso de marcação ou de desenho

Estilete
type: Concept
in scheme: Tesauro SIPA
preferred label: Stylus @en
preferred label: Stylet @fr
preferred label: Stiletto @it
broader: Instrumentos de registo gráfico

Graminho
type: Concept
scope note: Instrumento utilizado para traçar linhas paralelas a uma borda ou superfície
in scheme: Tesauro SIPA
preferred label: Marking gauge @en
preferred label: Trusquin @fr
preferred label: Truschino @it
broader: Instrumentos de registo gráfico

Lápis
type: Concept
in scheme: Tesauro SIPA
preferred label: Pencil @en
preferred label: Crayon @fr
preferred label: Matita @it
broader: Instrumentos de registo gráfico

Pena de ave
type: Concept
in scheme: Tesauro SIPA
preferred label: Bird feather @en
preferred label: Plume d'oiseau @fr
preferred label: Piuma di uccello @it
broader: Instrumentos de registo gráfico
narrower: Pena de corvo
narrower: Pena de galo
narrower: Pena de ganso
narrower: Pena de pato
narrower: Pena de pavão

Pena de corvo
type: Concept
in scheme: Tesauro SIPA
preferred label: -- @en
broader: Pena de ave

Pena de galo
type: Concept
in scheme: Tesauro SIPA
preferred label: -- @en
broader: Pena de ave

Pena de ganso
type: Concept
in scheme: Tesauro SIPA
preferred label: -- @en
broader: Pena de ave

Pena de pato
type: Concept
in scheme: Tesauro SIPA
preferred label: -- @en
broader: Pena de ave

Pena de pavão
type: Concept
in scheme: Tesauro SIPA
preferred label: -- @en
broader: Pena de ave

Pincel
type: Concept
in scheme: Tesauro SIPA
preferred label: Brush @en
preferred label: Brosse @fr
preferred label: Spazzola @it
broader: Instrumentos de registo gráfico

Riscador
type: Concept
scope note: Objeto utilizado para marcar ou fazer linhas em materiais diversos
in scheme: Tesauro SIPA
preferred label: Scratching pen @en
preferred label: Gratte-papier @fr
broader: Instrumentos de registo gráfico

Instrumentos de verificar planos
type: Concept
in scheme: Tesauro SIPA
preferred label: Plan checking tools @en
broader: Instrumentos segundo a função
narrower: Fio blue
narrower: Nível
narrower: Prumo (Instrumentos de verificar planos)

Fio blue
type: Concept
scope note: Instrumento composto por um recipiente que contém um fio de algodão enrolado no seu interior e dentro do qual se deita um corante azul em pó, que vai impregnar esse fio. O fio é posteriormente esticado em tensão sobre o paramento onde se pretende fazer a marcação. É então puxado à mão, perpendicularmente ao paramento, ao embater o pó azul fica depositado na superfície criando uma linha de marcação. Destina-se a marcar linhas orientadoras sobre alvenarias em tosco, geralmente para a aplicação de revestimentos, aberturas de roços e outros procedimentos
in scheme: Tesauro SIPA
preferred label: Blue chalk @en
broader: Instrumentos de verificar planos

Nível
type: Concept
in scheme: Tesauro SIPA
preferred label: Level @en
preferred label: Niveau @fr
preferred label: Livella @it
broader: Instrumentos de verificar planos

Prumo (Instrumentos de verificar planos)
type: Concept
in scheme: Tesauro SIPA
preferred label: Plumb (Hand lead) @en
preferred label: Plomb à main @fr
preferred label: Piombo (Sonda a mano) @it
broader: Instrumentos de verificar planos
narrower: Fio de prumo

Fio de prumo
type: Concept
scope note: Instrumento utilizado para verificar a verticalidade de um plano, como paredes, garantindo o seu alinhamento. Consiste num fio com um peso numa das pontas, que cai verticalmente com a força da gravidade, estabelecendo uma linha vertical perfeita
in scheme: Tesauro SIPA
preferred label: Plumb line @en
preferred label: Fil à plomb @fr
preferred label: Filo a piombo @it
broader: Prumo (Instrumentos de verificar planos)

Instrumentos musicais
type: Concept
in scheme: Tesauro SIPA
preferred label: Musical instruments @en
preferred label: Instruments de musique @fr
preferred label: Strumenti musicali @it
broader: Instrumentos segundo a função
narrower: Bandolim
narrower: Carrilhão
narrower: Cítara
narrower: Órgão (Instrumentos musicais)

Bandolim
type: Concept
scope note: Instrumento musical de cordas, pertencente à família dos cordofones, com formato periforme e costas abauladas ou retas. Tem origem em Itália, no século XVI, relacionado com o alaúde
in scheme: Tesauro SIPA
preferred label: Mandolin @en
preferred label: Mandoline @fr
preferred label: Mandolino @it
broader: Instrumentos musicais

Carrilhão
type: Concept
scope note: Instrumento composto por um conjunto de sinos, afinados e aptos a tocar uma peça musical, movidos por cordas ou por um jogo de martelos acionados por um mecanismo manual ou uma pedaleira
in scheme: Tesauro SIPA
preferred label: Charillon @en
preferred label: Carillon @fr
preferred label: Concerto di campane @it
broader: Instrumentos musicais

Cítara
type: Concept
in scheme: Tesauro SIPA
preferred label: Zither @en
preferred label: Cithare @fr
preferred label: Cetra @it
broader: Instrumentos musicais

Órgão (Instrumentos musicais)
type: Concept
scope note: Instrumento musical que funciona a teclas e ar comprimido, composto por três partes distintas, mas interligadas, os foles, a tubagem e os registos, cujo som é comandado a partir de uma consola, onde surge a bancada do organista e onde se implantam os botões dos registos, as pedaleiras e de um a cinco teclados cromáticos, correspondentes aos possíveis cinco grandes agrupamentos de sonoridades, o grande órgão, o positivo, o recitativo, a bombarda e o eco. A estrutura funciona a partir da entrada do ar, fornecido pelos foles, em pequenos reservatórios, de onde partem tubos para o cerne do órgão, o someiro, que recebe o ar sob pressão, havendo uma espécie de válvulas que não permitem o seu retrocesso; o someiro possui pequenos orifícios, onde correm réguas, que acionadas pelas teclas, se movem, permitindo a entrada do ar nos tubos, no caso das flautas de maiores dimensões, que não assentam diretamente no someiro, permitindo a emissão dos sons. Cada órgão possui vários registos, com sonoridades distintas, conseguindo-se, entre eles, inúmeras combinações, acionadas por pedais existentes junto às pedaleiras, provocando as misturas; além destas, é possível adicionar efeitos de crescendo, obtidos pelas janelas venezianas, que abrem lentamente, fazendo soar os tubos das bombardas, encerrados numa caixa. Podem surgir, ainda, efeitos mecânicos, que emitem alguns sons específicos, como o canto das aves, ou fazem mover figuras que tocam instrumentos. Os órgãos têm origem numa forma primitiva de instrumento de sopro, a siringe ou flauta de Pã, adicionada a uma caixa de ressonância, com referências muito antigas, nomeadamente no Antigo Testamento. O primeiro exemplar organístico teria surgido cerca de 250 a.C., sendo a sua autoria atribuída ao matemático Ctesíbio de Alexandria, que consistia num órgão hidráulico, conhecido através de terracotas e dos tratados de Hero Alexandrino (120 a.C.) e de Vitrúvio. Foi largamente utilizado no mundo romano e bizantino, em festas particulares, …
in scheme: Tesauro SIPA
preferred label: Organ (Musical instruments) @en
preferred label: Orgue @fr
preferred label: Organo @it
broader: Instrumentos musicais
narrower: Caixa de órgão
narrower: Mecanismo do órgão
narrower: Órgão segundo a secção
narrower: Órgão segundo o tipo

Caixa de órgão
type: Concept
scope note: Estrutura, normalmente de madeira, entalhada ou não, com grau variável de decoração, que encerra o mecanismo ou parte do mecanismo do órgão, servindo, simultaneamente, de caixa de ressonância e de mistura de sons, antes destes serem captados pelo ouvinte
in scheme: Tesauro SIPA
preferred label: Organ case @en
preferred label: Buffet d'orgue @fr
preferred label: Cassa d'organo @it
broader: Órgão (Instrumentos musicais)
narrower: Castelo (Caixa de órgão)
narrower: Consola (Caixa de órgão)
narrower: Gelosia (Caixa de órgão)
narrower: Nicho (Caixa de órgão)
narrower: Tribuna de órgão

Castelo (Caixa de órgão)
type: Concept
scope note: Cada um dos elementos proeminentes de uma caixa de órgão, onde se dispõem as flautas de maiores dimensões e, normalmente, rematada por cornijas e estatuária, intercalados por nichos, com flautas menores, por vezes sobrepostos
in scheme: Tesauro SIPA
preferred label: Castle (Organ case) @en
broader: Caixa de órgão

Consola (Caixa de órgão)
type: Concept
scope note: Zona inferior da caixa do órgão, correspondente à bancada de comando do organista, onde se instalam os teclados, as pedaleiras, pedais e botões de registo. Por vezes, pode aparecer decorada com talha ou pintura
in scheme: Tesauro SIPA
preferred label: Console (Organ case) @en
preferred label: Console @fr
preferred label: Consolle @it
broader: Caixa de órgão
narrower: Consola em janela

Consola em janela
type: Concept
scope note: Consola rasgada na caixa do órgão, formando um retângulo, onde se integram o(s) teclado(s), flanqueada pelos botões de registo
in scheme: Tesauro SIPA
preferred label: Window console @en
broader: Consola (Caixa de órgão)

Gelosia (Caixa de órgão)
type: Concept
scope note: Elemento vazado e, frequentemente, decorado, pendente do topo de um castelo ou um nicho, escondendo a zona superior das flautas. Nos castelos, dispõem-se em cortina, imitando os drapeados de uma boca de cena e, nos nichos, em harpa, acompanhando a disposição diatónica das flautas
in scheme: Tesauro SIPA
preferred label: Swell (Organ case) @en
broader: Caixa de órgão

Nicho (Caixa de órgão)
type: Concept
scope note: Cada um dos elementos intermédios e com flautas de pequenas dimensões, compreendido entre os castelos
in scheme: Tesauro SIPA
preferred label: Niche (Organ case) @en
broader: Caixa de órgão

Tribuna de órgão
type: Concept
scope note: Estrutura sobre-elevada, composta por um varandim com guarda, assente numa ou mais mísulas, onde se instala o organista para aceder aos seus mecanismos e onde repousa parte ou a totalidade do órgão
in scheme: Tesauro SIPA
preferred label: Organ loft @en
broader: Caixa de órgão

Mecanismo do órgão
type: Concept
scope note: Conjunto de elementos de vários tipos, que permitem o funcionamento deste instrumento, compostos pelos elementos que injetam o ar no interior (os foles), a zona de dedilhação e escolha de som do organista (registos), os tubos de condução de ar e as flautas
in scheme: Tesauro SIPA
preferred label: Organ mechanism @en
preferred label: Mécanisme d'orgue @fr
preferred label: Meccanismo dell'organo @it
broader: Órgão (Instrumentos musicais)
narrower: Tubos
narrower: Foles
narrower: Pedaleira
narrower: Registos
narrower: Someiro (Órgão)
narrower: Teclado

Tubos
type: Concept
scope note: Os tubos de um órgão são agrupados segundo as características de execução, formando os registos ou jogos, e cada grupo deve possuir tantos quantos as notas de cada teclado.
in scheme: Tesauro SIPA
preferred label: Organ pipes @en
preferred label: Tubes d'orgue @fr
preferred label: Tubi d'organo @it
broader: Mecanismo do órgão
narrower: Flautas

Flautas
type: Concept
scope note: As flautas dividem-se em duas categorias, flautados abertos ou fechados e flautas de palheteria. Os primeiros são simples, produzindo um único som pela vibração do ar na passagem pelo seu interior, emitindo sons ou notas variadas consoante a sua dimensão. São de várias dimensões e executadas em vários materiais, como madeira, papelão e, as mais importantes, de bronze, o denominado bronze de prumo, uma liga com os componentes equilibrados, para que o som sai mais perfeito. O seu número varia consoante as dimensões do órgão, podendo ascender, no caso de um órgão completo e de grandes dimensões, a cerca de 1600 tubos
in scheme: Tesauro SIPA
preferred label: Flutes @en
preferred label: Flûtes @fr
preferred label: Flauti @it
broader: Tubos
narrower: Tubos de palheta

Tubos de palheta
type: Concept
scope note: Tipo de flautas que funciona por ressonância, sendo o som produzido por uma lâmina metálica, acionada pela compressão do ar no tubo
in scheme: Tesauro SIPA
preferred label: Reed pipes @en
broader: Flautas
narrower: Tubos em leque

Tubos em leque
type: Concept
scope note: Flautas de palheta, dispostas na horizontal, na base das caixas do órgão, permitindo a projeção direta do som, sendo a sua disposição em leque mais conseguida, uma vez que as ondas acústicas se propagam, no interior de um edifício, em ziguezague, ajudando à clareza do som. São típicas da organaria ibérica e utilizadas num tipo musical local, que imita a sonoridade das batalhas
in scheme: Tesauro SIPA
preferred label: Fan pipes @en
broader: Tubos de palheta

Foles
type: Concept
scope note: Elementos que têm por função alimentar de ar o interior do instrumento. Atualmente, este é feito através de um ventilador acionado por um mecanismo pneumático ou electropneumático, mas, até ao século XIX, era efetuado através de amplos foles, executados em pele e madeira, acionados pela força humana (pelo foleiro)
in scheme: Tesauro SIPA
preferred label: Bellows @en
broader: Mecanismo do órgão

Pedaleira
type: Concept
in scheme: Tesauro SIPA
preferred label: Pedalboard @en
preferred label: Pédalier @fr
preferred label: Pedaliera @it
broader: Mecanismo do órgão

Registos
type: Concept
scope note: Os registos ou jogos correspondem a grupos de flautas, com características de execução semelhante e que emitem todas as notas de um instrumento musical. Os principais jogos de flautas imitam os sons dos seguintes instrumentos: Montras (contrabaixo e diapasão), Gambas (violão, violino, dulcina e voz celeste), flautas de pavilhão (corne), bordões (trompa e flauta doce), bordões tapados (flauta tapada). É possível combinar sons de vários agrupamentos de flautas, as misturas, surgindo as misturas compostas (címbalos, carrilhão e corneta), palheta livre (clarinete e corne inglês) e palheta batente (bombarda, trompete, clarim, trombone, fagote, oboé, cromorno, clarinete e museta)
in scheme: Tesauro SIPA
preferred label: Registres @fr
preferred label: Registri @it
preferred label: Records; Registers @en
broader: Mecanismo do órgão
narrower: Botões dos registos

Botões dos registos
type: Concept
scope note: Elementos existentes junto à consola, que, ao serem puxados pelo organista, acionam um conjunto de flautas, estando, normalmente, identificados com uma inscrição, permitindo identificar o instrumento ou o som que permitem emitir
in scheme: Tesauro SIPA
preferred label: Record bottons; Drawknobs @en
broader: Registos

Someiro (Órgão)
type: Concept
scope note: Enorme caixa existente no interior do órgão, constituindo o centro de funcionamento do instrumento, fazendo confluir o ar para as flautas, todas elas ligadas diretamente à caixa, onde encaixam em pequenos orifícios, ou através de tubos, no caso das flautas de grandes dimensões; o ar entra nas flautas, quando as réguas que existem no interior dos someiros são movidas pelo organista, através da pressão nas teclas
in scheme: Tesauro SIPA
preferred label: Wind chest @en
preferred label: Sommier @fr
preferred label: Somiere @it
broader: Mecanismo do órgão

Teclado
type: Concept
scope note: Cada um dos conjuntos de botões bicromáticos, que acionam cada um dos registos sonoros de um órgão, podendo ir de um teclado a cinco.
in scheme: Tesauro SIPA
preferred label: Clavier @fr
preferred label: Tastiera @it
preferred label: Keyboard; Manual @en
broader: Mecanismo do órgão

Órgão segundo a secção
type: Concept
in scheme: Tesauro SIPA
preferred label: Organ by division @en
preferred label: Orgue par section @fr
preferred label: Organo secondo la sezione @it
broader: Órgão (Instrumentos musicais)
narrower: Bombarda
narrower: Eco
narrower: Expressivo
narrower: Grande órgão
narrower: Positivo
narrower: Recitativo

Bombarda
type: Concept
scope note: Secção que aciona os registos de palheta
in scheme: Tesauro SIPA
preferred label: Bombarde @en
broader: Órgão segundo a secção

Eco
type: Concept
scope note: Secção cujos tubos por norma se encontram encerrados dentro de uma caixa, passível de ser aberta ou fechada através de mecanismo próprio, vulgarmente sob a forma de pedal
in scheme: Tesauro SIPA
preferred label: Echo @en
preferred label: Écho @fr
broader: Órgão segundo a secção

Expressivo
type: Concept
scope note: Secção correspondente a um grupo de tubos encerrados numa caixa com persianas, controladas por um pedal, que, ao abrir, permitem diferentes sonoridades e timbres.
in scheme: Tesauro SIPA
preferred label: Expressive @en
preferred label: Expressif @fr
preferred label: Espressivo @it
broader: Órgão segundo a secção

Grande órgão
type: Concept
scope note: Secção fundamental do órgão, mais nutrida e mais sonora, cujo teclado pode estar acoplado ao teclado das demais secções, acionando-as em conjunto.
in scheme: Tesauro SIPA
preferred label: Grand orgue @fr
preferred label: Grande organo @it
preferred label: Grand organ (Hauptwerk) @en
broader: Órgão segundo a secção

Positivo
type: Concept
scope note: Secção com registos mais agudos e percetíveis, normalmente prestando-se bem para a prática de música de câmara. A maior parte dos órgãos possui esta secção e, em alguns casos, em órgãos de menor dimensão, apenas existe esta secção.
in scheme: Tesauro SIPA
preferred label: Orgue positif @fr
preferred label: Organo positivo @it
preferred label: Positive organ; Choir organ @en
broader: Órgão segundo a secção

Recitativo
type: Concept
scope note: Secção que integra vários registos para tocar a solo.
in scheme: Tesauro SIPA
preferred label: Swell organ @en
broader: Órgão segundo a secção

Órgão segundo o tipo
type: Concept
in scheme: Tesauro SIPA
preferred label: Organ by type @en
preferred label: Orgue par type @fr
preferred label: Organo secondo il tipo @it
broader: Órgão (Instrumentos musicais)
narrower: Órgão hidráulico
narrower: Órgão portativo
narrower: Órgão positivo de armário

Órgão hidráulico
type: Concept
in scheme: Tesauro SIPA
preferred label: Hydraulic organ @en
preferred label: Orgue hydraulique @fr
preferred label: Organo idraulico @it
broader: Órgão segundo o tipo

Órgão portativo
type: Concept
in scheme: Tesauro SIPA
preferred label: Portative organ @en
preferred label: Orgue portatif @fr
preferred label: Organo portativo/ Organetto @it
broader: Órgão segundo o tipo

Órgão positivo de armário
type: Concept
in scheme: Tesauro SIPA
preferred label: Cased positive organ @en
broader: Órgão segundo o tipo

Mobiliário
type: Concept
in scheme: Tesauro SIPA
preferred label: Furniture @en
preferred label: Meublier @fr
preferred label: Mobili @it
broader: Objetos, Equipamentos, Mobiliário e Veículos
narrower: Componentes genéricos do mobiliário
narrower: Mobiliário específico
narrower: Mobiliário genérico

Componentes genéricos do mobiliário
type: Concept
in scheme: Tesauro SIPA
preferred label: Generic furniture components @en
broader: Mobiliário
narrower: Ferragens

Ferragens
type: Concept
scope note: Elementos metálicos e, por extensão, de outros materiais, que constituem acessórios estruturais ou decorativos de uma porta ou janela, como a fechadura, sistemas de fecho e dobradiças.
in scheme: Tesauro SIPA
preferred label: Ferrure @fr
preferred label: Ferrame @it
preferred label: Iron fitting; Hardware @en
broader: Componentes genéricos do mobiliário
narrower: Aldrava
narrower: Dobradiça

Aldrava
type: Concept
scope note: Ferragem em forma de argola ou pequeno elemento de metal, simples ou com espelho, que permite emitir som ao bater numa porta. Pode assumir formas decorativas zoomórficas
in scheme: Tesauro SIPA
preferred label: Heurtoir @fr
preferred label: Battente @it
preferred label: Knocker; Latch @en
alternative label: Aldraba
alternative label: Batente (Ferragens)
alternative label: Chamador
broader: Ferragens
narrower: Espelho (Aldrava)

Espelho (Aldrava)
type: Concept
scope note: Peça metálica onde bate a aldrava de uma porta.
in scheme: Tesauro SIPA
preferred label: Mirror Knocker; Doorjamb (Doorpost) @en
broader: Aldrava

Dobradiça
type: Concept
scope note: Ferragem de metal ou madeira, formada por duas partes, unidas por um eixo móvel, que lhes permite movimentar uma ou ambas as partes, aplicada às folhas e protetores de portas ou janelas.
in scheme: Tesauro SIPA
preferred label: Hinge @en
preferred label: Charnière @fr
preferred label: Cerniera @it
alternative label: Charneira
alternative label: Fixa
broader: Ferragens
narrower: Bisagra
narrower: Gonzo
narrower: Leme
narrower: Fechadura
narrower: Ferrolho
narrower: Tranca

Bisagra
type: Concept
scope note: Tipo de dobradiça
in scheme: Tesauro SIPA
preferred label: Old style hinge @en
broader: Dobradiça

Gonzo
type: Concept
scope note: Ferragem de metal, composta por duas pranchas, aplicada a uma porta ou janela, permitindo que se dobrem ou rodem.
in scheme: Tesauro SIPA
preferred label: Knuckle @en
preferred label: Gond @fr
preferred label: Ganghero @it
broader: Dobradiça

Leme
type: Concept
scope note: Eixo da dobradiça de uma porta ou janela.
in scheme: Tesauro SIPA
preferred label: Rudder @en
alternative label: Taramela
broader: Dobradiça
narrower: Fêmea (Leme)
narrower: Macho (Leme)

Fêmea (Leme)
type: Concept
scope note: Uma das peças que constitui o leme da dobradiça, formada por uma ranhura, onde encaixa a sua oposta.
in scheme: Tesauro SIPA
preferred label: Female (Rudder) @en
broader: Leme

Macho (Leme)
type: Concept
scope note: Uma das peças que constitui o leme da dobradiça, formada por um elemento saliente, que encaixa na sua oposta.
in scheme: Tesauro SIPA
preferred label: Male (Rudder) @en
alternative label: Eixo
broader: Leme

Fechadura
type: Concept
scope note: Elemento metálico ou de outros materiais, nomeadamente madeira, que constitui um pequeno mecanismo, que, aplicado a portas e janelas, permite que estas sejam trancadas, garantindo a segurança
in scheme: Tesauro SIPA
preferred label: Lock @en
preferred label: Serrure @fr
preferred label: Serratura @it
broader: Dobradiça
narrower: Componentes da fechadura
narrower: Espagnolette

Componentes da fechadura
type: Concept
in scheme: Tesauro SIPA
preferred label: Lock components @en
broader: Fechadura
narrower: Escudete
narrower: Espelho (Componentes da fechadura)
narrower: Fecho
narrower: Lingueta
narrower: Maçaneta
narrower: Muleta (Componentes da fechadura)

Escudete
type: Concept
scope note: Ferragem que protege o orifício da fechadura, onde penetra a chave para o acionar
in scheme: Tesauro SIPA
preferred label: Escutcheon @en
broader: Componentes da fechadura

Espelho (Componentes da fechadura)
type: Concept
scope note: Ferragem que envolve a ranhura onde é introduzida a chave, podendo apresentar-se simples ou com decoração profusa.
in scheme: Tesauro SIPA
preferred label: Mirror (Lock components) @en
broader: Componentes da fechadura

Fecho
type: Concept
in scheme: Tesauro SIPA
preferred label: Clasp @en
preferred label: Fermoir @fr
preferred label: Chiusura @it
broader: Componentes da fechadura

Lingueta
type: Concept
scope note: Elemento prismático que sai da fechadura e entra no fecho, permitindo o encerramento de uma porta
in scheme: Tesauro SIPA
preferred label: Latch @en
preferred label: Pêne @fr
preferred label: Stanghetta @it
broader: Componentes da fechadura

Maçaneta
type: Concept
scope note: Componente de uma fechadura, que a faz mover por ação manual, podendo apresentar-se em vários materiais (madeira, metal, porcelana, vidro, cristal...).
in scheme: Tesauro SIPA
preferred label: Maniglia @it
preferred label: Doorknob @en
preferred label: Poignée @fr
broader: Componentes da fechadura

Muleta (Componentes da fechadura)
type: Concept
scope note: Componente de uma fechadura, de forma alongada, que a faz mover por acção manual, podendo apresentar-se em vários materiais (madeira, metal, porcelana...).
in scheme: Tesauro SIPA
preferred label: Lock lever @en
preferred label: Levier de serrure @fr
preferred label: Levetta @it
broader: Componentes da fechadura

Espagnolette
type: Concept
in scheme: Tesauro SIPA
preferred label: Espagnolette fitting @en
broader: Fechadura

Ferrolho
type: Concept
scope note: Ferragem que constitui uma tranca horizontal que corre entre elementos protetores, as armelas, permitindo uma maior segurança em portas e janelas
in scheme: Tesauro SIPA
preferred label: Bolt @en
preferred label: Panneton @fr
preferred label: Chiavistello @it
broader: Dobradiça
narrower: Cremona

Cremona
type: Concept
scope note: Ferrolho colocado na batente da folha de uma janela ou porta, permitindo que esta se tranque na base e/ou no topo
in scheme: Tesauro SIPA
preferred label: Cremone bolt @en
preferred label: Crémone @fr
preferred label: Serratura cremonese @it
broader: Ferrolho

Tranca
type: Concept
scope note: Barra de ferro ou madeira, aplicada transversalmente ao interior de uma porta ou janela impedindo a sua abertura pelo exterior
in scheme: Tesauro SIPA
preferred label: Deadbolt; Bar lock @en
preferred label: Verrou @fr
preferred label: Spranga @it
alternative label: Motira
broader: Dobradiça

Mobiliário específico
type: Concept
in scheme: Tesauro SIPA
preferred label: Specific furniture @en
preferred label: Mobili specifici @it
preferred label: Meublier spécifique @fr
broader: Mobiliário
narrower: Mobiliário comercial
narrower: Mobiliário judicial
narrower: Mobiliário recreativo
narrower: Mobiliário religioso

Mobiliário comercial
type: Concept
in scheme: Tesauro SIPA
preferred label: Commercial furniture @en
preferred label: Meublier commercial @fr
preferred label: Mobili commerciali @it
broader: Mobiliário específico
narrower: Balcão (Mobiliário genérico)

Balcão (Mobiliário genérico)
type: Concept
scope note: Móvel colocado num espaço comercial a separar o proprietário do cliente
in scheme: Tesauro SIPA
preferred label: Counter @en
preferred label: Comptoir @fr
preferred label: Balcone @it
broader: Mobiliário comercial

Mobiliário judicial
type: Concept
in scheme: Tesauro SIPA
preferred label: Judicial furniture @en
preferred label: Mobilier judiciaire @fr
preferred label: Mobili giudiziari @it
broader: Mobiliário específico
narrower: Torre do júri

Torre do júri
type: Concept
scope note: Espaço composto por vários assentos, rodeados por uma vedação, onde se senta o júri durante um julgamento em tribunal.
in scheme: Tesauro SIPA
preferred label: Jury tower @en
preferred label: Tour du jury @fr
preferred label: Torre della giuria @it
broader: Mobiliário judicial

Mobiliário recreativo
type: Concept
in scheme: Tesauro SIPA
preferred label: Recreational furniture @en
preferred label: Mobilier de loisirs @fr
preferred label: Mobili per il tempo libero @it
broader: Mobiliário específico
narrower: Baloiço
narrower: Carrossel
narrower: Escorrega

Baloiço
type: Concept
in scheme: Tesauro SIPA
preferred label: Swing @en
preferred label: Balançoire @fr
preferred label: Dondolo @it
broader: Mobiliário recreativo

Carrossel
type: Concept
in scheme: Tesauro SIPA
preferred label: Giostra @it
preferred label: Manège @fr
preferred label: Merry-go-round @en
broader: Mobiliário recreativo

Escorrega
type: Concept
in scheme: Tesauro SIPA
preferred label: Slide @en
preferred label: Toboggan @fr
preferred label: Scivolo @it
broader: Mobiliário recreativo

Mobiliário religioso
type: Concept
in scheme: Tesauro SIPA
preferred label: Religious furniture @en
preferred label: Mobilier religieux @fr
preferred label: Mobiliare religioso @it
broader: Mobiliário específico
narrower: Mobiliário religioso segundo a função

Mobiliário religioso segundo a função
type: Concept
in scheme: Tesauro SIPA
preferred label: Religious furniture according to function @en
preferred label: Mobilier religieux selon la fonction @fr
preferred label: Mobili religiosi secondo la funzione @it
broader: Mobiliário religioso
narrower: Mobiliário religioso de ablução e de aspersão
narrower: Mobiliário religioso de apoio
narrower: Mobiliário religioso de armazenamento

Mobiliário religioso de ablução e de aspersão
type: Concept
in scheme: Tesauro SIPA
preferred label: Religious ablution and sprinkling furniture @en
preferred label: Mobilier religieux pour ablution et aspersion @fr
preferred label: Mobili per abluzioni e aspersioni religiose @it
broader: Mobiliário religioso segundo a função
narrower: Lavabo de refeitório
narrower: Lavabo de sacristia
narrower: Pia de água benta

Lavabo de refeitório
type: Concept
scope note: Estrutura com água perene ou com pequeno reservatório, situado junto à entrada do espaço de refeição de uma casa monástica-conventual, podendo ostentar profusa decorativa.
in scheme: Tesauro SIPA
preferred label: Canteen washbasin @en
broader: Mobiliário religioso de ablução e de aspersão

Lavabo de sacristia
type: Concept
scope note: Estrutura com água perene ou com pequeno reservatório, situado na sacristia, permitindo aos celebrantes, lavarem as mãos antes e depois das cerimónias litúrgicas. O tamanho é variável, consoante se integre numa pequena capela ou num mosteiro de grandes dimensões
in scheme: Tesauro SIPA
preferred label: Lavabo de sacristie @fr
preferred label: Lavabo da sacrestia @it
preferred label: Vestry washbasin (Sacristy) @en
broader: Mobiliário religioso de ablução e de aspersão

Pia de água benta
type: Concept
scope note: Recetáculo para colocar a água lustral, permitindo aos fiéis benzerem-se e purificarem-se ao entrarem num templo. Pode surgir adossada à parede ou mesmo embutida à mesma, ou na forma de uma estrutura assente em coluna; não é incomum surgirem inscritas nas colunas que suportam o coro-alto
in scheme: Tesauro SIPA
preferred label: Holy water font @en
preferred label: Bénitier @fr
preferred label: Fontana da sacrestia @it
broader: Mobiliário religioso de ablução e de aspersão

Mobiliário religioso de apoio
type: Concept
in scheme: Tesauro SIPA
preferred label: Supporting religious furniture @en
preferred label: Mobilier religieux d'appui @fr
preferred label: Mobili religiosi di sostegno @it
broader: Mobiliário religioso segundo a função
narrower: Ábaco (Mobiliário religioso de apoio)
narrower: Mesa de confraria
narrower: Mesa de fábrica
narrower: Mesa de sacristia
narrower: Nicho de alfaias (Mobiliário religioso de apoio)
narrower: Sanefão
narrower: Suporte da cortina do Santíssimo

Ábaco (Mobiliário religioso de apoio)
type: Concept
scope note: Mesa, prateleira ou consola adossada a uma parede, junto a um altar, onde se colocam as alfaias necessárias às celebrações litúrgicas. Localizada normalmente na capela-mor, junto ao altar, pode aparecer isolada, no lado do Evangelho, ou em número de duas, dispostas simetricamente. Utilizada pelos celebrantes como suporte de alfaias (candelabro, cálice, missal) durante as celebrações litúrgicas, tende a substituir, a partir da Idade Média, a forma primitiva do nicho de alfaias embutido nos muros. A mesa ou prateleira é de madeira, por vezes em talha dourada, a que serve o altar-mor de maiores dimensões e com maior aparato decorativo, podendo atingir os 2 metros de comprimento. Pode surgir na forma de pequena consola, também de madeira ou talha dourada. Não deve ter qualquer ornato, imagem ou cruz, sendo apenas coberta com pano de linho.
in scheme: Tesauro SIPA
preferred label: Abacus (Supporting religious furniture) @en
preferred label: Crédence (Mobilier religieux d'appui) @fr
preferred label: Abaco (Mobili religiosi di sostegno) @it
broader: Mobiliário religioso de apoio
narrower: Credência

Credência
type: Concept
scope note: Mesa de decoração elaborada, constituindo a evolução de um ábaco, adossada à parede, junto ao altar-mor, onde se colocam as alfaias necessárias às celebrações litúrgicas. Surge encostada à parede da capela-mor, junto ao altar, podendo aparecer isolada ou em número de duas, dispostas simetricamente. O termo aplica-se na Europa a toda a forma de suportes de alfaias (cálice, caixa de hóstias, patena) utilizadas pelos celebrantes durante as celebrações litúrgicas, aparecendo associado, no mundo mediterrânico, a uma forma específica de mesa difundido a partir do séc. XVII, derivada da consola francesa, uma mesa estreita usada para suporte de vasos e diversos enfeites. São, normalmente, de talha dourada, com profusa decoração fitomórfica, destacando-se a forma dos pés, com estrutura galbada ou volutada e o tampo em mármore ou calcário.
in scheme: Tesauro SIPA
preferred label: Credence @en
preferred label: Crédence @fr
preferred label: Credenza @it
broader: Ábaco (Mobiliário religioso de apoio)

Mesa de confraria
type: Concept
scope note: Mesa à volta da qual se reuniam os membros de uma confraria, periodicamente, para tratar dos assuntos referentes ao funcionamento da mesma. Pode apresentar várias configurações, sendo uma mesa corrida, com cadeiras dispostas ao longo da mesma, ou circular, destinando-se a ser ocupada pelos confrades que dirigem a instituição durante determinado período. Por vezes, apresenta gavetas, onde os membros guardam alguns bens pertencentes à confraria
in scheme: Tesauro SIPA
preferred label: Brotherhood table @en
preferred label: Table de confrérie @fr
preferred label: Tavolo di confraternita @it
broader: Mobiliário religioso de apoio

Mesa de fábrica
type: Concept
scope note: Mesa à volta da qual se reúnem os membros de uma comissão fabriqueira, periodicamente, para tratar dos assuntos referentes ao funcionamento da mesma, podendo ter gavetas para arrecadação de bens e elemento iconográfico, identificador da paróquia
in scheme: Tesauro SIPA
preferred label: Factory table @en
preferred label: Table de fabrique @fr
preferred label: Tavolo di fabbriceria @it
broader: Mobiliário religioso de apoio

Mesa de sacristia
type: Concept
scope note: Mesa situada no interior de uma sacristia, onde o sacerdote coloca os paramentos antes de se revestir
in scheme: Tesauro SIPA
preferred label: Table de sacristie @fr
preferred label: Tavolo di sacrestia @it
preferred label: Vestry table (Sacristy) @en
broader: Mobiliário religioso de apoio

Nicho de alfaias (Mobiliário religioso de apoio)
type: Concept
scope note: Nicho rasgado na espessura de uma parede, junto a um altar, sendo utilizado para depositar as alfaias litúrgicas, durante as cerimónias religiosas. Utilizado pelos celebrantes desde a Idade Média, para depositar as alfaias (cálice, caixa de hóstias, patena), durante a liturgia, é constituído por arco de volta perfeita, apresentando, por vezes, concheado interior e decoração fitomórfica, especialmente no fecho do arco. Executado em cantaria, do tipo dominante na região em que se integram, de calcário, no centro ou Sul do país, e de granito, nas zonas beirãs e no Norte. Utilizado pelos celebrantes desde a Idade Média, para depositar as alfaias (cálice, caixa de hóstias, patena), durante a liturgia, é constituído por arco de volta perfeita, apresentando, por vezes, concheado interior e decoração fitomórfica, especialmente no fecho do arco. Executado em cantaria, do tipo dominante na região em que se integram, de calcário, no centro ou Sul do país, e de granito, nas zonas beirãs e no Norte.
in scheme: Tesauro SIPA
preferred label: Liturgical silverware niche (Supporting religious furniture) @en
broader: Mobiliário religioso de apoio

Sanefão
type: Concept
scope note: Estrutura em talha, dourada, prateada, pintada ou em branco, que surge sobre o arco triunfal, podendo ser simples ou mais complexo, complementando as estruturas dos retábulos colaterais. Pode incluir elementos arquitetónicos, bem como pinturas e esculturas
in scheme: Tesauro SIPA
preferred label: Pelmet; Valance @en
broader: Mobiliário religioso de apoio

Suporte da cortina do Santíssimo
type: Concept
scope note: Objeto móvel, que serve de suporte a uma cortina colocada sobre o altar quando o Santíssimo Sacramento se encontra exposto
in scheme: Tesauro SIPA
preferred label: Holy curtain support @en
preferred label: Écran du Saint Sacrement @fr
preferred label: Supporto per la cortina per il Ss. Sacramento @it
broader: Mobiliário religioso de apoio

Mobiliário religioso de armazenamento
type: Concept
in scheme: Tesauro SIPA
preferred label: Religious storage furniture @en
preferred label: Mobilier religieux de rangement @fr
preferred label: Mobili religiosi d'immagazzinamento @it
broader: Mobiliário religioso segundo a função
narrower: Mobiliário religioso de armazenamento de alfaias
narrower: Mobiliário religioso de armazenamento de objetos de devoção
narrower: Mobiliário religioso de armazenamento de paramentaria
narrower: Mobiliário religioso de assento
narrower: Mobiliário religioso de iluminação
narrower: Mobiliário religioso de pregação, leitura e canto
narrower: Mobiliário religioso devocional
narrower: Mobiliário religioso divisório de espaço
narrower: Mobiliário religioso litúrgico
narrower: Mobiliário religioso para oferendas

Mobiliário religioso de armazenamento de alfaias
type: Concept
in scheme: Tesauro SIPA
preferred label: Religious furniture for storage of implements @en
preferred label: Mobilier religieux pour le stockage des outils @fr
preferred label: Mobili religiosi per lo stoccaggio di attrezzi @it
broader: Mobiliário religioso de armazenamento
narrower: Armário para cálices
narrower: Porta turíbulo

Armário para cálices
type: Concept
scope note: Armário embutido na parede de uma sacristia, fechado por duas portas, por vezes envidraçadas, onde se arrecadam os cálices e demais alfaias litúrgicas
in scheme: Tesauro SIPA
preferred label: Chalice cupboard @en
broader: Mobiliário religioso de armazenamento de alfaias

Porta turíbulo
type: Concept
scope note: Móvel de madeira, alto e com espaldar recortado, tendo suporte alto para dependurar o turíbulo quando não se encontra a ser utilizado. Pode, ainda, possuir um plano para apoiar a naveta e um gancho para dependurar a caldeirinha de água benta
in scheme: Tesauro SIPA
preferred label: Porte-encensoir @fr
preferred label: Portaturibolo @it
preferred label: Thurible holder; Censer stand @en
broader: Mobiliário religioso de armazenamento de alfaias

Mobiliário religioso de armazenamento de objetos de devoção
type: Concept
in scheme: Tesauro SIPA
preferred label: Religious storage furniture for devotional objects @en
preferred label: Mobilier religieux pour ranger les objets de dévotion @fr
preferred label: Mobili religiosi per lo stoccaggio d' oggetti di devozione @it
hidden label: Mobiliário religioso de armazenamento de objectos de devoção
broader: Mobiliário religioso de armazenamento
narrower: Armário para bandeiras
narrower: Armário para relicários
narrower: Ehal

Armário para bandeiras
type: Concept
scope note: Armário alto e estreito, de madeira, adossado à parede de um templo ou anexo deste, destinado a arrecadar as bandeiras processionais, possuindo dois volantes que a encerram e dois orifícios, um superior e outro inferior, por onde passam as hastes de remate e de segurar, respetivamente
in scheme: Tesauro SIPA
preferred label: Flag cabinet @en
preferred label: Armoire à bannières @fr
preferred label: Armadio per stendardi processionali @it
broader: Mobiliário religioso de armazenamento de objetos de devoção

Armário para relicários
type: Concept
scope note: Armário para arrecadar relicários, o qual serve, periodicamente, para os expor aos fiéis
in scheme: Tesauro SIPA
preferred label: Cabinet for reliquaries @en
preferred label: Armoire à reliquaires @fr
preferred label: Armadio per reliquiari @it
broader: Mobiliário religioso de armazenamento de objetos de devoção

Ehal
type: Concept
scope note: Espécie de nicho na parede, onde se guardam os rolos da lei (Tora), na religião judaica
in scheme: Tesauro SIPA
broader: Mobiliário religioso de armazenamento de objetos de devoção

Mobiliário religioso de armazenamento de paramentaria
type: Concept
in scheme: Tesauro SIPA
preferred label: Religious storage furniture for ecclesiastical vestments @en
preferred label: Mobilier religieux de rangement pour vêtements ecclésiastiques @fr
preferred label: Mobili religiosi per la conservazione dei paramenti ecclesiastici @it
broader: Mobiliário religioso de armazenamento
narrower: Arca de sacristia
narrower: Arca para capas
narrower: Arcaz
narrower: Armário de confraria
narrower: Armário de fábrica
narrower: Armário para amictos e sanguíneos
narrower: Armário para capas
narrower: Armário para casulas
narrower: Armário para palas e corporais
narrower: Cabide para capas
narrower: Cómoda para capas
narrower: Cómoda para casulas
narrower: Paramentário

Arca de sacristia
type: Concept
scope note: Móvel em forma de arca, instalado numa sacristia para armazenamento de alfaias e paramentos
in scheme: Tesauro SIPA
preferred label: Vestry chest @en
preferred label: Coffre de sacristie @fr
preferred label: Cassone di sacrestia @it
broader: Mobiliário religioso de armazenamento de paramentaria

Arca para capas
type: Concept
scope note: Móvel em forma de arca, com secção em arco de círculo ou losango, para arrecadar as capas e outros paramentos na posição horizontal
in scheme: Tesauro SIPA
preferred label: Cloak chest @en
preferred label: Chapier-coffre @fr
preferred label: Cassone per piviali @it
broader: Mobiliário religioso de armazenamento de paramentaria

Arcaz
type: Concept
scope note: Móvel de sacristia, de dimensões variáveis e forma corrida, normalmente ocupando a totalidade de uma parede, composto por várias gavetas para a guarda de paramentaria e alfaias, encimado, normalmente, por espaldar entalhado e por oratório central
in scheme: Tesauro SIPA
preferred label: Parament chest (Religious storage furniture for ecclesiastical vestments) @en
preferred label: Chapier (Armoire des ornements sacerdotaux) @fr
preferred label: Cassettone @it
broader: Mobiliário religioso de armazenamento de paramentaria

Armário de confraria
type: Concept
scope note: Armário de madeira ou metálico que serve para arrumar os pertences a uma confraria ou irmandade, podendo ter elemento identificativo da mesma. Pode encontrar-se embutido no muro. Pode surgir um segundo armário para arrecadar o arquivo
in scheme: Tesauro SIPA
preferred label: Brotherhood closet @en
preferred label: Armoire de confrérie @fr
preferred label: Armadio di confraternita @it
broader: Mobiliário religioso de armazenamento de paramentaria

Armário de fábrica
type: Concept
scope note: Armário de madeira ou metálico que serve para arrumar os pertences da comissão fabriqueira de uma paróquia, podendo ter elemento identificativo da mesma. Pode encontrar-se embutido no muro.
in scheme: Tesauro SIPA
preferred label: Factory closet @en
preferred label: Armoire de fabrique @fr
preferred label: Armadio di fabbriceria @it
broader: Mobiliário religioso de armazenamento de paramentaria

Armário para amictos e sanguíneos
type: Concept
scope note: Armário embutido na parede da sacristia, composto por várias gavetas, onde cada frade ou padre guarda os seus amitos e sanguíneos
in scheme: Tesauro SIPA
preferred label: Closet for amice and sanguines @en
preferred label: Armoire pour amicts et purificatoires @fr
preferred label: Armadio per amitti e purificatoi @it
broader: Mobiliário religioso de armazenamento de paramentaria

Armário para capas
type: Concept
scope note: Armário de madeira para guardar capas e outros paramentos, bastante fundo, contendo, no interior, um suporte giratório para as dependurar
in scheme: Tesauro SIPA
preferred label: Cloak closet @en
preferred label: Chapier-armoire @fr
preferred label: Armadio per piviali @it
broader: Mobiliário religioso de armazenamento de paramentaria

Armário para casulas
type: Concept
scope note: Pequeno armário, composto internamente por várias prateleiras de madeira, geralmente forradas a tecido, para guardar as casulas ou outros paramentos
in scheme: Tesauro SIPA
preferred label: Chasuble closet @en
preferred label: Chasublier-armoire @fr
preferred label: Armadio per casule @it
broader: Mobiliário religioso de armazenamento de paramentaria

Armário para palas e corporais
type: Concept
scope note: Armário de pequenas dimensões, composto por várias gavetas, também elas pequenas, para arrecadar as palas e os corporais
in scheme: Tesauro SIPA
preferred label: Closet for pales and corporals @en
preferred label: Armoire pour pales et corporaux @fr
preferred label: Armadio per palle e corporali @it
broader: Mobiliário religioso de armazenamento de paramentaria

Cabide para capas
type: Concept
scope note: Cabide de pé, em madeira, para pendurar uma ou mais capas
in scheme: Tesauro SIPA
preferred label: Cloak rack @en
preferred label: Porte-chape @fr
preferred label: Portapiviale @it
broader: Mobiliário religioso de armazenamento de paramentaria

Cómoda para capas
type: Concept
scope note: Cómoda grande e de gavetas profundas, semicirculares e girantes, para arrecadar, na horizontal, as capas ou outros paramentos
in scheme: Tesauro SIPA
preferred label: Cape dresser @en
preferred label: Chapier-commode @fr
preferred label: Comò per piviali @it
broader: Mobiliário religioso de armazenamento de paramentaria

Cómoda para casulas
type: Concept
scope note: Cómoda com gavetas ou batentes para guardar as casulas ou outros paramentos
in scheme: Tesauro SIPA
preferred label: Chasuble dresser @en
preferred label: Chasublier-commode @fr
preferred label: Comò per casule @it
broader: Mobiliário religioso de armazenamento de paramentaria

Paramentário
type: Concept
scope note: Móvel de madeira para arrecadar paramentaria, em forma de cómoda ou armário, com ou sem espaldar
in scheme: Tesauro SIPA
preferred label: Parament chest @en
preferred label: Armoire des ornements sacerdotaux @fr
preferred label: Mobile per paramenti liturgici @it
broader: Mobiliário religioso de armazenamento de paramentaria

Mobiliário religioso de assento
type: Concept
in scheme: Tesauro SIPA
preferred label: Religious seat furniture @en
preferred label: Mobilier religieux pour siège @fr
preferred label: Mobili religiosi per sedersi @it
broader: Mobiliário religioso de armazenamento
narrower: Mobiliário de assento segundo os utilizadores

Mobiliário de assento segundo os utilizadores
type: Concept
in scheme: Tesauro SIPA
preferred label: Religious seat furniture according to users @en
preferred label: Mobilier d' assise selon les utilisateurs @fr
preferred label: Mobili a sedere secondo gli utenti @it
broader: Mobiliário religioso de assento
narrower: Mobiliário de assento dos assistentes
narrower: Mobiliário de assento dos celebrantes

Mobiliário de assento dos assistentes
type: Concept
scope note: Bancos ou cadeiras, localizados nos templos, na nave e, por vezes, na zona do transepto, destinados aos fiéis que assistem aos atos litúrgicos ou procedem a atos de devoção individuais.
in scheme: Tesauro SIPA
preferred label: Seat furniture for assistants @en
preferred label: Mobilier d’assise des assistants @fr
preferred label: Mobili a sedere degli assistenti @it
broader: Mobiliário de assento segundo os utilizadores
narrower: Mobiliário de assento fixo (assistentes)
narrower: Mobiliário de assento móvel (assistentes)

Mobiliário de assento fixo (assistentes)
type: Concept
in scheme: Tesauro SIPA
preferred label: Fixed-seat furniture @en
preferred label: Mobilier de siège fixe @fr
preferred label: Mobili a sedere fissi @it
broader: Mobiliário de assento dos assistentes
narrower: Cadeiral

Cadeiral
type: Concept
scope note: Conjunto de estalas ou cadeiras existentes num coro, destinados ao clero durantes os ofícios litúrgicos. Cada um deles integra uma espalda, braços e um assento, fixo ou articulado. Pode surgir numa fila única ou em mais filas escalonadas. Alguns assentos ostentam decoração mais elaborada, indicando que se destinam ao clero hierarquicamente mais importante
in scheme: Tesauro SIPA
preferred label: Stalls @en
preferred label: Stalles @fr
preferred label: Stalli del coro @it
broader: Mobiliário de assento fixo (assistentes)
narrower: Cadeiral de confraria
narrower: Cadeiral de família
narrower: Cadeiral de irmandade

Cadeiral de confraria
type: Concept
scope note: Conjunto de assentos de madeira, protegidos ou não por estrutura do mesmo material, destinado aos membros mais importantes ou dirigentes de uma Confraria, sendo colocado na nave, normalmente próximo do altar-mor, ou mesmo na capela-mor. Ostenta as armas do proprietário
in scheme: Tesauro SIPA
preferred label: Sorority stalls @en
preferred label: Stalles de confrérie @fr
preferred label: Stalli di confraternita @it
broader: Cadeiral

Cadeiral de família
type: Concept
scope note: Banco corrido, de madeira, destinado aos membros de uma família importante numa paróquia ou padroeira da mesma, situado na nave, normalmente próximo do altar-mor. Ostenta as armas do proprietário
in scheme: Tesauro SIPA
preferred label: Family stalls @en
broader: Cadeiral

Cadeiral de irmandade
type: Concept
scope note: Conjunto de assentos de madeira, protegidos ou não por estrutura do mesmo material, destinado aos membros mais importantes ou dirigentes de uma Irmandade, sendo colocado na nave, normalmente próximo do altar-mor, ou mesmo na capela-mor. Pode ostentar as armas do proprietário
in scheme: Tesauro SIPA
preferred label: Stalles de confrérie @fr
preferred label: Stalli di confraternita @it
preferred label: Sisterhood stalls @en
broader: Cadeiral

Mobiliário de assento móvel (assistentes)
type: Concept
in scheme: Tesauro SIPA
preferred label: Mobile seat furniture @en
preferred label: Mobilier de sièges mobiles @fr
preferred label: Mobili di sedile mobile @it
broader: Mobiliário de assento dos assistentes
narrower: Banco de fábrica
narrower: Banco de família
narrower: Banco de igreja
narrower: Cadeira de igreja

Banco de fábrica
type: Concept
scope note: Banco corrido, situado na nave ou no transepto, destinado à comissão fabriqueira, responsável pela manutenção da totalidade do templo ou da capela-mor. Feito em madeira, simples ou entalhado, compõem-se pelo assento e pelo espaldar, que pode exibir elementos decorativos e, eventualmente, uma inscrição identificativa da fábrica a que se encontra associado. Sob o assento, podem surgir gavetas ou caixas destinadas a arrecadar os bens da mesma.
in scheme: Tesauro SIPA
preferred label: Factory bench @en
preferred label: Banc d'ouvre @fr
preferred label: Banco d' Opera @it
broader: Mobiliário de assento móvel (assistentes)

Banco de família
type: Concept
scope note: Banco corrido situado na zona da nave ou transepto, destinado a uma família, padroeira de um templo ou de parte deste. Feito de madeira, é composto pelo assento e espaldar, liso ou decorado, apresentando a pedra de armas do proprietário, relevada ou pintada.
in scheme: Tesauro SIPA
preferred label: Family bench @en
preferred label: Banc de famille @fr
preferred label: Banco di famiglia @it
broader: Mobiliário de assento móvel (assistentes)

Banco de igreja
type: Concept
scope note: Banco corrido existente na nave e / ou no transepto, destinado aos fiéis, normalmente móvel, mas podendo estar fixo e solidário a outros bancos similares, dispostos em fileiras regulares. Executado em madeira, é composto por assento e espaldar.
in scheme: Tesauro SIPA
preferred label: Church bench @en
preferred label: Banc de fidèle @fr
preferred label: Banco da chiesa @it
broader: Mobiliário de assento móvel (assistentes)
narrower: Banco genuflexório

Banco genuflexório
type: Concept
scope note: Banco corrido existente na nave e / ou no transepto, destinado aos fiéis, executado em madeira e composto por assento, espaldar e genuflexório frontal, que integra elemento para apoio dos joelhos.
in scheme: Tesauro SIPA
preferred label: Agenouilloir @fr
preferred label: Inginocchiatoio (Sgabello) @it
preferred label: Kneeling bench; Kneeler; Prie-dieu @en
broader: Banco de igreja

Cadeira de igreja
type: Concept
scope note: Conjunto de assentos individuais, normalmente de madeira, para uso dos fiéis, podendo ter um apoio para os cotovelos. Algumas podem estar ligadas entre si, formando uma fila
in scheme: Tesauro SIPA
preferred label: Church chair @en
preferred label: Chaise d'église @fr
preferred label: Sedia da chiesa @it
broader: Mobiliário de assento móvel (assistentes)
narrower: Cadeira com genuflexório

Cadeira com genuflexório
type: Concept
scope note: Cadeira com uma zona almofadada sob o assento articulado, destinada a apoiar os joelhos, com espalda e pequena almofada para apoio dos cotovelos
in scheme: Tesauro SIPA
preferred label: Chaise prie-Dieu @fr
preferred label: Sedia-inginocchiatoio @it
preferred label: Kneeling chair; Chair with kneeler @en
broader: Cadeira de igreja

Mobiliário de assento dos celebrantes
type: Concept
scope note: Bancos ou cadeiras, localizados no interior de um templo, na capela-mor, transepto ou coro, destinados ao clero que preside aos atos litúrgicos. A localização mais comum é no topo da capela-mor, junto ao altar, onde são dispostas três cadeiras, a central destinada ao celebrante principal e as laterais aos cocelebrantes ou aos diáconos assistentes; nas faces laterais, podem surgir várias cadeiras, destinadas ao demais clero (acólitos e chantres). No caso de se tratar de um templo de ordens religiosas, surgem assentos dispostos no(s) coro(s), destinados aos elementos da ordem, que acompanham as cerimónias com cânticos.
in scheme: Tesauro SIPA
preferred label: Seat furniture of celebrants @en
preferred label: Mobilier de siège des célébrants @fr
preferred label: Mobili per sedersi dei celebranti @it
broader: Mobiliário de assento segundo os utilizadores
narrower: Mobiliário de assento fixo (celebrantes)
narrower: Mobiliário de assento móvel (celebrantes)

Mobiliário de assento fixo (celebrantes)
type: Concept
in scheme: Tesauro SIPA
preferred label: Fixed-seat furniture @en
preferred label: Mobilier de siège fixe @fr
preferred label: Mobili a sedere fissi @it
broader: Mobiliário de assento dos celebrantes
narrower: Banco de êxedra
narrower: Cadeiral de coro

Banco de êxedra
type: Concept
scope note: Banco ou bancos corridos, dispostos numa abside, em hemiciclo, adaptando-se ao perfil da mesma. Apareceram nas basílicas paleocristãs, destinados aos celebrantes, sendo centradas por uma cátedra episcopal. São feitos em pedra ou, mais raramente, em madeira.
in scheme: Tesauro SIPA
preferred label: Exedra bench @en
preferred label: Banc d'exèdre @fr
preferred label: Sedile d'esedra @it
broader: Mobiliário de assento fixo (celebrantes)

Cadeiral de coro
type: Concept
scope note: Conjunto de cadeiras fixas, em madeira, colocadas no coro-alto ou baixo, destinado aos religiosos regulares, composto por um conjunto de cadeiras, dispostas em U e viradas para a capela-mor, podendo ter duas ordens de cadeiras, a posterior mais elevada e com espalda, decorada ou não. O assento é móvel, normalmente possuindo uma misericórdia
in scheme: Tesauro SIPA
preferred label: Stalli del coro @it
preferred label: Choir stalls @en
preferred label: Stalles de choeur @fr
alternative label: Estala
broader: Mobiliário de assento fixo (celebrantes)
narrower: Espaldar (Cadeiral de coro)
narrower: Misericórdia

Espaldar (Cadeiral de coro)
type: Concept
scope note: Estrutura de talha ou madeira em branco, que se ergue sobre a última fila de um cadeiral de coro monástico-conventual, ostentando apainelados, ornados com pinturas de santos ou cenas alusivas à ordem religiosa, ou com elementos decorativos. Em alguns casos, pode conter relicários embutidos na estrutura
in scheme: Tesauro SIPA
preferred label: Backrest (Choir stalls) @en
preferred label: Dossier (Stalles de choir) @fr
preferred label: Schienale (Stalli del coro) @it
broader: Cadeiral de coro

Misericórdia
type: Concept
scope note: Mísula decorada ou não, colocada no reverso de um assento articulado, permitindo ao utilizador encostar-se à mesma enquanto permanecia de pé durante os atos litúrgicos
in scheme: Tesauro SIPA
preferred label: Mercy seat (Choir stalls) @en
preferred label: Miséricorde (Stalles de choir) @fr
preferred label: Misericordia (Stalli del coro) @it
broader: Cadeiral de coro

Mobiliário de assento móvel (celebrantes)
type: Concept
in scheme: Tesauro SIPA
preferred label: Mobile seat furniture @en
preferred label: Mobilier de sièges mobiles @fr
preferred label: Mobili di sedile mobile @it
broader: Mobiliário de assento dos celebrantes
narrower: Banco de celebrante
narrower: Banco de coro
narrower: Banqueta de celebrante
narrower: Cadeira de celebrante
narrower: Cadeira de leitor
narrower: Cadeirão de celebrante
narrower: Cátedra abacial
narrower: Cátedra episcopal
narrower: Faldistório
narrower: Mocho de celebrante
narrower: Tamborete de celebrante
narrower: Trono papal
narrower: Trono pontifical

Banco de celebrante
type: Concept
scope note: Assento em forma de banco, utilizado nas concelebrações
in scheme: Tesauro SIPA
preferred label: Celebrant bench @en
preferred label: Banc de célébrant @fr
preferred label: Banco del celebrante @it
broader: Mobiliário de assento móvel (celebrantes)

Banco de coro
type: Concept
scope note: Banco ou bancos corridos, dispostos no coro, podendo ser fixo, reservado ao clero menor, acólitos e cantores
in scheme: Tesauro SIPA
preferred label: Choir bench @en
preferred label: Banc de choeur @fr
preferred label: Banco del coro @it
broader: Mobiliário de assento móvel (celebrantes)

Banqueta de celebrante
type: Concept
scope note: Pequeno banco, podendo ser estofado, utilizado nas concelebrações
in scheme: Tesauro SIPA
preferred label: Celebrant stool @en
preferred label: Banquette de célébrant @fr
preferred label: Panchetta del celebrante @it
broader: Mobiliário de assento móvel (celebrantes)

Cadeira de celebrante
type: Concept
scope note: Cadeira utilizada nas concelebrações, em número de duas, que centram a cadeira do celebrante principal
in scheme: Tesauro SIPA
preferred label: Celebrant chair @en
preferred label: Chaise de célébrant @fr
preferred label: Sedia del celebrante @it
broader: Mobiliário de assento móvel (celebrantes)

Cadeira de leitor
type: Concept
scope note: Cadeira com assento alto e inclinado, permitindo ao leitor estar sentado, mas dando a sensação de que se encontra de pé
in scheme: Tesauro SIPA
preferred label: Reading chair @en
preferred label: Chaise de lecteur @fr
preferred label: Sedia del lettore @it
broader: Mobiliário de assento móvel (celebrantes)

Cadeirão de celebrante
type: Concept
scope note: Cadeirão estofado utilizado nas concelebrações, reservada ao principal celebrante, podendo ser ladeado por dois assentos semelhantes, mas de menores dimensões
in scheme: Tesauro SIPA
preferred label: Celebrant armchair @en
preferred label: Fauteuil de célébrant @fr
preferred label: Poltrona del celebrante @it
broader: Mobiliário de assento móvel (celebrantes)

Cátedra abacial
type: Concept
scope note: Cadeira destinada a um abade, colocado no coro e em zona sobre-elevada
in scheme: Tesauro SIPA
preferred label: Poltrona del celebrante @it
preferred label: Trône abbatial @fr
preferred label: Abbey chair @en
broader: Mobiliário de assento móvel (celebrantes)

Cátedra episcopal
type: Concept
scope note: Cadeirão reservado ao bispo ou arcebispo, existente numa catedral, colocado sobre um estrado de três degraus
in scheme: Tesauro SIPA
preferred label: Trône épiscopal @fr
preferred label: Cattedra episcopale @it
preferred label: Episcopal chair @en
broader: Mobiliário de assento móvel (celebrantes)

Faldistório
type: Concept
scope note: Cadeira de braços utilizada nas cerimónias litúrgicas, dobrável, com os pés cruzados e sem espalda, reservado aos prelados hierarquicamente superiores. É revestida a tecido e possui uma almofada, que serve de genuflexório
in scheme: Tesauro SIPA
preferred label: Faldstool @en
preferred label: Faldistoire @fr
preferred label: Faldistorio @it
broader: Mobiliário de assento móvel (celebrantes)

Mocho de celebrante
type: Concept
scope note: Assento semelhante a um tamborete, sem estofo, utilizado nas concelebrações. Surge sempre em número de dois, a ladear o assento do celebrante principal
in scheme: Tesauro SIPA
preferred label: Celebrant stool @en
preferred label: Escabeau de célébrant @fr
preferred label: Sgabello del celebrante @it
broader: Mobiliário de assento móvel (celebrantes)

Tamborete de celebrante
type: Concept
scope note: Pequeno banco com tecido, bastante baixo, utilizado nas celebrações litúrgicas. Surge em número de dois, a ladear o assento do celebrante principal
in scheme: Tesauro SIPA
preferred label: Sgabello del celebrante @it
preferred label: Celebrant footstool @en
preferred label: Tabouret de célébrant @fr
broader: Mobiliário de assento móvel (celebrantes)
narrower: Tamborete de chantre

Tamborete de chantre
type: Concept
scope note: Assento em forma de banco, composto por um degrau e assento bastante elevado, destinado ao chantre, permitindo-lhe estar sentado, parecendo estar de pé. Pode ser colocado no coro litúrgico
in scheme: Tesauro SIPA
preferred label: Chorister footstool @en
preferred label: Tabouret de chantre @fr
preferred label: Sgabello del cantore @it
broader: Tamborete de celebrante

Trono papal
type: Concept
scope note: Trono destinado ao Papa, possuindo, no remate, as suas armas e emblemas litúrgicos. Em algumas ocasiões, pode ser transportado em ombros, transformando-se numa sedia gestatória
in scheme: Tesauro SIPA
preferred label: Papal throne @en
preferred label: Trône papal @fr
preferred label: Trono papale @it
broader: Mobiliário de assento móvel (celebrantes)
narrower: Sedia gestatória

Sedia gestatória
type: Concept
scope note: Trono papal que, em determinadas cerimónias, era transportado em ombros.
in scheme: Tesauro SIPA
preferred label: Gestatorial chair (Sedia gestatoria) @en
preferred label: Sedia gestatoria @it
broader: Trono papal

Trono pontifical
type: Concept
scope note: Assento imponente, destinado ao abade, bispo ou Papa, revestido a tecido, podendo ser encimado por baldaquino.
in scheme: Tesauro SIPA
preferred label: Pontificial throne @en
preferred label: Trône pontifical @fr
preferred label: Cattedra pontificale @it
broader: Mobiliário de assento móvel (celebrantes)

Mobiliário religioso de iluminação
type: Concept
in scheme: Tesauro SIPA
preferred label: Religious lighting furniture @en
preferred label: Mobilier religieux d' éclairage @fr
preferred label: Mobili religiosi di illuminazione @it
broader: Mobiliário religioso de armazenamento
narrower: Luminárias fixas (Mobiliário religioso de iluminação)
narrower: Luminárias móveis (Mobiliário religioso de iluminação)

Luminárias fixas (Mobiliário religioso de iluminação)
type: Concept
in scheme: Tesauro SIPA
preferred label: Fixtures (Religious lighting furniture) @en
broader: Mobiliário religioso de iluminação
narrower: Lampadário

Lampadário
type: Concept
scope note: Suporte de dois ou mais lumes, suspenso do teto, destinado a velas, lamparinas ou lâmpadas.
in scheme: Tesauro SIPA
preferred label: Lustre d' église @fr
preferred label: Lampadario da chiesa @it
preferred label: Chandelier; Lampadaire @en
broader: Luminárias fixas (Mobiliário religioso de iluminação)

Luminárias móveis (Mobiliário religioso de iluminação)
type: Concept
in scheme: Tesauro SIPA
preferred label: Movable luminaires (Religious lighting furniture) @en
broader: Mobiliário religioso de iluminação
narrower: Anjo tocheiro
narrower: Candeeiro das trevas
narrower: Tocheiro

Anjo tocheiro
type: Concept
scope note: Figura antropomórfica alada, de dimensões distintas, sustentando uma tocha, para colocar velas, que acendiam durante os momentos litúrgicos. Existem anjos tocheiros de capela, colocados à entrada da mesma, e anjos tocheiros de retábulo, colocados nos vários degraus do trono ou à entrada do mesmo
in scheme: Tesauro SIPA
preferred label: Torch angel @en
broader: Luminárias móveis (Mobiliário religioso de iluminação)

Candeeiro das trevas
type: Concept
scope note: Candelabro de grandes dimensões, de forma triangular, utilizado durante o Ofício das Trevas, durante a Semana Santa, altura em que é colocado junto ao altar-mor. A zona superior é composta por treze ou quinze lumes
in scheme: Tesauro SIPA
preferred label: Chandelier des Ténèbres @fr
preferred label: Saettia @it
preferred label: Lamp of darkness @en
alternative label: Candelabro das trevas
alternative label: Tenebrário
alternative label: Tocheiro de coro
broader: Luminárias móveis (Mobiliário religioso de iluminação)

Tocheiro
type: Concept
scope note: Suporte de um lume para velas, de dimensões variadas, surgindo alguns de grandes dimensões, a iluminar espaços de culto, ou de menores dimensões, colocados sobre a banqueta de um altar
in scheme: Tesauro SIPA
preferred label: Torch holder @en
preferred label: Chandelier @fr
preferred label: Candelabro @it
broader: Luminárias móveis (Mobiliário religioso de iluminação)
narrower: Tocheiro pascal

Tocheiro pascal
type: Concept
scope note: Suporte de grandes dimensões e de um lume bastante largo para albergar o círio pascal
in scheme: Tesauro SIPA
preferred label: Paschal torch holder @en
preferred label: Chandelier pascal @fr
preferred label: Candelabro per il cero pasquale @it
broader: Tocheiro

Mobiliário religioso de pregação, leitura e canto
type: Concept
in scheme: Tesauro SIPA
preferred label: Religious furniture for preaching, reading and singing @en
preferred label: Mobilier religieux pour la prédication, la lecture et le chant @fr
preferred label: Mobili religiosi per predicare, leggere e cantare @it
broader: Mobiliário religioso de armazenamento
narrower: Ambão
narrower: Estante de coro
narrower: Facistol
narrower: Jubéu
narrower: Púlpito

Ambão
type: Concept
scope note: Tipo de tribuna fixa, com uma ou mais estantes, fechada por parapeito e colocada à entrada da capela-mor ou do coro, surgindo em número de duas, uma no lado do Evangelho e outra no da Epístola
in scheme: Tesauro SIPA
preferred label: Ambo @en
preferred label: Ambon @fr
preferred label: Ambone @it
broader: Mobiliário religioso de pregação, leitura e canto

Estante de coro
type: Concept
scope note: Móvel utilizado nos edifícios monástico-conventuais, nos coros, com quatro faces inclinadas, permitindo a colocação dos livros de cantochão, visíveis por todos os religiosos e podendo ter o suporte rotativo.
in scheme: Tesauro SIPA
preferred label: Lectern @en
preferred label: Lutrin @fr
preferred label: Leggio @it
alternative label: Estante de cantochão
broader: Mobiliário religioso de pregação, leitura e canto

Facistol
type: Concept
scope note: Estante de coro, com o plano inclinado sustentado por uma águia de asas abertas
in scheme: Tesauro SIPA
preferred label: Grand lutrin @fr
preferred label: Faldstool; Falsistory @en
preferred label: Leggio del coro; Faldistorio @it
broader: Mobiliário religioso de pregação, leitura e canto

Jubéu
type: Concept
scope note: Elemento da grade do coro onde era lido o Evangelho. Em forma de tribuna, era composto por uma plataforma elevada sobre o coro, com guarda e marcado pela existência de uma cruz ou de um Calvário
in scheme: Tesauro SIPA
preferred label: Jube @en
preferred label: Jubé @fr
preferred label: Pontile @it
broader: Mobiliário religioso de pregação, leitura e canto

Púlpito
type: Concept
scope note: Estrutura sobre-elevada, colocada no centro da nave de um templo católico, destinado à pregação. Pode surgir adossado a uma coluna ou à parede, com acesso por escadas, ou elevado, com acesso por uma porta e por um corredor rasgado na espessura do muro do edifício. É composto por uma bacia, circular, quadrangular, a mais comum, ou poligonal, assente em mísula, com guarda plena ou vazada, sendo encimado por um guarda-voz, que protege o pregador e cria os efeitos acústicos necessário à colocação da voz. Esta estrutura vem substituir o ambão e prolifera a partir do século XVI, podendo aparecer dois em cada templo, confrontantes, permitindo disputas entre os pregadores
in scheme: Tesauro SIPA
preferred label: Pulpit @en
preferred label: Chaire à prêcher @fr
preferred label: Pulpito @it
broader: Mobiliário religioso de pregação, leitura e canto
narrower: Púlpito móvel
narrower: Púlpito segundo a localização

Púlpito móvel
type: Concept
scope note: Púlpito executado em materiais leves, permitindo o seu transporte para onde for necessário o ato de pregar
in scheme: Tesauro SIPA
preferred label: Mobile pulpit @en
preferred label: Chaire à prêcher mobile @fr
preferred label: Pulpito mobile @it
broader: Púlpito

Púlpito segundo a localização
type: Concept
in scheme: Tesauro SIPA
preferred label: Pulpit according to location @en
preferred label: Chaire à prêcher en fonction de l'emplacement @fr
preferred label: Pulpito in base alla posizione @it
broader: Púlpito
narrower: Púlpito de refeitório
narrower: Púlpito exterior

Púlpito de refeitório
type: Concept
scope note: Estrutura colocada numa das paredes do refeitório de um edifício monástico-conventual, onde um dos religiosos se entregava à leitura de obras teológicas durante a refeição. Surge sobre-elevado, com acesso por escadas ou pela espessura do muro. Em algumas ordens religiosas, pode apresentar um atril para a colocação dos livros
in scheme: Tesauro SIPA
preferred label: Canteen pulpit @en
preferred label: Chaire de lecture @fr
preferred label: Pulpito da refettorio @it
broader: Púlpito segundo a localização

Púlpito exterior
type: Concept
scope note: Púlpito colocado no exterior de um templo, normalmente junto a capelas de pequenas dimensões, permitindo, no exterior, reunir um maior número de fiéis. Surgem, normalmente, associados a capelas com a invocação do Calvário, permitindo a pregação exterior nas festividades pascais e no final da procissão da Via Sacra
in scheme: Tesauro SIPA
preferred label: Exterior pulpit @en
broader: Púlpito segundo a localização

Mobiliário religioso devocional
type: Concept
in scheme: Tesauro SIPA
preferred label: Devotional religious furniture @en
preferred label: Mobilier religieux dévotionnel @fr
preferred label: Mobili religiosi devozionali @it
broader: Mobiliário religioso de armazenamento
narrower: Altar votivo
narrower: Genuflexório
narrower: Maquineta
narrower: Presépio

Altar votivo
type: Concept
in scheme: Tesauro SIPA
preferred label: Votive altar @en
preferred label: Autel de dévotion @fr
preferred label: Altare di monumento devocionale @it
broader: Mobiliário religioso devocional

Genuflexório
type: Concept
scope note: Peça de mobiliário em madeira, composta por uma zona almofadada para ajoelhar e outra zona também almofadada para apoiar os cotovelos, que serve para orar, podendo possuir, no caso de ser individual, prateleiras ou gavetas para arrecadação de livros
in scheme: Tesauro SIPA
preferred label: Prie-Dieu @fr
preferred label: Inginocchiatoio @it
preferred label: Genuflexorium (Prie-dieu) @en
broader: Mobiliário religioso devocional

Maquineta
type: Concept
scope note: Estrutura de talha ou madeira em branco, envidraçada, onde se coloca uma imagem ou uma composição religiosa
in scheme: Tesauro SIPA
preferred label: Sacrarium @en
preferred label: Paradis @fr
preferred label: Scarabattolo @it
broader: Mobiliário religioso devocional

Presépio
type: Concept
scope note: Cena religiosa, normalmente encerrada numa maquineta, de dimensões e número de figuras e acessórios variáveis, representando a Natividade, mas podendo ter várias cenas associadas. As figuras são de madeira, barro (o mais comum) ou papel. Se for um presépio de grandes dimensões, pode contar todo o ciclo da Natividade e cenas da Infância de Cristo. A montagem dos presépios tem origem nas representações ao vivo, nascidas na Idade Média, impulsionadas pelos Franciscanos
in scheme: Tesauro SIPA
preferred label: Christmas crib @en
preferred label: Crèche @fr
preferred label: Presepio @it
broader: Mobiliário religioso devocional

Mobiliário religioso divisório de espaço
type: Concept
in scheme: Tesauro SIPA
preferred label: Religious space partition furniture @en
preferred label: Mobilier religieux séparant l'espace @fr
preferred label: Mobili religiosi divisori @it
broader: Mobiliário religioso de armazenamento
narrower: Grade de batistério
narrower: Grade de capela
narrower: Grade de coro
narrower: Grade de coro monástico
narrower: Grade de cripta
narrower: Grade de parlatório
narrower: Grade de schola cantorum
narrower: Grade regral
narrower: Guarda-vento
narrower: Iconostase
narrower: Teia (Mobiliário religioso divisório de espaço)

Grade de batistério
type: Concept
scope note: Elemento de madeira ou metal, normalmente vazado, possuindo uma folha central ou dividindo-se em duas, permitindo o acesso à zona onde se encontra a pia batismal. No caso de existir um batistério, esta fecha o arco de acesso; quando a pia batismal se encontra isolada, a grade rodeia toda a estrutura, protegendo-a
in scheme: Tesauro SIPA
preferred label: Baptistery grille @en
preferred label: Clôture des fonts baptismaux @fr
preferred label: Recinzione del fonte battesimale @it
broader: Mobiliário religioso divisório de espaço

Grade de capela
type: Concept
scope note: Elemento de madeira ou metal, normalmente vazado, possuindo uma folha central ou dividindo-se em duas, permitindo o acesso à zona onde se encontra um altar, com culto. No caso das Capelas dedicadas ao Santíssimo Sacramento, onde este era ou é exposto, surge sempre uma grade de metal ou madeira entalhada e dourada, a proteger a entrada da mesma
in scheme: Tesauro SIPA
preferred label: Chapel grille @en
preferred label: Clôture de chapelle @fr
preferred label: Recinzione di cappella @it
broader: Mobiliário religioso divisório de espaço

Grade de coro
type: Concept
scope note: Elemento de metal, normalmente vazado, com acesso por duas folhas centrais, que isola um coro litúrgico, situado no centro da igreja ou na zona do transepto
in scheme: Tesauro SIPA
preferred label: Choir grille @en
preferred label: Clôture de choeur @fr
preferred label: Recinzione del coro @it
broader: Mobiliário religioso divisório de espaço

Grade de coro monástico
type: Concept
scope note: Elemento de metal, normalmente vazado, possuindo uma ou duas folhas centrais, permitindo o acesso ao coro, servindo para dividir a zona de clausura da zona dos fiéis, num templo
in scheme: Tesauro SIPA
preferred label: Monastich choir grille @en
preferred label: Clôture de choeur monastique @fr
preferred label: Recinzione del coro monastico @it
broader: Mobiliário religioso divisório de espaço

Grade de cripta
type: Concept
scope note: Elemento, normalmente metálico, que protege a entrada numa cripta no interior de um templo
in scheme: Tesauro SIPA
preferred label: Crypt grille @en
preferred label: Clôture de confession @fr
preferred label: Recinzione della confessione @it
broader: Mobiliário religioso divisório de espaço

Grade de parlatório
type: Concept
scope note: Elemento metálico, chumbado nas paredes que o emolduram, por vezes duplo, fechando o vão que permite, numa casa monástico-conventual, a troca de palavras entre os religiosos e os familiares que os visitam
in scheme: Tesauro SIPA
preferred label: Parlatory grille @en
broader: Mobiliário religioso divisório de espaço

Grade de schola cantorum
type: Concept
scope note: Elemento metálico, normalmente vazado, que, nos antigos templos, dividia a zona baixa do coro, reservada aos cantores
in scheme: Tesauro SIPA
preferred label: Schola cantorum grille @en
preferred label: Clôture de scola cantorum @fr
preferred label: Recinzione della schola cantorum @it
broader: Mobiliário religioso divisório de espaço

Grade regral
type: Concept
scope note: Porta metálica que fecha a porta regral, podendo ser dupla
in scheme: Tesauro SIPA
preferred label: Regral grille @en
broader: Mobiliário religioso divisório de espaço

Guarda-vento
type: Concept
scope note: Estrutura de madeira entalhada ou de madeira e vidro, que protege o interior do templo do vento e frio que penetra através das portas de acesso ao imóvel
in scheme: Tesauro SIPA
preferred label: Windguard @en
preferred label: Tambour de porte @fr
preferred label: Bussola @it
broader: Mobiliário religioso divisório de espaço

Iconostase
type: Concept
scope note: Estrutura divisória em cantaria, por vezes de origem semipreciosa, que divide a nave da capela-mor nas igrejas de rito oriental, apresentando-se arquitravada e encimada por escultura, ostentando vários ícones no corpo principal
in scheme: Tesauro SIPA
preferred label: Iconostasis @en
preferred label: Iconostasi @it
alternative label: Pérgula (Mobiliário religioso divisório de espaço)
alternative label: Trave triunfal
broader: Mobiliário religioso divisório de espaço

Teia (Mobiliário religioso divisório de espaço)
type: Concept
scope note: Estrutura de madeira, ferro ou cantaria, de pequenas dimensões e que veda o acesso a determinados espaços litúrgicos dentro de um templo
in scheme: Tesauro SIPA
preferred label: Web (Religious space partition furniture) @en
preferred label: Clôture (Mobilier religieux séparant l'espace) @fr
preferred label: Recinzione (Mobili religiosi divisori) @it
broader: Mobiliário religioso divisório de espaço
narrower: Teia de altar
narrower: Teia de batistério
narrower: Teia de capela
narrower: Teia de nave
narrower: Teia de presbitério

Teia de altar
type: Concept
scope note: Estrutura de madeira, ferro ou cantaria, de pequenas dimensões e que veda o acesso a uma altar com culto
in scheme: Tesauro SIPA
preferred label: Altar web @en
preferred label: Clôture d' autel @fr
preferred label: Recinzione di altare @it
broader: Teia (Mobiliário religioso divisório de espaço)

Teia de batistério
type: Concept
scope note: Estrutura de madeira, ferro ou cantaria que isola numa nave o espaço destinado ao batismo, onde se encontra a pia batismal
in scheme: Tesauro SIPA
preferred label: Clôture des fonts baptismaux @fr
preferred label: Recinzione del fonte battesimale @it
preferred label: Baptistery web @en
broader: Teia (Mobiliário religioso divisório de espaço)

Teia de capela
type: Concept
scope note: Estrutura de madeira, ferro ou cantaria, de pequenas dimensões e que veda o acesso ao interior de uma capela com culto
in scheme: Tesauro SIPA
preferred label: Clôture de chapelle @fr
preferred label: Recinzione di cappella @it
preferred label: Chapel web @en
broader: Teia (Mobiliário religioso divisório de espaço)

Teia de nave
type: Concept
scope note: Estrutura de madeira, ferro ou cantaria, de pequenas dimensões e que envolve a zona central da nave, protegendo as capelas laterais e criando um corredor de circulação, normalmente mais elevado.
in scheme: Tesauro SIPA
preferred label: Aisle web @en
preferred label: Clôture de la nef @fr
preferred label: Recinzione della navata @it
broader: Teia (Mobiliário religioso divisório de espaço)

Teia de presbitério
type: Concept
scope note: Estrutura de madeira, ferro ou cantaria, de pequenas dimensões e que veda o acesso à zona do cruzeiro do transepto, protegendo o altar-mor, localizado nesta zona
in scheme: Tesauro SIPA
preferred label: Presbytery web @en
alternative label: Teia comungatória
broader: Teia (Mobiliário religioso divisório de espaço)

Mobiliário religioso litúrgico
type: Concept
in scheme: Tesauro SIPA
preferred label: Liturgical religious furniture @en
preferred label: Mobilier religieux liturgique @fr
preferred label: Mobili religiosi liturgici @it
broader: Mobiliário religioso de armazenamento
narrower: Mobiliário batismal
narrower: Mobiliário de confissão
narrower: Mobiliário eucarístico

Mobiliário batismal
type: Concept
in scheme: Tesauro SIPA
preferred label: Baptismal furniture @en
preferred label: Mobilier de baptême @fr
preferred label: Mobili battesimali @it
broader: Mobiliário religioso litúrgico
narrower: Pia batismal
narrower: Piscina (Mobiliário batismal)

Pia batismal
type: Concept
scope note: Taça hemisférica ou poligonal, para onde é vertida a água do batismo, durante o processo deste sacramento, tendo um processo de escoamento da água para o solo ou para canalização; encontra-se total ou parcialmente tapada com tampa de madeira ou outro material. Divulga-se a partir do século XIV, a substituir o batismo por imersão, praticado em piscinas
in scheme: Tesauro SIPA
preferred label: Font @en
preferred label: Fons baptismaux @fr
preferred label: Fonte battesimale @it
broader: Mobiliário batismal

Piscina (Mobiliário batismal)
type: Concept
scope note: Cavidade praticada no solo, normalmente com degraus de acesso, onde se conservava a água destinada ao batismo por imersão, utilizado desde os primeiros tempos do Cristianismo até à Idade Média
in scheme: Tesauro SIPA
preferred label: Baptismal pool (Baptismal furniture) @en
preferred label: Lavabo (Mobilier de baptême) @fr
preferred label: Piscina (Mobili battesimali) @it
broader: Mobiliário batismal

Mobiliário de confissão
type: Concept
in scheme: Tesauro SIPA
preferred label: Confession furniture @en
preferred label: Mobilier de confession @fr
preferred label: Mobili confessionali @it
broader: Mobiliário religioso litúrgico
narrower: Confessionário
narrower: Teia-confessionário

Confessionário
type: Concept
scope note: Cubículo ou grande móvel, situado na nave ou no sub-coro, servindo para a confissão. Normalmente possui um assento central, para o padre, flanqueado por um ou dois genuflexórios, junto aos quais surge um ralo que permite a comunicação oral entre o confessor e o fiel. Os confessionários podem ser móveis, transportáveis ou pivotantes. Podem surgir, ainda, como uma estrutura embutida na parede do templo, ficando deste lado o fiel e no oposto, na estrutura de um muro ou num espaço anexo, o confessor, sendo o esquema mais utilizado em edifícios monástico-conventuais. Utilizados desde a Idade Média, proliferaram no interior dos templos a partir das normas do Concílio de Trento, no século XVI
in scheme: Tesauro SIPA
preferred label: Confessional @en
preferred label: Confessionnal @fr
preferred label: Confessionale @it
broader: Mobiliário de confissão
narrower: Confessionário móvel

Confessionário móvel
type: Concept
scope note: Confessionário em forma de painel, móvel ou articulado e fixo à parede, tendo, na face posterior um assento para o sacerdote e, na frontal, um genuflexório para o penitente. A comunicação é feita através de um ralo metálico
in scheme: Tesauro SIPA
preferred label: Mobile confessional @en
preferred label: Confessionnal-écran @fr
preferred label: Confessionale mobile @it
broader: Confessionário

Teia-confessionário
type: Concept
in scheme: Tesauro SIPA
preferred label: Web confessional @en
broader: Mobiliário de confissão

Mobiliário eucarístico
type: Concept
in scheme: Tesauro SIPA
preferred label: Eucharistic furniture @en
preferred label: Mobilier eucharistique @fr
preferred label: Mobili eucaristici @it
broader: Mobiliário religioso litúrgico
narrower: Altar
narrower: Sacrário

Altar
type: Concept
scope note: Estrutura fixa ou móvel, sobre a qual se celebra o sacrifício da missa, nas religiões cristãs, composta por um tampo, assente em suportes de formas variadas. Ergue-se no interior de uma capela, no cruzeiro do transepto, adossado às paredes do interior de um templo, ou no exterior, em posição elevada relativamente ao espaço envolvente, implantado sobre escada formada por um número ímpar de degraus, três no mínimo. Filia-se na mesa de sacrifícios clássica e no altar judaico; os primeiros altares cristãos eram, provavelmente, de madeira ou de mármore, maioritariamente portáteis. A partir de 313, com a cristianização do imperador Constantino, fixa-se o material de construção, em pedra, mármore ou metal, tendo que estar associado a relíquias dos mártires, que eram depositadas no interior. Até ao Vaticano II, surgiam fixos à parede e o celebrante dirigia a cerimónia litúrgica de costas para os fiéis, invertendo-se o processo naquela data, dando origem ao altar isolado, colocado no centro de uma capela ou no cruzeiro do transepto, permitindo a visualização das celebrações por todos os assistentes. Constitui uma estrutura composta por um tampo, assente em suporte de formas variadas, executada em madeira ou pedra, e possui uma invocação, sendo os principais titulares a Virgem, Cristo, santos, heróis ou as almas do purgatório; nos ângulos e no frontal apresenta cruzes latinas, revelando que se encontra sagrado. Até ao séc. XII, sobre o altar, apenas eram colocados o missal e o cálice, passando, nesta data, a surgir os tocheiros e uma cruz.
in scheme: Tesauro SIPA
preferred label: Autel @fr
preferred label: Altare @it
broader: Mobiliário eucarístico
narrower: Altar portátil
narrower: Altar segundo a forma
narrower: Altar segundo a função
narrower: Altar segundo a localização
narrower: Altar segundo o estatuto
narrower: Componentes do altar

Altar portátil
type: Concept
scope note: Caixa que, ao ser aberta, configura um altar, permitindo a celebração em qualquer local, normalmente acompanhando os viajantes, os monarcas e guerreiros em ocasião de batalhas. Pode constituir um altar provisório, que se coloca no interior de um edifício religioso, permitindo uma celebração extraordinária; é de forma retangular, recoberto de materiais preciosos e tecidos, e possui uma pedra preciosa consagrada. A caixa assume a forma de cofre, arca ou mala de viagem, que se transforma num altar. Apesar de serem referenciados desde o séc. IV, atingiriam o seu apogeu na Idade Média, para permitir aos monarcas e heróis, a celebração eucarística no campo de batalha. A partir do séc. XIII, com o fim das cruzadas e com a definição das fronteiras dos estados europeus, começa o seu declínio, mantendo-se em alguns países, correspondendo à necessidade de acompanhar os viajantes nas grandes epopeias marítimas. O bispo ou presbítero concedia-lhe o privilégio de celebração em qualquer local, tendo, no interior, a pedra de ara e compartimentos para arrecadar as alfaias e paramentos litúrgicos necessários. Eram de madeira, com embutidos de madeiras exóticas ou de marfim, ou de materiais preciosos, como a prata.
in scheme: Tesauro SIPA
preferred label: Portable altar @en
preferred label: Autel itinéraire @fr
preferred label: Altare da viaggio @it
broader: Altar

Altar segundo a forma
type: Concept
in scheme: Tesauro SIPA
preferred label: Altar according to form @en
preferred label: Autel selon la forme @fr
preferred label: Altare secondo la forma @it
broader: Altar
narrower: Altar em forma de urna
narrower: Altar mesa
narrower: Altar paralelepipédico

Altar em forma de urna
type: Concept
scope note: Altar paralelepipédico, mas cujas formas são galbadas, podendo possuir elementos arquitetónicos nos ângulos, com decoração permanente no frontal e, por vezes, nos costados. Situado no interior de uma capela ou adossado a uma estrutura retabular, divulga-se no séc. XVIII, a partir da Europa central, tendo sido introduzido em Portugal pela ação da rainha D. Maria Ana de Áustria, esposa de D. João V. Consiste numa caixa paralelepipédica, cujas formas são galbadas, assumindo a forma de uma urna, podendo possuir elementos arquitetónicos nos ângulos, como pilastras, estípides ou atlantes, com decoração permanente na zona do frontal e, por vezes, nos costados. O seu interior é oco, permitindo utilizações variadas, nomeadamente torná-lo num altar expositivo.
in scheme: Tesauro SIPA
preferred label: Urn shapped altar @en
alternative label: Altar em forma de sarcófago
broader: Altar segundo a forma

Altar mesa
type: Concept
scope note: Altar formado pelos suportes e o tampo, constituindo a forma mais antiga conhecida. Situado no interior de uma capela ou no cruzeiro, foi utilizado nos primeiros templos. A partir do Vaticano II, com a norma de colocar o altar de forma isolada, permitindo ao celebrante posicionar-se na zona posterior do mesmo, esta forma voltou-se a utilizar. É em madeira, por vezes de talha dourada, de cantaria ou metal, formado pelo tampo e pelos suportes, na forma de pernas simples, pilares ou colunas, sendo comum o reaproveitamento de antigos materiais entalhados.
in scheme: Tesauro SIPA
preferred label: Table altar @en
alternative label: Altar de caixa
broader: Altar segundo a forma

Altar paralelepipédico
type: Concept
scope note: Altar em forma de caixa, adossado a uma estrutura retabular, de formas retilíneas, apresentando decoração na zona do frontal e, por vezes, nos costados. Divulga-se a partir da Idade Média, constituindo uma caixa de linhas retas, com decoração fixa ou armada, utilizando-se, neste caso, estruturas móveis para esse fim, variando consoante o período litúrgico.
in scheme: Tesauro SIPA
preferred label: Parallelepipedal altar @en
broader: Altar segundo a forma

Altar segundo a função
type: Concept
in scheme: Tesauro SIPA
preferred label: Altar according to function @en
preferred label: Autel selon la fonction @fr
preferred label: Altare secondo la funzione @it
broader: Altar
narrower: Altar de confraria
narrower: Altar do Santíssimo Sacramento
narrower: Altar expositivo

Altar de confraria
type: Concept
scope note: Altar fundado e fabricado por uma confraria ou irmandade, situado no interior de um templo, consagrado ao santo patrono da mesma, onde decorrem as cerimónias litúrgicas da festividade do santo e as relativas às obrigações impostas por legados. Situado normalmente numa capela lateral ou colateral, surge na Idade Média, correspondendo à necessidade de espaços de culto destinados às confrarias, aumentando de número após o Concílio de Trento (séc. XVI), com a proliferação do culto de santos e beatos, então canonizados. Consiste numa mesa, com tampo e estrutura de madeira, revestido de materiais mais nobres, normalmente de pano (brocados, adamascados, seda, linho), encimado por retábulo. Eram propriedade de uma confraria ou irmandade, criada com a função de proceder a atos caritativos, divulgados, na Idade Média, pelas ordens mendicantes, e, simultaneamente, satisfazendo uma necessidade de salvação pessoal, garantindo-se, no momento da morte, as orações de toda a comunidade de irmãos e a proteção do santo tutelar; as confrarias eram, também, centros aglutinadores de mesteres, garantindo uma coesão de grupo, essencial ao estabelecimento de estatutos mais favoráveis e à sobrevivência da classe. O número de irmãos era variável, podendo atingir as centenas e envolvendo pessoas de várias classes sociais, sobrevivendo pelas quotas pagas pelos mesmos e pelos legados testamentários.
in scheme: Tesauro SIPA
preferred label: Autel de confrérie @fr
preferred label: Altare di confraternita @it
preferred label: Brotherhood/ Sorority altar @en
broader: Altar segundo a função

Altar do Santíssimo Sacramento
type: Concept
scope note: Altar situado na capela-mor ou junto a esta, utilizado para a arrecadação da partícula consagrada e sua exposição, estando permanentemente iluminado por uma ou mais lâmpadas. Situado na capela-mor ou junto a esta, normalmente no lado do Evangelho, era o segundo altar mais importante do templo. Após o Concílio de Trento (séc. XVI), a exposição do Santíssimo Sacramento torna-se obrigatória, sendo nomeadas irmandades para zelar por este culto, normalmente estabelecido no altar-mor. Contudo, nos templos de maiores dimensões, foi proibida a sua exposição na capela-mor, utilizada como espaço coral, dando origem ao aparecimento de altares e capelas com a função exclusiva de expor e arrecadar o Santíssimo. Tinha como condição a permanente iluminação do espaço por uma ou mais lâmpadas e a de não possuir celebrações litúrgicas. O altar do Santíssimo é constituído por uma mesa, de materiais vários, onde o sacrário e os objetos de exposição, em materiais nobres, assumem o papel relevante.
in scheme: Tesauro SIPA
preferred label: Altar of the Blessed Sacrament @en
preferred label: Autel du Saint Sacrement @fr
preferred label: Altare per il Ss. Sacramento @it
broader: Altar segundo a função

Altar expositivo
type: Concept
scope note: Altar situado na nave de um templo, servindo para expor o corpo jacente de um santo, que pode não ser o seu orago principal. Dedicado a um ou mais santos, proliferou em Portugal a partir do séc. XVII, servindo para expor o corpo jacente de um santo, normalmente a figura de Cristo morto, particularmente venerado durante o período pascal; frequentemente a imagem era articulada, permitindo a sua utilização na procissão da Via Sacra. Por vezes, a figura de Cristo morto estava rodeada pelas imagens de vulto das santas mulheres (Virgem, Maria Salomé, Maria Cleófas e Maria Madalena) e por Nicodemus e José de Arimateia. No séc. XVIII, divulga-se a figura da Virgem morta, especialmente nas zonas piscatórias, com o orago de Senhora da Boa Viagem, podendo aparecer outros santos, como os fundadores de ordens religiosas. A mesa de altar, de madeira ou cantaria, é, neste caso, em forma de urna ou paralelepipédica, tendo a zona frontal aberta ou envidraçada, onde surge a figura jacente do santo.
in scheme: Tesauro SIPA
preferred label: Display altar @en
broader: Altar segundo a função

Altar segundo a localização
type: Concept
in scheme: Tesauro SIPA
preferred label: Altar according to location @en
preferred label: Autel selon l'emplacement @fr
preferred label: Altare in base alla posizione @it
broader: Altar
narrower: Altar colateral
narrower: Altar exterior
narrower: Altar lateral
narrower: Altar-mor

Altar colateral
type: Concept
scope note: Altar integrado numa capela colateral ou encostado às paredes que flanqueiam o arco triunfal de um templo, consagrado a um santo, permitindo celebrações quotidianas ou periódicas, podendo surgir disposto em ângulo. É composto por uma mesa, com tampo e estrutura de madeira, revestido de materiais mais nobres, normalmente de pano (brocados, adamascados, seda, linho), cuja cor muda segundo os períodos litúrgicos. O situado no lado do Evangelho é hierarquicamente mais importante.
in scheme: Tesauro SIPA
preferred label: Side altar @en
preferred label: Autel latéral @fr
preferred label: Altare laterale @it
broader: Altar segundo a localização

Altar exterior
type: Concept
scope note: Altar colocado no exterior do templo principal de um santuário, permitindo ser visualizado por um maior número de fiéis, normalmente protegido por um alpendre. Surge implantado no exterior, em zona bastante elevada, para ser facilmente visualizado. Divulga-se a partir do século XVII, com o eclodir dos santuários de peregrinação marianos. Consiste numa mesa, normalmente protegida por um alpendre, tudo em cantaria, cujo revestimento decorativo só é armado no dia das festividades.
in scheme: Tesauro SIPA
preferred label: Exterior altar @en
broader: Altar segundo a localização

Altar lateral
type: Concept
scope note: Altar integrado numa capela lateral, profunda ou à face, ou encostado às paredes da nave de um templo, consagrado a um santo, permitindo celebrações quotidianas ou periódicas. É composto por uma mesa, com tampo e estrutura de madeira, revestido de materiais mais nobres, normalmente de pano (brocados, adamascados, seda, linho), cuja cor muda segundo os períodos litúrgicos. O situado no lado do Evangelho é hierarquicamente mais importante.
in scheme: Tesauro SIPA
preferred label: Side altar @en
preferred label: Autel latéral @fr
preferred label: Altare laterale @it
broader: Altar segundo a localização

Altar-mor
type: Concept
scope note: Altar principal de um templo, situado na zona da cabeceira, normalmente virado a Este, onde se celebra quotidianamente e consagrado ao orago principal do imóvel. Nos edifícios de maiores dimensões, em que existem vários altares, aplica-se este termo ao altar situado no eixo da nave, no centro da capela-mor ou no cruzeiro do transepto, para permitir diferenciá-lo dos altares secundários. Durante a Idade Média, era virado a Este, norma que perdurou até ao Renascimento, data em que o templo deixou de ser obrigatoriamente orientado. É de grandes dimensões, composto por uma mesa, com tampo e estrutura de madeira, revestido de materiais mais nobres, normalmente de pano (brocados, adamascados, seda, linho), cuja cor muda segundo os períodos litúrgicos.
in scheme: Tesauro SIPA
preferred label: High altar @en
preferred label: Maître-autel @fr
preferred label: Altare maggiore @it
broader: Altar segundo a localização

Altar segundo o estatuto
type: Concept
in scheme: Tesauro SIPA
preferred label: Altar according to status @en
preferred label: Autel selon le statut @fr
preferred label: Altare in base allo stato @it
broader: Altar
narrower: Altar privilegiado

Altar privilegiado
type: Concept
scope note: Altar que recebeu do Papa privilégios vários, os quais surgem enumerados numa cartela ou quadro, na ilharga do mesmo ou no topo. Situado numa capela ou encostado às paredes do templo, distingue-se por ter recebido bula papal, que outorgou indulgências plenárias ou temporárias aos seus utilizadores e celebrantes ou aos devotos que o visitem em épocas determinadas na mesma; estes privilégios eram solicitados por confrarias ou ordens religiosas, através de intermediários ou enviados à corte papal. A bula surge exposta em cartela ou quadro, junto ao altar ou no topo do mesmo. No caso da bula se achar arrecadada em arquivo, a memória do privilégio era inscrita em lápide ou na parede junto ao altar.
in scheme: Tesauro SIPA
preferred label: Priveleged altar @en
broader: Altar segundo o estatuto

Componentes do altar
type: Concept
in scheme: Tesauro SIPA
preferred label: Altar components @en
preferred label: Composants d' autel @fr
preferred label: Componenti d' altare @it
broader: Altar
narrower: Baldaquino de altar
narrower: Dossel de altar
narrower: Expositório eucarístico
narrower: Mesa de altar

Baldaquino de altar
type: Concept
scope note: Estrutura arquitetónica, sustentada por colunas ou pilares, em forma de dossel, que serve para cobrir um altar, normalmente o mor. Estrutura de aparato e honorífica, que se difunde na época moderna, consistindo em quatro suportes verticais, pilares ou colunas das várias ordens arquitetónicas, que sustentam o dossel, elemento abobadado ou em cúpula. São executadas em madeira ou metal. Na sua forma mais simples, pode-se assemelhar a um pálio, composto por um pano, armado em quatro varas metálicas.
in scheme: Tesauro SIPA
preferred label: Baldachin altar @en
preferred label: Baldaquin d' autel @fr
preferred label: Baldacchino architettonico d' altare @it
broader: Componentes do altar
narrower: Cibório
narrower: Componentes do baldaquino de altar

Cibório
type: Concept
scope note: Estrutura fixa ou móvel, que constitui o altar, sobre a qual se celebra o sacrifício da missa, composta por um tampo, assente em suporte de formas variadas. Existente desde os primórdios do Cristianismo, é composta por um tampo, encimado pela banqueta, onde surge a pedra de ara, e a caixa, constituindo o sepulcro, construída em cantaria, madeira ou metal.
in scheme: Tesauro SIPA
preferred label: Ciborium @en
preferred label: Ciborio @it
broader: Baldaquino de altar

Componentes do baldaquino de altar
type: Concept
in scheme: Tesauro SIPA
preferred label: Altar baldachin components @en
preferred label: Composants du baldaquin d' autel @fr
preferred label: Componenti del baldacchino d' altare @it
broader: Baldaquino de altar
narrower: Dossel
narrower: Lambrequim (Baldaquino de altar)

Dossel
type: Concept
scope note: Elemento arquitetónico medieval, sustentado por colunas ou pilares, em forma de dossel, que serve para cobrir um altar, normalmente o mor. Com carácter de aparato e honorífica, difunde-se no período medieval, sendo reutilizado nos imóveis revivalistas dos séculos XIX e XX, consistindo em quatro suportes verticais, pilares ou colunas, que sustentam o dossel, elemento abobadado ou em cúpula. É executada em madeira ou cantaria e decorada com materiais e cores diversas.
in scheme: Tesauro SIPA
preferred label: Canopy; Dossal; Dossel @en
preferred label: Dais d' autel @fr
preferred label: Baldacchino d' altare @it
broader: Componentes do baldaquino de altar

Lambrequim (Baldaquino de altar)
type: Concept
scope note: Elemento recortado, formando pequenas palas, que se dependuram de um baldaquino ou de uma sanefa.
in scheme: Tesauro SIPA
preferred label: Lambrequin @en
preferred label: Pente de dais d' autel @fr
preferred label: Drappellone del baldacchino d' altare @it
broader: Componentes do baldaquino de altar

Dossel de altar
type: Concept
scope note: Elemento suspenso, em forma de coroa, ornamentado com armação em tecido, que cobre um altar, normalmente o mor. Contudo, a estrutura pode surgir em talha fingida ou em pintura mural. Estrutura de aparato e honorífica, que cobre um altar nas festividades. Difunde-se no período barroco, consistindo numa coroa suspensa, por vezes sustentada por anjos, de onde evolui uma armação em tecido que abre em boca de cena, podendo existir em várias cores, consoante o calendário litúrgico. A coroa pode ser de madeira, por vezes em talha dourada ou pintada.
in scheme: Tesauro SIPA
preferred label: Altar canopy @en
preferred label: Dais d' autel @fr
preferred label: Baldacchino d' altare @it
broader: Componentes do altar

Expositório eucarístico
type: Concept
in scheme: Tesauro SIPA
preferred label: Eucharistic display @en
preferred label: Tronetto per esposizione eucaristica @it
preferred label: Exposition @fr
broader: Componentes do altar

Mesa de altar
type: Concept
scope note: Peça horizontal que compõe a parte superior de um altar. Pode ser de vários materiais e encontra-se coberto pela toalha de altar
in scheme: Tesauro SIPA
preferred label: Altar table @en
preferred label: Table d' autel @fr
preferred label: Mensa d' altare @it
broader: Componentes do altar
narrower: Componentes da mesa de altar

Componentes da mesa de altar
type: Concept
in scheme: Tesauro SIPA
preferred label: Altar table components @en
preferred label: Composants de la table d' autel @fr
preferred label: Componenti della mensa d' altare @it
broader: Mesa de altar
narrower: Banqueta (Componentes da mesa de altar)
narrower: Costado
narrower: Frontal (Componentes da mesa de altar)
narrower: Pedra de ara
narrower: Sepulcro

Banqueta (Componentes da mesa de altar)
type: Concept
scope note: Pequeno degrau, assente sobre a mesa de altar e adossada à estrutura retabular, onde se colocam a cruz e os tocheiros. Começou a surgir na Idade Moderna, altura em que começam a ser colocados, sobre a mesa de altar, vários tocheiros e uma cruz, dando origem a um pequeno degrau. Sobre este, maioritariamente de madeira ou cantaria, são colocados a cruz, ao centro, normalmente com a figura do Crucificado, construída em madeira ou metal (prata, bronze, estanho ou folha, consoante o poder económico do encomendador), flanqueada pelos tocheiros, dispostos simetricamente, num total de quatro ou, a partir do séc. XVIII, de seis, executados no mesmo material da cruz; sobre a banqueta, surgem os palmitos ou ramos, elementos florais em prata ou formando arranjos artificiais ou naturais, inseridos em jarras de vários materiais, optando-se, normalmente, pela faiança ou porcelana. Ainda, na banqueta, pode surgir um Apostolado ou os Evangelistas, na forma de bustos ou em corpo inteiro.
in scheme: Tesauro SIPA
preferred label: Banquette (Altar table) @en
preferred label: Gradin d' autel @fr
preferred label: Gradino d' altare @it
broader: Componentes da mesa de altar
narrower: Banqueta relicário

Banqueta relicário
type: Concept
scope note: Pequeno degrau, assente sobre a mesa de altar e adossada à estrutura retabular, onde se colocam a cruz e os tocheiros, rasgada por vários nichos, contendo relíquias. A partir do Concílio de Trento (séc. XVI), com a difusão do culto dos santos e objetos a eles pertencentes, e pela proibição da cruz da banqueta ter relíquias engastadas, passando apenas a ostentar o Crucificado, as banquetas começam a exibir pequenos orifícios ou nichos, onde passam a ser expostas as relíquias.
in scheme: Tesauro SIPA
preferred label: Banquette reliquary @en
preferred label: Gradin-reliquaire @fr
preferred label: Gradino-reliquario @it
broader: Banqueta (Componentes da mesa de altar)

Costado
type: Concept
scope note: Faces laterais ou ilhargas de uma mesa de altar, podendo aparecer simples ou ostentando decoração variada. Os elementos decorativos surgem a partir dos períodos maneirista e barroco, com revestimentos em pintura mural, no caso de serem em cantaria, talha ou azulejo, normalmente prolongando a decoração do frontal. Por vezes, têm, adossados, os suportes da estrutura retabular.
in scheme: Tesauro SIPA
preferred label: Backside; Flank @en
broader: Componentes da mesa de altar

Frontal (Componentes da mesa de altar)
type: Concept
scope note: Parte anterior da mesa de altar, guarnecida com profusa decoração fixa ou móvel. Com a reforma manuelina das ordens religiosas (séc. XVI), começa a ser imposto, por uma necessidade de economia de meios, o recurso a uma decoração fixa do altar, que se mantivesse todo o ano litúrgico, optando-se pela utilização da cantaria, azulejo, pintura mural, talha, metal ou embutidos de pedra para revestir essa zona; no caso da utilização do metal, este ostenta esmaltes e incrustações de pedraria preciosa ou semipreciosa. Por vezes, o de cantaria ou de talha pode representar cenas religiosas historiadas, ocorrência frequente no que reveste o altar-mor. Pode ser guarnecida com decoração móvel, composta por grandes painéis de brocado, adamascado ou de couro, com cores distintas, adaptáveis ao calendário litúrgico.
in scheme: Tesauro SIPA
preferred label: Frontal @en
preferred label: Devant d' autel @fr
preferred label: Frontale d' altare @it
broader: Componentes da mesa de altar
narrower: Antependium
narrower: Componentes do frontal

Antependium
type: Concept
scope note: Painéis móveis, de tecido, couro ou papel, que guarnecem as faces anteriores dos altares. Revestem a estrutura de madeira ou alvenaria que forma a mesa de altar, constituído por grande painel de pano, brocado ou adamascado, bordado a fio de ouro ou de prata, de couro ou papel, com diferentes cores, correspondendo aos vários períodos litúrgicos, arrecadado na sacristia em armários apropriados para este fim.
in scheme: Tesauro SIPA
preferred label: Antepedium @fr
preferred label: Paliotto @it
broader: Frontal (Componentes da mesa de altar)

Componentes do frontal
type: Concept
in scheme: Tesauro SIPA
preferred label: Frontal components @en
broader: Frontal (Componentes da mesa de altar)
narrower: Pano (Frontal)
narrower: Sanefa (Frontal)
narrower: Sebasto

Pano (Frontal)
type: Concept
scope note: Zona central do frontal, decorada com motivos diversos consoante o estilo artístico em que foram executados. No período maneirista e início do barroco, o pano apresentava-se simples ou dividido em apainelados (bipartido ou tripartido), ornados por vegetação variada, onde se incluíam, frequentemente, animais exóticos, influenciados pelos tecidos orientais, de que subsistem vários exemplares em azulejo. Com o desenvolvimento do período barroco, o pano passa a ostentar cartela envolvida por acantos, podendo ter símbolos ou cenas alusivas ao orago do altar. Esta decoração era aplicada, independentemente do material utilizado.
in scheme: Tesauro SIPA
preferred label: Liturgical cloth (Frontal) @en
preferred label: Guarnizione d' altare @it
preferred label: Tour d' autel @fr
broader: Componentes do frontal

Sanefa (Frontal)
type: Concept
scope note: Zona superior do frontal, disposta horizontalmente, apresentando decoração simétrica, vegetalista e geométrica, formando acantos clássicos ou barrocos, pequenos rosetões e, na zona inferior, franja dourada.
in scheme: Tesauro SIPA
preferred label: Mantovana d' altare @it
preferred label: Pelmet; Valance @en
preferred label: Lambrequin d' autel @fr
broader: Componentes do frontal

Sebasto
type: Concept
scope note: Zona vertical do frontal, que enquadra o pano e apresenta decoração diversa, dependendo do período artístico em que foi concebido.
in scheme: Tesauro SIPA
preferred label: Clavi @fr
preferred label: Clavi; Orphrey @en
broader: Componentes do frontal

Pedra de ara
type: Concept
scope note: Pedra de pequenas dimensões, inserida no tampo da mesa de um altar não consagrado, normalmente destacada e com as dimensões suficientes para receber, durante as celebrações litúrgicas, o cálice e a patena, ostentando as cinco cruzes de sagração.
in scheme: Tesauro SIPA
preferred label: Altar stone @en
preferred label: Pietra sacra @it
preferred label: Pierre d' autel @fr
broader: Componentes da mesa de altar

Sepulcro
type: Concept
scope note: Cavidade no interior da mesa de altar, onde se colocam as relíquias dos santos patronos ou imagens, no caso de um altar expositivo.
in scheme: Tesauro SIPA
preferred label: Sepulchre @en
preferred label: Sépulcre @fr
preferred label: Sepolcro @it
broader: Componentes da mesa de altar

Sacrário
type: Concept
scope note: Estrutura embutida no altar ou de forma arquitetónica, onde se colocam as partículas sagradas, tendo de ser forrado interiormente, com uma porta cerrada e decorada com elementos eucarísticos, como o cálice, espigas, vides, Cristo redentor ou o Agnus Dei. Costuma estar tapado com um pavilhão de pano, cuja cor se altera consoante a época litúrgica
in scheme: Tesauro SIPA
preferred label: Sacrarium @en
preferred label: Tabernacle @fr
preferred label: Tabernacolo @it
broader: Mobiliário eucarístico
narrower: Tabernáculo

Tabernáculo
type: Concept
scope note: Sacrário com forma arquitetónica, formando um pequeno templo, de um ou mais andares e remate em cúpula.
in scheme: Tesauro SIPA
preferred label: Tabernacle @en
preferred label: Tabernacolo @it
broader: Sacrário

Mobiliário religioso para oferendas
type: Concept
in scheme: Tesauro SIPA
preferred label: Religious furniture for offerings @en
preferred label: Meublier religieux pour offrandes @fr
preferred label: Mobili religiosi per offerte @it
broader: Mobiliário religioso de armazenamento
narrower: Caixa de esmolas
narrower: Mesa de oferendas
narrower: Mesa de pães bentos

Caixa de esmolas
type: Concept
scope note: Móvel de dimensões e formas variadas, em forma de caixa com uma ranhura, para permitir a recolha das oferendas dos fiéis, podendo surgir isolada ou embutida na estrutura murária, junto a um altar ou à entrada do templo, identificando o santo ou a causa a que se destinam as dádivas
in scheme: Tesauro SIPA
preferred label: Collection box @en
preferred label: Tronc @fr
preferred label: Contenitore per elemosine @it
broader: Mobiliário religioso para oferendas

Mesa de oferendas
type: Concept
scope note: Mesa de grandes dimensões, por vezes em pedra, colocada junto à entrada de um templo, exterior ou interior, onde são depositadas oferendas pelos fiéis
in scheme: Tesauro SIPA
preferred label: Offering table @en
preferred label: Table à offrandes @fr
preferred label: Tavola per le offerte @it
broader: Mobiliário religioso para oferendas

Mesa de pães bentos
type: Concept
scope note: Mesa de pequenas dimensões sobre a qual se dispõem pedaços de pão (pães bentos) no final de uma cerimónia litúrgica, destinados aos fiéis, que, em troca, deixam uma oferta
in scheme: Tesauro SIPA
preferred label: Blessed bread table @en
preferred label: Table à pains bénits @fr
preferred label: Tavola per i pani benedetti @it
broader: Mobiliário religioso para oferendas

Mobiliário genérico
type: Concept
in scheme: Tesauro SIPA
preferred label: Generic furniture @en
preferred label: Mobilier général @fr
preferred label: Mobili generici @it
broader: Mobiliário
narrower: Arca
narrower: Armário
narrower: Armeiro
narrower: Arquibanco
narrower: Bancada (Mobiliário genérico)
narrower: Bargueño
narrower: Baú
narrower: Mesa
narrower: Mobiliário genérico segundo a função

Arca
type: Concept
scope note: Peça de mobiliário em forma de grande caixa fechada por uma tampa, para arrecadar roupa ou objetos, podendo ostentar decoração pintada ou esculpida
in scheme: Tesauro SIPA
preferred label: Coffre @fr
preferred label: Ark (Chest) @en
preferred label: Arca/Cassa @it
broader: Mobiliário genérico

Armário
type: Concept
scope note: Móvel de madeira ou metal, munido de prateleiras para arrecadar objetos variados
in scheme: Tesauro SIPA
preferred label: Cabinet @en
preferred label: Armoire @fr
preferred label: Armadio @it
broader: Mobiliário genérico

Armeiro
type: Concept
scope note: Armário para arrecadar armas, com suportes específicos para as suportar. Pode possuir um código para abertura, dificultando o seu furto
in scheme: Tesauro SIPA
preferred label: Gunsmith; Armorer @en
preferred label: Armurier @fr
preferred label: Armaiolo @it
broader: Mobiliário genérico

Arquibanco
type: Concept
scope note: Banco que integra uma caixa sobre o assento, que lhe serve de tampa, permitindo arrecadar vários objetos
in scheme: Tesauro SIPA
preferred label: Cassapanche; Ark bench @en
preferred label: Archibanque @fr
preferred label: Arcibanca @it
broader: Mobiliário genérico

Bancada (Mobiliário genérico)
type: Concept
in scheme: Tesauro SIPA
preferred label: Banc (Mobilier générique) @fr
preferred label: Countertop(Generic furniture) @en
preferred label: Banco (mobili generici) @it
broader: Mobiliário genérico

Bargueño
type: Concept
scope note: Móvel espanhol muito popular do século XVI ao século XVIII, com vários compartimentos para guardar documentos e com uma área para escrita.
in scheme: Tesauro SIPA
preferred label: Bargueños furniture (from Bargas) @en
preferred label: Meubles Bargueños (de Bargas) @fr
preferred label: Mobili Bargueños (da Bargas) @it
broader: Mobiliário genérico

Baú
type: Concept
scope note: Caixa de madeira ou metal, com tampa convexa, utilizada como objeto de armazenamento
in scheme: Tesauro SIPA
preferred label: Chest @en
preferred label: Bahut @fr
preferred label: Baule @it
broader: Mobiliário genérico

Mesa
type: Concept
in scheme: Tesauro SIPA
preferred label: Table @en
preferred label: Tableau @fr
preferred label: Tavolo @it
broader: Mobiliário genérico

Mobiliário genérico segundo a função
type: Concept
in scheme: Tesauro SIPA
preferred label: Generic furniture according to function @en
preferred label: Mobilier générique selon la fonction @fr
preferred label: Mobili generici secondo la funzione @it
broader: Mobiliário genérico
narrower: Mobiliário de alojamento
narrower: Mobiliário de armazenamento
narrower: Mobiliário de assento
narrower: Mobiliário de iluminação
narrower: Mobiliário de leitura
narrower: Mobiliário de proteção
narrower: Mobiliário de suporte
narrower: Mobiliário divisório de espaço e de proteção

Mobiliário de alojamento
type: Concept
in scheme: Tesauro SIPA
preferred label: Accomodation furniture @en
preferred label: Mobilier d'hébergement @fr
preferred label: Mobili per alloggi @it
broader: Mobiliário genérico segundo a função
narrower: Mobiliário de alojamento de animais

Mobiliário de alojamento de animais
type: Concept
in scheme: Tesauro SIPA
preferred label: Animal accomodation furniture @en
preferred label: Mobilier d'hébergement pour animaux @fr
preferred label: Mobili per l'alloggio degli animali @it
broader: Mobiliário de alojamento
narrower: Gaiola
narrower: Jaula

Gaiola
type: Concept
scope note: Estrutura metálica para abrigo de aves.
in scheme: Tesauro SIPA
preferred label: Birdcage @en
preferred label: Clapier @fr
preferred label: Gabbietta @it
broader: Mobiliário de alojamento de animais

Jaula
type: Concept
in scheme: Tesauro SIPA
preferred label: Gabbia @it
preferred label: Cage; Crate @en
preferred label: Cage @fr
broader: Mobiliário de alojamento de animais

Mobiliário de armazenamento
type: Concept
in scheme: Tesauro SIPA
preferred label: Storage furniture @en
preferred label: Meubles de rangement @fr
preferred label: Mobili per l'archiviazione @it
broader: Mobiliário genérico segundo a função
narrower: Mobiliário de armazenamento de documentação
narrower: Mobiliário de armazenamento de valores

Mobiliário de armazenamento de documentação
type: Concept
in scheme: Tesauro SIPA
preferred label: Document storage furniture @en
preferred label: Meubles de rangement pour la documentation @fr
preferred label: Mobili per l'archiviazione della documentazione @it
broader: Mobiliário de armazenamento
narrower: Armário de arquivo
narrower: Arquivador
narrower: Contador
narrower: Estante

Armário de arquivo
type: Concept
scope note: Armário de madeira ou metálico, de formas variadas, permitindo arrecadar o arquivo de uma entidade
in scheme: Tesauro SIPA
preferred label: File cabinet @en
preferred label: Armoire à archives @fr
preferred label: Armadio di archiviazione @it
broader: Mobiliário de armazenamento de documentação

Arquivador
type: Concept
scope note: Móvel construído em metal ou madeira, provido de estantes, gavetas e outros compartimentos, destinado a guardar documentos
in scheme: Tesauro SIPA
preferred label: Filing cabinet @en
preferred label: Classeur @fr
preferred label: Armadio per archiviazione @it
broader: Mobiliário de armazenamento de documentação

Contador
type: Concept
in scheme: Tesauro SIPA
preferred label: Cabinet (armoire) @fr
preferred label: Cabinet (armadio) @it
broader: Mobiliário de armazenamento de documentação

Estante
type: Concept
in scheme: Tesauro SIPA
preferred label: Shelf @en
preferred label: Bibliothèque @fr
preferred label: Scaffale @it
broader: Mobiliário de armazenamento de documentação

Mobiliário de armazenamento de valores
type: Concept
in scheme: Tesauro SIPA
preferred label: Valuables storage furniture @en
preferred label: Meubles de rangement pour objets de valeur @fr
preferred label: Mobili per l'archiviazione dei titoli @it
broader: Mobiliário de armazenamento
narrower: Burra
narrower: Cofre

Burra
type: Concept
scope note: Arca de madeira, revestida com chapas metálicas, utilizada para guardar bens, possuindo dois ou mais fechos, exigindo que mais do que uma pessoa a pudesse abrir
in scheme: Tesauro SIPA
preferred label: Strongbox; Safe @en
broader: Mobiliário de armazenamento de valores

Cofre
type: Concept
scope note: Objeto isolado ou embutido num muro, permitindo guardar objetos preciosos, podendo ter uma ou mais fechaduras, acionado por chave ou por código
in scheme: Tesauro SIPA
preferred label: Coffre @fr
preferred label: Cassa @it
preferred label: Safe; Vault @en
broader: Mobiliário de armazenamento de valores

Mobiliário de assento
type: Concept
in scheme: Tesauro SIPA
preferred label: Sitting furniture @en
preferred label: Meubles d'assise @fr
preferred label: Mobili per sedersi @it
broader: Mobiliário genérico segundo a função
narrower: Banco (Mobiliário de assento)
narrower: Banco de jardim
narrower: Cadeira
narrower: Conversadeira
narrower: Namoradeira
narrower: Rede

Banco (Mobiliário de assento)
type: Concept
scope note: Tipo de assento simples, sem encosto
in scheme: Tesauro SIPA
preferred label: Bench (Sitting furniture) @en
preferred label: Tabouret (Meubles d'assise) @fr
preferred label: Sgabello (Mobili per sedersi) @it
broader: Mobiliário de assento

Banco de jardim
type: Concept
in scheme: Tesauro SIPA
preferred label: Garden bench @en
preferred label: Banc de jardin @fr
preferred label: Panchina da giardino @it
broader: Mobiliário de assento

Cadeira
type: Concept
scope note: Assento individual provido de encosto
in scheme: Tesauro SIPA
preferred label: Chair @en
preferred label: Chaise @fr
preferred label: Sedia @it
broader: Mobiliário de assento
narrower: Cadeira de baloiço
narrower: Espreguiçadeira

Cadeira de baloiço
type: Concept
scope note: Tipo de cadeira que possui uma base curva, onde assentam os pés, permitindo a sua oscilação
in scheme: Tesauro SIPA
preferred label: Rocking chair @en
preferred label: Chaise à bascule @fr
preferred label: Sedia a dondolo @it
broader: Cadeira

Espreguiçadeira
type: Concept
in scheme: Tesauro SIPA
preferred label: Chaise longue @fr
preferred label: Sedia a sdraio @it
preferred label: Lounge chair; Chaise longue @en
broader: Cadeira

Conversadeira
type: Concept
scope note: Par de bancos voltados um para um outro, geralmente construída em muros ou janelas de onde se podem obter vistas largas
in scheme: Tesauro SIPA
preferred label: Cosy @en
broader: Mobiliário de assento

Namoradeira
type: Concept
scope note: Banco em forma de “S”, com assentos de costas um para o outro
in scheme: Tesauro SIPA
preferred label: Loveseat @en
broader: Mobiliário de assento

Rede
type: Concept
in scheme: Tesauro SIPA
preferred label: Hammock @en
preferred label: Hamac @fr
preferred label: Amaca @it
broader: Mobiliário de assento

Mobiliário de iluminação
type: Concept
in scheme: Tesauro SIPA
preferred label: Lighting furniture @en
preferred label: Mobilier d'éclairage @fr
preferred label: Mobili di illuminazione @it
broader: Mobiliário genérico segundo a função
narrower: Luminárias fixas (Mobiliário de iluminação)
narrower: Luminárias móveis (Mobiliário de iluminação)

Luminárias fixas (Mobiliário de iluminação)
type: Concept
in scheme: Tesauro SIPA
preferred label: Fixed luminair (Lighting furniture) @en
preferred label: Luminaires fixes (Mobilier d'éclairage) @fr
preferred label: Apparecchi d'illuminazione fissi (Mobili di illuminazione) @it
broader: Mobiliário de iluminação
narrower: Lustre (Mobiliário de iluminação)
narrower: Candeeiro de parede
narrower: Candeia de parede
narrower: Castiçal de braço
narrower: Castiçal de placa
narrower: Projetor
narrower: Serpentina

Lustre (Mobiliário de iluminação)
type: Concept
scope note: Lampadário com vários lumes decorado com vidro ou cristal, suspenso do teto por correntes e podendo ter um sistema de roldanas para o içar e baixar, facilitando a sua manutenção e limpeza
in scheme: Tesauro SIPA
preferred label: Lustre (Mobilier d'éclairage) @fr
preferred label: Chandlier (Lighting furniture) @en
preferred label: Lustro (Mobili di illuminazione) @it
broader: Luminárias fixas (Mobiliário de iluminação)

Candeeiro de parede
type: Concept
scope note: Luminária fixa à parede, podendo estar junto à mesma ou distanciando-se desta por um braço. Pode assumir a forma de uma candeia de azeite, castiçal ou foco de luz
in scheme: Tesauro SIPA
preferred label: Wall lamp @en
preferred label: Chandelier murale @fr
preferred label: Lampada da parete @it
broader: Luminárias fixas (Mobiliário de iluminação)

Candeia de parede
type: Concept
scope note: Suporte para uma ou mais lamparinas de azeite
in scheme: Tesauro SIPA
preferred label: Wall lantern @en
preferred label: Chandelle murale @fr
preferred label: Lucerna da parete @it
broader: Luminárias fixas (Mobiliário de iluminação)

Castiçal de braço
type: Concept
scope note: Suporte para velas, fixo à parede, podendo ter um ou mais braços, podendo assumir formas decorativas ou torsas
in scheme: Tesauro SIPA
preferred label: Candlestick @en
preferred label: Chandelier à bras @fr
preferred label: Candeliere a braccio @it
broader: Luminárias fixas (Mobiliário de iluminação)

Castiçal de placa
type: Concept
scope note: Suporte para velas, fixo à parede por um braço único, com um ou mais lumes
in scheme: Tesauro SIPA
preferred label: Chandelier à plaque @fr
preferred label: Candeliere a placca @it
preferred label: Candleholder; Lampstand @en
broader: Luminárias fixas (Mobiliário de iluminação)

Projetor
type: Concept
in scheme: Tesauro SIPA
preferred label: Projector @en
preferred label: Projecteur @fr
preferred label: Proiettore @it
hidden label: Projector
broader: Luminárias fixas (Mobiliário de iluminação)

Serpentina
type: Concept
scope note: Suporte para velas com dois ou mais braços espiralados, fixos à parede
in scheme: Tesauro SIPA
preferred label: Serpentine @en
broader: Luminárias fixas (Mobiliário de iluminação)

Luminárias móveis (Mobiliário de iluminação)
type: Concept
in scheme: Tesauro SIPA
preferred label: Mobile luminaires (Lighting furniture) @en
preferred label: Luminaires mobiles (Mobilier d'éclairage) @fr
preferred label: Apparecchi d'illuminazione mobili (Mobili di illuminazione) @it
broader: Mobiliário de iluminação
narrower: Lamparina
narrower: Lanterna
narrower: Lucerna

Lamparina
type: Concept
in scheme: Tesauro SIPA
preferred label: Oil lamp @en
preferred label: Lampe à huile @fr
preferred label: Lampada a olio @it
broader: Luminárias móveis (Mobiliário de iluminação)

Lanterna
type: Concept
in scheme: Tesauro SIPA
preferred label: Lantern @en
preferred label: Lanterne @fr
broader: Luminárias móveis (Mobiliário de iluminação)

Lucerna
type: Concept
scope note: Lâmpada de azeite, executada em vários materiais e podendo ostentar elementos decorativos
in scheme: Tesauro SIPA
preferred label: Roman lamp @en
preferred label: Lucerne romaine @fr
preferred label: Lucerna romana @it
broader: Luminárias móveis (Mobiliário de iluminação)

Mobiliário de leitura
type: Concept
in scheme: Tesauro SIPA
preferred label: Reading furniture @en
preferred label: Meubles de lecture @fr
preferred label: Mobili da lettura @it
broader: Mobiliário genérico segundo a função
narrower: Atril

Atril
type: Concept
scope note: Móvel com uma estrutura inclinada, permitindo o encosto de livros para facilitar a leitura dos mesmos, especialmente quando são de grandes dimensões. Nos templos, surgem várias estruturas deste tipo, aparecendo uma ou duas fixas, onde se processam as leituras do Evangelho e Epístola, e um móvel sobre o altar
in scheme: Tesauro SIPA
preferred label: Lectern @en
preferred label: Lutrin @fr
preferred label: Leggio @it
broader: Mobiliário de leitura

Mobiliário de proteção
type: Concept
in scheme: Tesauro SIPA
preferred label: Protection furniture @en
preferred label: Meubles de protection @fr
preferred label: Mobili di protezione @it
hidden label: Mobiliário de protecção
broader: Mobiliário genérico segundo a função
narrower: Campânula
narrower: Guarda-sol
narrower: Mobiliário de proteção vegetal
narrower: Para-vento

Campânula
type: Concept
scope note: Objeto de vidro, em forma de sino, que protege uma imagem religiosa ou qualquer elemento decorativo
in scheme: Tesauro SIPA
preferred label: Campanule @fr
preferred label: Campanula @it
preferred label: Campanula; Bellflower @en
broader: Mobiliário de proteção

Guarda-sol
type: Concept
in scheme: Tesauro SIPA
preferred label: Sunshade @en
preferred label: Parasol @fr
preferred label: Ombrellone @it
broader: Mobiliário de proteção

Mobiliário de proteção vegetal
type: Concept
in scheme: Tesauro SIPA
preferred label: Plant protection furniture @en
preferred label: Mobilier de protection des plantes @fr
preferred label: Mobili per la protezione delle piante @it
hidden label: Mobiliário de protecção vegetal
broader: Mobiliário de proteção
narrower: Abrigo vegetal

Abrigo vegetal
type: Concept
in scheme: Tesauro SIPA
preferred label: Abri pour plantes @fr
preferred label: Riparo per piante @it
preferred label: Plant shelter; Greenhouse @en
broader: Mobiliário de proteção vegetal
narrower: Cobertura (Abrigo vegetal)
narrower: Esteira
narrower: Estufa portátil

Cobertura (Abrigo vegetal)
type: Concept
in scheme: Tesauro SIPA
preferred label: Roofing; Penthouse (Greenhouse) @en
broader: Abrigo vegetal

Esteira
type: Concept
in scheme: Tesauro SIPA
preferred label: Mat @en
broader: Abrigo vegetal

Estufa portátil
type: Concept
in scheme: Tesauro SIPA
preferred label: Portable greenhouse @en
preferred label: Serre portable @fr
preferred label: Serra portatile @it
broader: Abrigo vegetal

Para-vento
type: Concept
in scheme: Tesauro SIPA
preferred label: Windshade @en
preferred label: Brise-vent @fr
preferred label: Frangivento @it
broader: Mobiliário de proteção

Mobiliário de suporte
type: Concept
in scheme: Tesauro SIPA
preferred label: Support furniture @en
preferred label: Mobilier de support @fr
preferred label: Mobili di supporto @it
broader: Mobiliário genérico segundo a função
narrower: Mobiliário de suporte de vegetação

Mobiliário de suporte de vegetação
type: Concept
in scheme: Tesauro SIPA
preferred label: Plants support furniture @en
preferred label: Mobilier de support pour plantes @fr
preferred label: Mobili di supporto per la vegetazione @it
broader: Mobiliário de suporte
narrower: Alegrete
narrower: Caldeira (Mobiliário de suporte de vegetação)
narrower: Canteiro
narrower: Cuba (Mobiliário de suporte de vegetação)
narrower: Floreira
narrower: Platibanda (Mobiliário de suporte de vegetação)
narrower: Vaso (Mobiliário de suporte de vegetação)

Alegrete
type: Concept
scope note: Floreira ou canteiro, muitas vezes construído na parte superior de muros de suporte e muretes, geralmente em pedra ou tijolo
in scheme: Tesauro SIPA
preferred label: Lit de flures @fr
preferred label: Aiuola @it
preferred label: Flower stands @en
broader: Mobiliário de suporte de vegetação

Caldeira (Mobiliário de suporte de vegetação)
type: Concept
in scheme: Tesauro SIPA
preferred label: Flower pot (Plants support furniture) @en
preferred label: Chaudière (Mobilier de support de la végétation) @fr
preferred label: Caldaia (Mobili di supporto per la vegetazione) @it
broader: Mobiliário de suporte de vegetação

Canteiro
type: Concept
scope note: Porção de terra preparada para cultivo, especialmente em jardins ou hortas
in scheme: Tesauro SIPA
preferred label: Flowerbed (Plants support furniture) @en
preferred label: Parterre de fleurs (Mobilier de support de la végétation) @fr
preferred label: Aiuola per piante (Mobili di supporto per la vegetazione) @it
broader: Mobiliário de suporte de vegetação
narrower: Canteiro sobrelevado

Canteiro sobrelevado
type: Concept
scope note: Porção de terra preparada para cultivo, situada acima do solo, em jardins ou hortas
in scheme: Tesauro SIPA
preferred label: Raised flowerbed @en
preferred label: Parterre surélevé @fr
preferred label: Aiuola rialzata @it
broader: Canteiro

Cuba (Mobiliário de suporte de vegetação)
type: Concept
in scheme: Tesauro SIPA
preferred label: Vat; Tub (Plants support furniture) @en
broader: Mobiliário de suporte de vegetação

Floreira
type: Concept
in scheme: Tesauro SIPA
preferred label: Parterre de fleurs @fr
preferred label: Fioriera @it
preferred label: Planter; Flower holder; Flower pot @en
broader: Mobiliário de suporte de vegetação

Platibanda (Mobiliário de suporte de vegetação)
type: Concept
in scheme: Tesauro SIPA
preferred label: Platband (Plants support furniture) @en
preferred label: Bordura (Mobili di supporto per la vegetazione) @it
preferred label: Chantier (Mobilier de support de la végétation) @fr
broader: Mobiliário de suporte de vegetação

Vaso (Mobiliário de suporte de vegetação)
type: Concept
in scheme: Tesauro SIPA
preferred label: Vase (Plants support furniture) @en
preferred label: Vaso (Mobili di supporto per la vegetazione) @it
preferred label: Vase (Mobilier de support de la végétation) @fr
broader: Mobiliário de suporte de vegetação
narrower: Sanefa (Mobiliário de suporte de vegetação)
narrower: Vaso de parede
narrower: Vaso suspenso

Sanefa (Mobiliário de suporte de vegetação)
type: Concept
in scheme: Tesauro SIPA
preferred label: Fioriera (Mobili di supporto per la vegetazione) @it
preferred label: Pelmet; Valance (Plants support furniture) @en
preferred label: Jardinière (Mobilier de support de la végétation) @fr
broader: Vaso (Mobiliário de suporte de vegetação)

Vaso de parede
type: Concept
in scheme: Tesauro SIPA
preferred label: Wall vase @en
preferred label: Pot mural @fr
preferred label: Vaso a muro @it
broader: Vaso (Mobiliário de suporte de vegetação)

Vaso suspenso
type: Concept
in scheme: Tesauro SIPA
preferred label: Hanging vase @en
preferred label: Pot suspendu @fr
preferred label: Vaso sospeso @it
broader: Vaso (Mobiliário de suporte de vegetação)

Mobiliário divisório de espaço e de proteção
type: Concept
in scheme: Tesauro SIPA
preferred label: Room dividers and protective furniture @en
preferred label: Meubles de séparation et de protection @fr
preferred label: Divisori di spazio e mobili di protezione @it
hidden label: Mobiliário divisório de espaço e de protecção
broader: Mobiliário genérico segundo a função
narrower: Biombo
narrower: Componentes do mobiliário divisório de espaço e de proteção
narrower: Cancela
narrower: Estore
narrower: Gelosia (Mobiliário divisório de espaço e de proteção)
narrower: Gradão
narrower: Grade
narrower: Mosquiteiro
narrower: Porta (Mobiliário divisório de espaço e de proteção)
narrower: Portada
narrower: Taipal (Mobiliário divisório de espaço e de proteção)

Biombo
type: Concept
scope note: Conjunto de painéis pintados ou lavrados, articulados entre si por dobradiças, permitindo dividir ou proteger um compartimento ou espaço
in scheme: Tesauro SIPA
preferred label: Folding screen @en
preferred label: Paravent @fr
preferred label: Paravento pieghevole @it
broader: Mobiliário divisório de espaço e de proteção

Componentes do mobiliário divisório de espaço e de proteção
type: Concept
in scheme: Tesauro SIPA
preferred label: Space divider and protection furniture components @en
hidden label: Componentes do mobiliário divisório de espaço e de protecção
broader: Mobiliário divisório de espaço e de proteção
narrower: Aro (Componentes do mobiliário divisório de espaço e de proteção)
narrower: Bandeira (Vão)
narrower: Batente (Vão)

Aro (Componentes do mobiliário divisório de espaço e de proteção)
type: Concept
scope note: Elemento de madeira ou metal que guarnece um vão de uma porta ou janela.
in scheme: Tesauro SIPA
preferred label: Hoop; Ring; Frame (Space divider and protection furniture components) @en
alternative label: Bastidor
alternative label: Alizar (Porta)
broader: Componentes do mobiliário divisório de espaço e de proteção
narrower: Chumbadouro
narrower: Couceira

Chumbadouro
type: Concept
scope note: Pequeno orifício aberto nas cantarias que constituem o aro de uma porta ou janela, que permitem a introdução de chumbo para fixar uma grade ou as ferragens de uma folha.
in scheme: Tesauro SIPA
preferred label: Rag-bolt @en
broader: Aro (Componentes do mobiliário divisório de espaço e de proteção)

Couceira
type: Concept
scope note: Peça saliente, que forma um pequeno degrau, onde assentam as ombreiras de uma porta
in scheme: Tesauro SIPA
preferred label: Hindmost @en
broader: Aro (Componentes do mobiliário divisório de espaço e de proteção)

Bandeira (Vão)
type: Concept
scope note: Pequena janela fixa ou de abrir em eixo, colocada sobre uma porta ou uma janela, permitindo uma maior luminosidade de um espaço, muito utilizada na arquitetura civil do final do século XIX e início do século XX.
in scheme: Tesauro SIPA
preferred label: Fanlight (Window opening) @en
broader: Componentes do mobiliário divisório de espaço e de proteção

Batente (Vão)
type: Concept
scope note: Elemento saliente existente no aro, que trava o movimento das folhas de um vão de porta ou janela.
in scheme: Tesauro SIPA
preferred label: Doorjamb; Doorpost (Window opening) @en
broader: Componentes do mobiliário divisório de espaço e de proteção

Cancela
type: Concept
scope note: Vedação executada em variados materiais que separa dois espaços
in scheme: Tesauro SIPA
preferred label: Grille (Portail) @fr
preferred label: Cancelo
preferred label: Wrought-iron gate; Grilled gate @en
broader: Mobiliário divisório de espaço e de proteção

Estore
type: Concept
scope note: Elemento móvel que protege exterior ou interiormente um vão, composto por vários elementos móveis (em madeira, metal ou PVC), que enrola superiormente, acionado manual ou mecanicamente. A caixa onde o estore recolhe pode estar no interior ou no exterior
in scheme: Tesauro SIPA
preferred label: Shutter @en
preferred label: Store @fr
preferred label: Stuoia @it
alternative label: Persiana
broader: Mobiliário divisório de espaço e de proteção
narrower: Seguintes (Estore)

Seguintes (Estore)
type: Concept
scope note: Calha colocada nos aros dos vãos, onde corre um estore
in scheme: Tesauro SIPA
preferred label: Blinds (Shutter) @en
broader: Estore

Gelosia (Mobiliário divisório de espaço e de proteção)
type: Concept
in scheme: Tesauro SIPA
preferred label: Jalousie @en
preferred label: Volet @fr
preferred label: Gelosia @it
alternative label: Reixa
alternative label: Rótula
alternative label: Trelissa
broader: Mobiliário divisório de espaço e de proteção

Gradão
type: Concept
in scheme: Tesauro SIPA
preferred label: Railing @en
broader: Mobiliário divisório de espaço e de proteção

Grade
type: Concept
scope note: Estrutura em metal ou madeira, vazada ou não, que protege determinado espaço ou elemento
in scheme: Tesauro SIPA
preferred label: Grille @fr
preferred label: Grata @it
preferred label: Grid @en
broader: Mobiliário divisório de espaço e de proteção
narrower: Grade em papo de rola

Grade em papo de rola
type: Concept
in scheme: Tesauro SIPA
preferred label: Curved bar grille @en
preferred label: Grille à barreaux galbés @fr
preferred label: Grata con barre curve @it
broader: Grade

Mosquiteiro
type: Concept
scope note: Elemento de madeira, metal ou PVC e rede, que protege exterior ou interiormente uma janela ou porta, evitando o acesso de insetos ao interior
in scheme: Tesauro SIPA
preferred label: Mosquito net @en
preferred label: Moustiquaire @fr
preferred label: Zanzariera @it
broader: Mobiliário divisório de espaço e de proteção

Porta (Mobiliário divisório de espaço e de proteção)
type: Concept
scope note: Elemento de madeira, metal ou PVC que funciona como uma barreira num vão, fechando-o, mas de forma articulada, permitindo a entrada ou saída dum espaço, ou funções de garantir a privacidade, separando áreas com funções diferentes ou controlando a ventilação.
in scheme: Tesauro SIPA
preferred label: Door (Space and protective division furniture) @en
preferred label: Porte (Meubles de séparation et de protection) @fr
preferred label: Porta (Divisorio e mobile di protezione) @it
broader: Mobiliário divisório de espaço e de proteção
narrower: Folha (Porta)

Folha (Porta)
type: Concept
scope note: Cada um dos componentes verticais que fecham uma porta ou uma janela
in scheme: Tesauro SIPA
preferred label: Panel (Door) @en
preferred label: Panneau (Porte) @fr
preferred label: Panello (Porta) @it
broader: Porta (Mobiliário divisório de espaço e de proteção)
narrower: Componentes da folha
narrower: Almofada
narrower: Batente (Folha)
narrower: Caixilho
narrower: Espelho (Folha)
narrower: Postigo (Folha)
narrower: Puxador
narrower: Ralo
narrower: Relha
narrower: Taleira
narrower: Travessa (Folha)

Componentes da folha
type: Concept
in scheme: Tesauro SIPA
preferred label: Door panel components @en
preferred label: Composants du panneau de porte @fr
preferred label: Componenti del pannello della porta @it
broader: Folha (Porta)

Almofada
type: Concept
scope note: Cada um dos elementos salientes que ornam uma folha.
in scheme: Tesauro SIPA
preferred label: Door pad @en
alternative label: Relega
broader: Folha (Porta)

Batente (Folha)
type: Concept
scope note: Elemento saliente existente numa folha, onde encosta uma das folhas de uma porta ou janela
in scheme: Tesauro SIPA
preferred label: Casement (Door panel) @en
broader: Folha (Porta)

Caixilho
type: Concept
scope note: Elementos de madeira, metal ou cantaria, onde se fixam as vidraças, que protegem uma folha.
in scheme: Tesauro SIPA
preferred label: Frame @en
preferred label: Châssis @fr
preferred label: Infisso @it
broader: Folha (Porta)
narrower: Vidraça

Vidraça
type: Concept
scope note: Cada um dos vidros colocados no caixilho.
in scheme: Tesauro SIPA
preferred label: Vetrata @it
preferred label: Vitrage @fr
preferred label: Pane; Window pane @en
broader: Caixilho

Espelho (Folha)
type: Concept
scope note: Superfície lisa de uma folha.
in scheme: Tesauro SIPA
preferred label: Mirror (Panel) @en
broader: Folha (Porta)

Postigo (Folha)
type: Concept
scope note: Pequena abertura móvel ou fixa, existente numa folha.
in scheme: Tesauro SIPA
preferred label: Hatch (Panel) @en
preferred label: Portillon (Panneau) @fr
preferred label: Sportello (Panello) @it
alternative label: Espreitadela
broader: Folha (Porta)

Puxador
type: Concept
in scheme: Tesauro SIPA
preferred label: Handle @en
preferred label: Tirant (Poignée) @fr
preferred label: Maniglia @it
broader: Folha (Porta)

Ralo
type: Concept
scope note: Peça de madeira ou metal, crivada de pequenos orifícios, existente nas folhas, permitindo a observação de quem está no interior ou permitir a comunicação verbal entre o interior e o exterior.
in scheme: Tesauro SIPA
preferred label: Crible @fr
preferred label: Crivello @it
preferred label: Drain; Sieve @en
alternative label: Crivo
broader: Folha (Porta)

Relha
type: Concept
scope note: Tábua que atravessa diagonalmente uma folha, reforçando-a.
in scheme: Tesauro SIPA
preferred label: Ploughshare @en
broader: Folha (Porta)

Taleira
type: Concept
scope note: Peça colocada na espessura de uma folha de grandes dimensões ou num painel, evitando que a madeira se deforme com o tempo.
in scheme: Tesauro SIPA
preferred label: Spline @en
broader: Folha (Porta)

Travessa (Folha)
type: Concept
scope note: Cada um dos elementos salientes na orla de uma folha ou os elementos salientes que dividem as várias almofadas que a compõe
in scheme: Tesauro SIPA
preferred label: Platter @en
broader: Folha (Porta)
narrower: Regulete
narrower: Travessa de peitoril
narrower: Travessa de soleira
narrower: Travessa de verga

Regulete
type: Concept
scope note: Pequeno elemento estreito e, normalmente, liso que separa as almofadas de uma folha
in scheme: Tesauro SIPA
preferred label: Reglet @en
broader: Travessa (Folha)

Travessa de peitoril
type: Concept
scope note: Elemento saliente existente na base da folha de uma janela
in scheme: Tesauro SIPA
preferred label: Windowsill crossbeam @en
broader: Travessa (Folha)

Travessa de soleira
type: Concept
scope note: Elemento saliente existente na base da folha de uma porta
in scheme: Tesauro SIPA
preferred label: Doorsill crossbeam @en
broader: Travessa (Folha)

Travessa de verga
type: Concept
scope note: Elemento saliente existente no topo da folha de uma porta ou janela
in scheme: Tesauro SIPA
preferred label: Lintel crossbeam @en
broader: Travessa (Folha)

Portada
type: Concept
scope note: Cada um dos elementos móveis que protege a folha de uma porta ou de uma janela. Pode ser de uma, duas, três ou mais folhas, que se apresentam almofadadas ou lisas.
in scheme: Tesauro SIPA
preferred label: Portaille @fr
preferred label: Portone @it
preferred label: Doorway; Gateway; Shutter @en
alternative label: Contravento
broader: Mobiliário divisório de espaço e de proteção
narrower: Veneziana

Veneziana
type: Concept
scope note: Portada de tabuinhas dispostas em ângulo oblíquo, que protege exteriormente a folha de uma janela ou de uma porta
in scheme: Tesauro SIPA
preferred label: Venetian blind (Shutter) @en
preferred label: Volet (Portaille) @fr
preferred label: Otturatore (Portone) @it
broader: Portada

Taipal (Mobiliário divisório de espaço e de proteção)
type: Concept
scope note: Vedação móvel que protege uma porta
in scheme: Tesauro SIPA
preferred label: Outside shutter @en
preferred label: Taipal @fr
broader: Mobiliário divisório de espaço e de proteção

Objetos
type: Concept
in scheme: Tesauro SIPA
preferred label: Objects @en
preferred label: Objets @fr
preferred label: Oggetti @it
hidden label: Objectos
broader: Objetos, Equipamentos, Mobiliário e Veículos
narrower: Corda
narrower: Objetos móveis

Corda
type: Concept
in scheme: Tesauro SIPA
preferred label: Rope @en
broader: Objetos

Objetos móveis
type: Concept
in scheme: Tesauro SIPA
preferred label: Mobile objects @en
preferred label: Objets mobiles @fr
preferred label: Oggetti mobili @it
hidden label: Objectos móveis
broader: Objetos
narrower: Objetos móveis integrados
narrower: Objetos móveis segundo a forma de agregação
narrower: Objetos móveis segundo a função

Objetos móveis integrados
type: Concept
scope note: Objetos amovíveis pela sua função ou dimensão
in scheme: Tesauro SIPA
preferred label: Integrated mobile objects @en
preferred label: Objets mobiles intégrés @fr
preferred label: Oggetti mobili integrati @it
hidden label: Objectos móveis integrados
broader: Objetos móveis
narrower: Objetos móveis integrados genéricos segundo a função

Objetos móveis integrados genéricos segundo a função
type: Concept
in scheme: Tesauro SIPA
preferred label: Generic integrated mobile objects according to function @en
preferred label: Objets mobiles intégrés génériques selon la fonction @fr
preferred label: Oggetti mobili integrati generici secondo la funzione @it
hidden label: Objectos móveis integrados genéricos
broader: Objetos móveis integrados
narrower: Objetos genéricos comemorativos e de devoção
narrower: Objetos funerários

Objetos genéricos comemorativos e de devoção
type: Concept
in scheme: Tesauro SIPA
preferred label: Generic commemorative and devotional objects @en
preferred label: Objets commémoratifs et dévotionnels génériques @fr
preferred label: Oggetti commemorativi e devozionali generici @it
hidden label: Objectos genéricos comemorativos e de devoção
broader: Objetos móveis integrados genéricos segundo a função
narrower: Escultura (Objetos genéricos comemorativos e de devoção)

Escultura (Objetos genéricos comemorativos e de devoção)
type: Concept
in scheme: Tesauro SIPA
preferred label: Sculpture (Generic commemorative and devotional objects) @en
preferred label: Sculpture (Objets commémoratifs et dévotionnels génériques) @fr
preferred label: Scultura (Oggetti commemorativi e devozionali generici) @it
broader: Objetos genéricos comemorativos e de devoção
narrower: Escultura arquitetónica
narrower: Escultura de vulto
narrower: Escultura funerária
narrower: Escultura heráldica

Escultura arquitetónica
type: Concept
in scheme: Tesauro SIPA
preferred label: Architectural sculpture @en
preferred label: Sculpture architecturale @fr
preferred label: Scultura architettonica @it
hidden label: Escultura arquitectónica
broader: Escultura (Objetos genéricos comemorativos e de devoção)
narrower: Elemento decorativo
narrower: Retábulo

Elemento decorativo
type: Concept
in scheme: Tesauro SIPA
preferred label: Decorative element @en
preferred label: Élément décoratif @fr
broader: Escultura arquitetónica

Retábulo
type: Concept
scope note: Estrutura de dimensões variáveis, colocada atrás do altar, normalmente fixo à parede, ostentando elementos decorativos ou narrativas religiosas. Pode ser pintado, em alvenaria, estuque ou madeira entalhada
in scheme: Tesauro SIPA
preferred label: Retable @fr
preferred label: Pala d'altare @it
broader: Escultura arquitetónica
narrower: Componentes do retábulo
narrower: Retábulo segundo a época
narrower: Retábulo segundo a forma
narrower: Retábulo segundo a função

Componentes do retábulo
type: Concept
in scheme: Tesauro SIPA
preferred label: Retable components @en
preferred label: Composants du retable @fr
preferred label: Componenti di pala d'altare @it
broader: Retábulo
narrower: Ático (Retábulo)
narrower: Banco (Retábulo)
narrower: Corpo

Ático (Retábulo)
type: Concept
scope note: Componente de remate de um retábulo
in scheme: Tesauro SIPA
preferred label: Attic (Retable) @en
preferred label: Attique (Retable) @fr
preferred label: Attico (Pala d'altare) @it
broader: Componentes do retábulo
narrower: Espaldar (Retábulo)
narrower: Luneta (Retábulo)
narrower: Tabela
narrower: Tondo (Retábulo)

Espaldar (Retábulo)
type: Concept
scope note: Tipo de ático profusamente decorado e recortado, que prolonga o corpo do retábulo até à cobertura do espaço em que se insere
in scheme: Tesauro SIPA
preferred label: Backrest (Retable) @en
broader: Ático (Retábulo)

Luneta (Retábulo)
type: Concept
scope note: Pintura de forma ovalada ou semicircular colocada no topo de um retábulo. Pode também surgir sobre um políptico ou um quadro de altar
in scheme: Tesauro SIPA
preferred label: Tympanum; Lunette (Retable) @en
preferred label: Lunette (Retable) @fr
preferred label: Lunetta (Pala d'altare) @it
broader: Ático (Retábulo)

Tabela
type: Concept
scope note: Painel pintado ou relevado, emoldurado, que compõe o ático de um retábulo, colocado em eixo com o nicho ou tribuna do corpo da estrutura.
in scheme: Tesauro SIPA
preferred label: Register; Chart; Counterstamp @en
broader: Ático (Retábulo)
narrower: Aleta (Tabela)

Aleta (Tabela)
type: Concept
scope note: Curva ou voluta colocada no remate de um retábulo a ladear uma tabela. Por extensão, pode referir outro elementos decorativo que flanqueia a tabela
in scheme: Tesauro SIPA
preferred label: Wing; Side panel (Register) @en
broader: Tabela

Tondo (Retábulo)
type: Concept
scope note: Painel pintado ou relevado, circular, colocado no ático de um retábulo
in scheme: Tesauro SIPA
preferred label: Tondo; Retable circular panel @en
broader: Ático (Retábulo)

Banco (Retábulo)
type: Concept
scope note: Zona que compõe o retábulo, situada entre a base, o sotobanco, e o corpo
in scheme: Tesauro SIPA
preferred label: Platform; Step (Retable) @en
broader: Componentes do retábulo

Corpo
type: Concept
scope note: Área principal do retábulo, onde se encontram os objetos de devoção e constituindo a área mais decorada. Situa-se entre o banco e o ático.
in scheme: Tesauro SIPA
preferred label: Corpus; Body (Retable) @en
broader: Componentes do retábulo
narrower: Eixo (Retábulo)
narrower: Nicho (Retábulo)
narrower: Painel (Retábulo)
narrower: Quadro devocional
narrower: Guarda-céu
narrower: Sotobanco

Eixo (Retábulo)
type: Concept
scope note: Cada um dos elementos verticais que compõem o corpo do retábulo
in scheme: Tesauro SIPA
preferred label: Axle (Retable) @en
broader: Corpo

Nicho (Retábulo)
type: Concept
scope note: Reentrância no corpo do retábulo, normalmente côncavo, onde é colocada a imagem do orago.
in scheme: Tesauro SIPA
preferred label: Niche (Retable) @en
preferred label: Édicule (Retable) @fr
preferred label: Edicola (Pala d'altare) @it
broader: Corpo

Painel (Retábulo)
type: Concept
scope note: Elemento integrado num retábulo, individualizado e com moldura própria, que ostenta pintura, elementos relevados ou entalhados
in scheme: Tesauro SIPA
preferred label: Panel (Retable) @en
preferred label: Panneau (Retable) @fr
preferred label: Scomparto (Pala d'altare) @it
alternative label: Quadro de altar
broader: Corpo

Quadro devocional
type: Concept
scope note: Representação pictórica ou relevada existente na base de uma estrutura retabular, normalmente entre o sacrário e a zona principal do retábulo, dedicada ao orago
in scheme: Tesauro SIPA
preferred label: Devotional chart @en
preferred label: Tableau de dévotion @fr
preferred label: Quadro d' altare @it
broader: Corpo
narrower: Volante

Volante
type: Concept
scope note: Cada um dos painéis pintados ou relevados, articulados ao painel fixo de um políptico
in scheme: Tesauro SIPA
preferred label: Volet @fr
preferred label: Wing panel @en
preferred label: Anta @it
broader: Quadro devocional

Guarda-céu
type: Concept
scope note: Estrutura que protege o topo de um retábulo, saliente e adornado por drapeados em boca de cena, fingidos ou verdadeiros.
in scheme: Tesauro SIPA
preferred label: Canopy; Pediment @en
preferred label: Auvent @fr
broader: Corpo

Sotobanco
type: Concept
scope note: Estrutura que compõe a base de sustentação do retábulo
in scheme: Tesauro SIPA
preferred label: Sotabanco @fr
broader: Corpo
narrower: Edícula (Retábulo)
narrower: Predela
narrower: Tenente
narrower: Tribuna (Retábulo)

Edícula (Retábulo)
type: Concept
in scheme: Tesauro SIPA
preferred label: Niche (Retable) @en
preferred label: Édicule (Retable) @fr
preferred label: Edicola (Pala d'altare) @it
broader: Sotobanco

Predela
type: Concept
scope note: Espaço existente sobre o altar, na base de uma estrutura retabular, podendo estar ornada por painel ou conjunto de painéis, ostentando elementos ornamentais ou figurativos, pintados ou relevados, criando, frequentemente, uma narrativa
in scheme: Tesauro SIPA
preferred label: Predella @en
preferred label: Prédelle @fr
broader: Sotobanco

Tenente
type: Concept
in scheme: Tesauro SIPA
preferred label: Supporter @en
broader: Sotobanco

Tribuna (Retábulo)
type: Concept
scope note: Amplo vão rasgado no corpo do retábulo, onde surge o trono eucarístico. Encontrava-se, normalmente encerrado por tela pintada, que se movia nas épocas festivas. A tribuna poderia ser dupla, abrindo para um compartimento (casa da tribuna) na face posterior, permitindo a devoção particular do clero ou da comunidade que detém aquele altar. Tem acesso para manutenção por escadas no interior da estrutura retabular
in scheme: Tesauro SIPA
preferred label: Rostrum (Retable) @en
preferred label: Tribune (Retable) @fr
preferred label: Tribuna (Pala d'altare) @it
broader: Sotobanco
narrower: Camarim transparente
narrower: Trono eucarístico

Camarim transparente
type: Concept
scope note: Tipo de tribuna de um retábulo que recebe luz natural pelo rasgamento dos vãos, por vezes zenital, atribuindo-lhe um forte carácter místico
in scheme: Tesauro SIPA
preferred label: Niche @en
broader: Tribuna (Retábulo)

Trono eucarístico
type: Concept
scope note: Estrutura escalonada existente no interior da tribuna ou do camarim de um retábulo-mor, com degraus em número ímpar, no topo do qual se coloca a exposição eucarístico. Esta estrutura teve grande difusão em Portugal a partir da Contra-Reforma
in scheme: Tesauro SIPA
preferred label: Throne @en
preferred label: Trône @fr
preferred label: Trono @it
broader: Tribuna (Retábulo)

Retábulo segundo a época
type: Concept
in scheme: Tesauro SIPA
preferred label: Retable according to period of time @en
preferred label: Retable selon l' époque @fr
preferred label: Mostra d' altare secondo il periodo @it
broader: Retábulo
narrower: Retábulo gótico
narrower: Retábulo renascentista
narrower: Retábulo maneirista
narrower: Retábulo barroco
narrower: Retábulo rococó
narrower: Retábulo neoclássico
narrower: Retábulo revivalista

Retábulo gótico
type: Concept
in scheme: Tesauro SIPA
preferred label: Gothic retable @en
preferred label: Retable gothique @fr
preferred label: Mostra d'altare gotica @it
broader: Retábulo segundo a época

Retábulo renascentista
type: Concept
in scheme: Tesauro SIPA
preferred label: Renaissance retable @en
preferred label: Retable de la Renaissance @fr
preferred label: Mostra d'altare del Rinascimento @it
broader: Retábulo segundo a época
narrower: Retábulo renascentista coimbrão

Retábulo renascentista coimbrão
type: Concept
in scheme: Tesauro SIPA
preferred label: “Coimbrão” Renaissance retable @en
broader: Retábulo renascentista

Retábulo maneirista
type: Concept
in scheme: Tesauro SIPA
preferred label: Manneirist retable @en
broader: Retábulo segundo a época
narrower: Retábulo tipo nicho
narrower: Retábulo tipo edícula
narrower: Retábulo de andares

Retábulo tipo nicho
type: Concept
scope note: Retábulo de pequenas dimensões, com o corpo marcado pela existência de um nicho simples, onde é integrada a imagem do orago.
in scheme: Tesauro SIPA
preferred label: Niche-type retable @en
broader: Retábulo maneirista

Retábulo tipo edícula
type: Concept
scope note: Retábulo de pequenas dimensões, com o corpo marcado pela existência de uma edícula, um nicho com profuso envolvimento de elementos arquitetónicos, assemelhando-se a um pequeno edifício, onde é integrada a imagem do orago.
in scheme: Tesauro SIPA
preferred label: Niche-type retable @en
broader: Retábulo maneirista

Retábulo de andares
type: Concept
scope note: Retábulo formado por várias fiadas horizontais de apainelados pintados ou integrando nichos com imaginária, evoluindo em vários andares.
in scheme: Tesauro SIPA
preferred label: Storey retable @en
alternative label: Retábulo jesuíta
broader: Retábulo maneirista

Retábulo barroco
type: Concept
in scheme: Tesauro SIPA
preferred label: Baroque retable @en
preferred label: Retable baroque @fr
preferred label: Mostra d'altare barocca @it
broader: Retábulo segundo a época
narrower: Retábulo barroco nacional
narrower: Retábulo barroco joanino
narrower: Retábulo tardo-barroco

Retábulo barroco nacional
type: Concept
scope note: Tipificação atribuída por Robert C. Smith aos retábulos que rematam em várias arquivoltas concêntricas.
in scheme: Tesauro SIPA
preferred label: National baroque retable @en
broader: Retábulo barroco

Retábulo barroco joanino
type: Concept
in scheme: Tesauro SIPA
preferred label: Joanine baroque retable @en
broader: Retábulo barroco

Retábulo tardo-barroco
type: Concept
in scheme: Tesauro SIPA
preferred label: Late-baroque retable @en
broader: Retábulo barroco

Retábulo rococó
type: Concept
in scheme: Tesauro SIPA
preferred label: Rococo retable @en
preferred label: Retable rococo @fr
preferred label: Mostra d' altare rococò @it
broader: Retábulo segundo a época

Retábulo neoclássico
type: Concept
in scheme: Tesauro SIPA
preferred label: Neoclassical retable @en
broader: Retábulo segundo a época

Retábulo revivalista
type: Concept
in scheme: Tesauro SIPA
preferred label: Revivalist retablae @en
broader: Retábulo segundo a época
narrower: Retábulo neobarroco
narrower: Retábulo neorrococó
narrower: Retábulo neorromânico
narrower: Retábulo neogótico

Retábulo neobarroco
type: Concept
in scheme: Tesauro SIPA
preferred label: Neo-baroque retable @en
broader: Retábulo revivalista

Retábulo neorrococó
type: Concept
in scheme: Tesauro SIPA
preferred label: Neo-rococo retable @en
hidden label: Retábulo neo-rococó
broader: Retábulo revivalista

Retábulo neorromânico
type: Concept
in scheme: Tesauro SIPA
preferred label: Neo-romanesque retable @en
hidden label: Retábulo neo-românico
broader: Retábulo revivalista

Retábulo neogótico
type: Concept
in scheme: Tesauro SIPA
preferred label: Neo-gothic retable @en
broader: Retábulo revivalista

Retábulo segundo a forma
type: Concept
in scheme: Tesauro SIPA
preferred label: Retable according to shape @en
preferred label: Retable selon la forme @fr
preferred label: Mostra d'altare secondo la forma @it
broader: Retábulo
narrower: Retábulo arquitetónico
narrower: Retábulo de volantes

Retábulo arquitetónico
type: Concept
scope note: Estrutura decorativa que encima um altar, de grandes dimensões, ocupando toda uma parede e recriando, através dos seus componentes, uma estrutura arquitetónica, normalmente baseada na decoração de pórticos
in scheme: Tesauro SIPA
preferred label: Architecture retable @en
preferred label: Retable architectonique @fr
preferred label: Mostra architettonica d' altare @it
alternative label: Retábulo à romana
hidden label: Retábulo arquitectónico
broader: Retábulo segundo a forma
narrower: Retábulo de talha com preparação para douramento
narrower: Retábulo de talha dourada
narrower: Retábulo de talha em branco
narrower: Retábulo de talha pintada
narrower: Retábulo em alvenaria pintada
narrower: Retábulo em cantaria
narrower: Retábulo fingido

Retábulo de talha com preparação para douramento
type: Concept
scope note: Retábulo que recebeu todas as camadas preparatórias para aplicação de folha de ouro ou pintura, mas que ficou por terminar
in scheme: Tesauro SIPA
preferred label: Gilding-prepared carved retable @en
broader: Retábulo arquitetónico

Retábulo de talha dourada
type: Concept
in scheme: Tesauro SIPA
preferred label: Gilded carved retable @en
broader: Retábulo arquitetónico

Retábulo de talha em branco
type: Concept
scope note: Retábulo de madeira entalhada, sem qualquer tipo de revestimento.
in scheme: Tesauro SIPA
preferred label: Plain carved retable @en
broader: Retábulo arquitetónico

Retábulo de talha pintada
type: Concept
in scheme: Tesauro SIPA
preferred label: Painted carved retable @en
broader: Retábulo arquitetónico

Retábulo em alvenaria pintada
type: Concept
in scheme: Tesauro SIPA
preferred label: Painted masonry retable @en
broader: Retábulo arquitetónico

Retábulo em cantaria
type: Concept
in scheme: Tesauro SIPA
preferred label: Masonry retable @en
broader: Retábulo arquitetónico

Retábulo fingido
type: Concept
scope note: Retábulo pintado sobre uma superfície, dando a ilusão de um retábulo arquitetónico
in scheme: Tesauro SIPA
preferred label: Faux retable @en
broader: Retábulo arquitetónico

Retábulo de volantes
type: Concept
scope note: Tipo de retábulo formado por painéis pintados, alguns deles articulados por dobradiças permitindo o seu fecho.
in scheme: Tesauro SIPA
preferred label: Wing-panelled retable @en
preferred label: Retable à volets @fr
preferred label: Retablo adante @it
broader: Retábulo segundo a forma
narrower: Díptico
narrower: Políptico
narrower: Tríptico

Díptico
type: Concept
scope note: Retábulo composto por dois painéis, fechando um deles sobre o outro. Podem ter o reverso pintado.
in scheme: Tesauro SIPA
preferred label: Diptych @en
preferred label: Diptyque @fr
preferred label: Dittico @it
broader: Retábulo de volantes

Políptico
type: Concept
scope note: Retábulo composto por vários painéis, alguns deles articulados, permitindo o fecho da estrutura.
in scheme: Tesauro SIPA
preferred label: Polyptych @en
preferred label: Polyptyque @fr
preferred label: Polittico @it
broader: Retábulo de volantes

Tríptico
type: Concept
scope note: Retábulo composto por um painel central e dois volantes laterais, de menores dimensões, permitindo o seu encerramento. Os painéis podem estar pintados no seu reverso.
in scheme: Tesauro SIPA
preferred label: Triptych @en
preferred label: Triptyque @fr
preferred label: Trittico @it
broader: Retábulo de volantes

Retábulo segundo a função
type: Concept
in scheme: Tesauro SIPA
preferred label: Retable according to function @en
preferred label: Retable selon la fonction @fr
preferred label: Mostra d' altare secondo la funzione @it
broader: Retábulo
narrower: Retábulo expositivo
narrower: Retábulo relicário

Retábulo expositivo
type: Concept
in scheme: Tesauro SIPA
preferred label: Display retable @en
broader: Retábulo segundo a função

Retábulo relicário
type: Concept
scope note: Retábulo com o corpo vazado por vários nichos e edículas, contendo relicários.
in scheme: Tesauro SIPA
preferred label: Reliquary retable @en
broader: Retábulo segundo a função

Escultura de vulto
type: Concept
in scheme: Tesauro SIPA
preferred label: Sculpture en ronde-bosse @fr
preferred label: Scultura a tutto tondo @it
preferred label: Sculpture in the round (ronde-bosse) @en
broader: Escultura (Objetos genéricos comemorativos e de devoção)
narrower: Escultura de vulto segundo o tipo
narrower: Estatuária

Escultura de vulto segundo o tipo
type: Concept
in scheme: Tesauro SIPA
preferred label: Sculpture in the round by type @en
preferred label: Sculpture en ronde-bosse selon le type @fr
preferred label: Scultura a tutto tondo per tipo @it
broader: Escultura de vulto
narrower: Busto
narrower: Cabeça
narrower: Figura de popa
narrower: Figura de proa
narrower: Grupo escultórico
narrower: Imaginária
narrower: Modelo
narrower: Placa escultórica
narrower: Torso

Busto
type: Concept
scope note: Representação da cabeça e parte do tronco de uma figura humana, assente numa peanha
in scheme: Tesauro SIPA
preferred label: Bust @en
preferred label: Buste @fr
broader: Escultura de vulto segundo o tipo

Cabeça
type: Concept
scope note: Representação da cabeça humana ou da extremidade anterior do corpo de um animal incluindo a cabeça e o pescoço
in scheme: Tesauro SIPA
preferred label: Head (Sculpture) @en
preferred label: Tête (sculpture) @fr
preferred label: Testa (scultura) @it
broader: Escultura de vulto segundo o tipo

Figura de popa
type: Concept
scope note: Escultura de vulto colocada na popa de uma embarcação
in scheme: Tesauro SIPA
preferred label: Stern figurehead (Nautical) @en
preferred label: Figure de poupe @fr
preferred label: Figura di poppa @it
broader: Escultura de vulto segundo o tipo

Figura de proa
type: Concept
scope note: Escultura de vulto colocada na proa de uma embarcação
in scheme: Tesauro SIPA
preferred label: Bow figurehead (Nautical) @en
preferred label: Figure de proue @fr
preferred label: Figura di prua @it
broader: Escultura de vulto segundo o tipo

Grupo escultórico
type: Concept
scope note: Escultura de pequenas dimensões, atingindo, no máximo, a altura de 25 centímetros
in scheme: Tesauro SIPA
preferred label: Sculptural group @en
preferred label: Groupe sculpté @fr
preferred label: Gruppo scultoreo @it
broader: Escultura de vulto segundo o tipo
narrower: Grupo escultórico agregado

Grupo escultórico agregado
type: Concept
in scheme: Tesauro SIPA
preferred label: Assembled sculptural group @en
preferred label: Groupe sculpté assemblé @fr
preferred label: Gruppo scultoreo assemblato @it
broader: Grupo escultórico

Imaginária
type: Concept
in scheme: Tesauro SIPA
preferred label: Religious imagery @en
preferred label: Imagerie religieuse @fr
preferred label: Immaginaria sacra @it
broader: Escultura de vulto segundo o tipo
related: Escultura (Artes visuais)
modified: 2025-09-23T14:14:15

Modelo
type: Concept
scope note: Modelo, em tamanho reduzido e numa escala conveniente, de uma forma ou objeto que se pretende construir ou fabricar
in scheme: Tesauro SIPA
preferred label: Model @en
preferred label: Maquette @fr
preferred label: Modello @it
broader: Escultura de vulto segundo o tipo

Placa escultórica
type: Concept
in scheme: Tesauro SIPA
preferred label: Sculptural plaque @en
preferred label: Plaque sculptée @fr
preferred label: Placca scolpita @it
broader: Escultura de vulto segundo o tipo
narrower: Lâmina
narrower: Plaqueta

Lâmina
type: Concept
in scheme: Tesauro SIPA
preferred label: Relief plate @en
preferred label: Feuille gravée @fr
preferred label: Lamina incisa @it
broader: Placa escultórica

Plaqueta
type: Concept
in scheme: Tesauro SIPA
preferred label: Small plaque (Plaquette) @en
preferred label: Plaquette @fr
preferred label: Plachetta @it
broader: Placa escultórica

Torso
type: Concept
scope note: Escultura em vulto, representando um tronco humano, sem cabeça e sem membros.
in scheme: Tesauro SIPA
preferred label: Torse @fr
broader: Escultura de vulto segundo o tipo

Estatuária
type: Concept
in scheme: Tesauro SIPA
preferred label: Statuary @en
preferred label: Statuaire @fr
preferred label: Statuaria @it
broader: Escultura de vulto
narrower: Estátua de pé
narrower: Estátua equestre
narrower: Estátua jacente

Estátua de pé
type: Concept
in scheme: Tesauro SIPA
preferred label: Standing statue @en
preferred label: Statue debout @fr
preferred label: Statua in piedi @it
broader: Estatuária

Estátua equestre
type: Concept
scope note: Escultura ou grupo escultórico representando uma personagem montada a cavalo
in scheme: Tesauro SIPA
preferred label: Equestrian statue @en
preferred label: Statue équestre @fr
preferred label: Statua equestre @it
broader: Estatuária

Estátua jacente
type: Concept
scope note: Escultura funerária, geralmente esculpida em vulto, representando o morto deitado e vestido sobre a tampa do túmulo
in scheme: Tesauro SIPA
preferred label: Recumbent statue @en
preferred label: Statue couchée @fr
preferred label: Statua giacente @it
broader: Estatuária

Escultura funerária
type: Concept
in scheme: Tesauro SIPA
preferred label: Funerary sculpture @en
preferred label: Sculpture funéraire @fr
preferred label: Scultura funeraria @it
broader: Escultura (Objetos genéricos comemorativos e de devoção)
related: Objetos funerários
modified: 2025-09-23T14:14:48

Escultura heráldica
type: Concept
in scheme: Tesauro SIPA
preferred label: Heraldic sculpture @en
preferred label: Sculpture héraldique @fr
preferred label: Scultura araldica @it
broader: Escultura (Objetos genéricos comemorativos e de devoção)
narrower: Pedra de armas (Escultura heráldica)

Pedra de armas (Escultura heráldica)
type: Concept
scope note: Insígnia ou distintivo de pessoa ou família nobre conferidos, geralmente, por merecimento, constituído por figuras e ornatos dispostos num escudo; escudo de armas
in scheme: Tesauro SIPA
preferred label: Coat of arms stone (Heraldic sculpture) @en
preferred label: Pierre d'armoiries (Sculpture héraldique) @fr
preferred label: Pietra d'armi (Scultura araldica) @it
broader: Escultura heráldica
narrower: Escudo de armas
narrower: Paquife

Escudo de armas
type: Concept
scope note: Emblema em forma de escudo onde se representam as armas de uma família, corporação, cidade, nação, etc.
in scheme: Tesauro SIPA
preferred label: Stemma @it
preferred label: Coat of arms @en
preferred label: Blason @fr
broader: Pedra de armas (Escultura heráldica)
narrower: Campo (Escudo de armas)
narrower: Escudo segundo a forma
narrower: Escudo segundo o detentor

Campo (Escudo de armas)
type: Concept
scope note: Área do escudo propriamente dita, onde surgem representadas as armas
in scheme: Tesauro SIPA
preferred label: Field (Coat of arms) @en
broader: Escudo de armas
narrower: Partes
narrower: Pontos

Partes
type: Concept
scope note: Cada uma das partes em que o escudo pode ser dividido, ostentando representações próprias
in scheme: Tesauro SIPA
preferred label: Sections @en
broader: Campo (Escudo de armas)
narrower: Chefe
narrower: Contrachefe
narrower: Flanco dextro
narrower: Flanco sinistro

Chefe
type: Concept
scope note: Área superior do escudo, que pode ser dividida em três partes.
in scheme: Tesauro SIPA
preferred label: Chief @en
broader: Partes

Contrachefe
type: Concept
scope note: Área inferior do escudo, que pode ser dividida em três partes.
in scheme: Tesauro SIPA
preferred label: Base (Counter-chief) @en
broader: Partes

Flanco dextro
type: Concept
scope note: Área lateral direita do escudo, que pode ser dividida em três partes
in scheme: Tesauro SIPA
preferred label: Right flank @en
broader: Partes

Flanco sinistro
type: Concept
scope note: Área lateral esquerda do escudo, que pode ser dividida em três partes
in scheme: Tesauro SIPA
preferred label: Left flank @en
broader: Partes

Pontos
type: Concept
in scheme: Tesauro SIPA
preferred label: Spots @en
broader: Campo (Escudo de armas)
narrower: Cantão
narrower: Centro
narrower: Ponto de honra

Cantão
type: Concept
scope note: Cada uma das partes em que se dividem os flancos
in scheme: Tesauro SIPA
preferred label: Canton @en
broader: Pontos

Centro
type: Concept
scope note: Cada uma das partes em que se divide o centro
in scheme: Tesauro SIPA
preferred label: Center @en
broader: Pontos

Ponto de honra
type: Concept
scope note: Ponto central sobre as linhas horizontais de limitam o chefe ou o contrachefe
in scheme: Tesauro SIPA
preferred label: Point of honor @en
broader: Pontos

Escudo segundo a forma
type: Concept
in scheme: Tesauro SIPA
preferred label: Shield according to shape @en
broader: Escudo de armas
narrower: Escudo clássico
narrower: Escudo francês
narrower: Escudo nacional
narrower: Escudo oval
narrower: Escudo tipo lisonja
narrower: Escudo segundo a forma de divisão

Escudo clássico
type: Concept
in scheme: Tesauro SIPA
preferred label: Classic shield @en
broader: Escudo segundo a forma

Escudo francês
type: Concept
in scheme: Tesauro SIPA
preferred label: French shield @en
broader: Escudo segundo a forma

Escudo nacional
type: Concept
in scheme: Tesauro SIPA
preferred label: National shield @en
broader: Escudo segundo a forma

Escudo oval
type: Concept
in scheme: Tesauro SIPA
preferred label: Oval shield @en
broader: Escudo segundo a forma

Escudo tipo lisonja
type: Concept
in scheme: Tesauro SIPA
preferred label: Lozenge-shaped shield @en
broader: Escudo segundo a forma

Escudo segundo a forma de divisão
type: Concept
in scheme: Tesauro SIPA
preferred label: Shield according to division form @en
broader: Escudo segundo a forma
narrower: Escudo adextrado
narrower: Escudo cortado
narrower: Escudo esquartelado
narrower: Escudo fendido
narrower: Escudo flanqueado
narrower: Escudo frechado
narrower: Escudo gironado
narrower: Escudo mantelado
narrower: Escudo mantelado em chefe
narrower: Escudo partido
narrower: Escudo sinistrado
narrower: Escudo talhado
narrower: Escudo terciado em contrabanda
narrower: Escudo terciado em faixa
narrower: Escudo terciado em pala

Escudo adextrado
type: Concept
scope note: Escudo dividido em duas partes desiguais, a de menor dimensão no lado sinistro
in scheme: Tesauro SIPA
preferred label: Dexter-bearing shield @en
broader: Escudo segundo a forma de divisão

Escudo cortado
type: Concept
scope note: Escudo dividido de forma simétrica por uma linha horizontal
in scheme: Tesauro SIPA
preferred label: Per fess shield @en
broader: Escudo segundo a forma de divisão

Escudo esquartelado
type: Concept
scope note: Escudo dividido em quatro áreas, por uma cruz simples
in scheme: Tesauro SIPA
preferred label: Quarterly shield @en
broader: Escudo segundo a forma de divisão

Escudo fendido
type: Concept
scope note: Escudo dividido por uma linha transversal, que se inicia no chefe sinistro até ao contrachefe dextro
in scheme: Tesauro SIPA
preferred label: Per pale shield @en
broader: Escudo segundo a forma de divisão

Escudo flanqueado
type: Concept
scope note: Escudo dividido em três áreas, as laterais de menores dimensões, mas iguais entre si
in scheme: Tesauro SIPA
preferred label: Flanked shield @en
broader: Escudo segundo a forma de divisão

Escudo frechado
type: Concept
scope note: Escudo dividido em quatro áreas, por uma cruz em aspa
in scheme: Tesauro SIPA
preferred label: Chevroned shield @en
broader: Escudo segundo a forma de divisão

Escudo gironado
type: Concept
scope note: Escudo dividido em oito áreas, cortado por duas cruzes, uma simples e uma em aspa
in scheme: Tesauro SIPA
preferred label: Gyronny shield @en
broader: Escudo segundo a forma de divisão

Escudo mantelado
type: Concept
scope note: Escudo dividido em três áreas, por uma linha vertical, que diverge em duas linhas curvas na base
in scheme: Tesauro SIPA
preferred label: Per mantle shield @en
broader: Escudo segundo a forma de divisão

Escudo mantelado em chefe
type: Concept
scope note: Escudo dividido em duas áreas, a superior de menores dimensões e formando um triângulo
in scheme: Tesauro SIPA
preferred label: Mantled in chief shield @en
broader: Escudo segundo a forma de divisão

Escudo partido
type: Concept
scope note: Escudo dividido de forma simétrica por uma linha vertical
in scheme: Tesauro SIPA
preferred label: Party per pale @en
broader: Escudo segundo a forma de divisão

Escudo sinistrado
type: Concept
scope note: Escudo dividido em duas partes desiguais, a de menor dimensão no lado dextro
in scheme: Tesauro SIPA
preferred label: Sinister-bearing shield @en
broader: Escudo segundo a forma de divisão

Escudo talhado
type: Concept
scope note: Escudo dividido por uma linha transversal, que se inicia no chefe dextro até ao contrachefe sinistro
in scheme: Tesauro SIPA
preferred label: Party per fess @en
broader: Escudo segundo a forma de divisão

Escudo terciado em contrabanda
type: Concept
scope note: Escudo dividido em três áreas por duas linhas transversais paralelas, que se iniciam na dextra e se prolongam para a sinistra
in scheme: Tesauro SIPA
preferred label: Tierced in bend @en
broader: Escudo segundo a forma de divisão

Escudo terciado em faixa
type: Concept
scope note: Escudo dividido em três áreas por duas linhas horizontais paralelas
in scheme: Tesauro SIPA
preferred label: Tierced in fess @en
broader: Escudo segundo a forma de divisão

Escudo terciado em pala
type: Concept
scope note: Escudo dividido em três áreas por duas linhas verticais paralelas
in scheme: Tesauro SIPA
preferred label: Tierced in pale @en
broader: Escudo segundo a forma de divisão

Escudo segundo o detentor
type: Concept
in scheme: Tesauro SIPA
preferred label: Shield according to the bearer @en
broader: Escudo de armas
narrower: Armas de cidade
narrower: Armas de entidades
narrower: Armas de família
narrower: Armas de vila
narrower: Armas eclesiásticas
narrower: Armas republicanas
narrower: Armas monárquicas

Armas de cidade
type: Concept
in scheme: Tesauro SIPA
preferred label: City arms @en
broader: Escudo segundo o detentor

Armas de entidades
type: Concept
in scheme: Tesauro SIPA
preferred label: Institutional arms @en
broader: Escudo segundo o detentor

Armas de família
type: Concept
in scheme: Tesauro SIPA
preferred label: Family arms @en
broader: Escudo segundo o detentor

Armas de vila
type: Concept
in scheme: Tesauro SIPA
preferred label: Borough arms @en
broader: Escudo segundo o detentor

Armas eclesiásticas
type: Concept
in scheme: Tesauro SIPA
preferred label: Ecclesiastical arms @en
broader: Escudo segundo o detentor

Armas republicanas
type: Concept
in scheme: Tesauro SIPA
preferred label: Republican arms @en
broader: Escudo segundo o detentor

Armas monárquicas
type: Concept
in scheme: Tesauro SIPA
preferred label: Royal arms @en
broader: Escudo segundo o detentor

Paquife
type: Concept
in scheme: Tesauro SIPA
preferred label: Lambrequin @fr
preferred label: Mantling @en
preferred label: Mantello @it
broader: Pedra de armas (Escultura heráldica)
narrower: Coroa (Pedra de armas)
narrower: Elmo
narrower: Pavilhão
narrower: Rolete
narrower: Timbre

Coroa (Pedra de armas)
type: Concept
scope note: Signo exterior colocado sobre uma pedra de armas, em forma de coroa, remetendo para o estatuto hierárquico do seu detentor
in scheme: Tesauro SIPA
preferred label: Crown (Coat of arms) @en
preferred label: Couronne (Pierre d'armoiries) @fr
preferred label: Corona (Pietra d'armi) @it
broader: Paquife

Elmo
type: Concept
scope note: Signo exterior colocado sobre uma pedra de armas, em forma de elmo
in scheme: Tesauro SIPA
preferred label: Helmet (Heraldic) @en
preferred label: Casque (Héraldique) @fr
preferred label: Elmo (Araldico) @it
broader: Paquife

Pavilhão
type: Concept
in scheme: Tesauro SIPA
preferred label: Heraldic pavilion @en
broader: Paquife

Rolete
type: Concept
scope note: Conjunto de dobras de tecido que adornam o elmo e o escudo, feito de diferentes materiais e cores, e sua forma e posição podem variar dependendo da nobreza e linhagem do indivíduo
in scheme: Tesauro SIPA
preferred label: Volute; Roulade @en
broader: Paquife
narrower: Virol (Pedra de armas)

Virol (Pedra de armas)
type: Concept
scope note: Peça de tecido feita de duas cordas entrelaçadas, que adornam o elmo e o escudo.
in scheme: Tesauro SIPA
preferred label: Ferrule (Coat of arms stone) @en
preferred label: Virolle (Pierre d'armoiries) @fr
preferred label: Virola (Pietra d'armi) @it
broader: Rolete

Timbre
type: Concept
scope note: Peça ou figura colocada sobre o elmo ou sob a coroa de uma pedra de armas
in scheme: Tesauro SIPA
preferred label: Crest @en
preferred label: Cimier @fr
preferred label: Cimiero @it
broader: Paquife

Objetos funerários
type: Concept
in scheme: Tesauro SIPA
preferred label: Funerary objects @en
preferred label: Objets funéraires @fr
preferred label: Oggetti funerari @it
hidden label: Objectos funerários
broader: Objetos móveis integrados genéricos segundo a função
narrower: Catafalco
narrower: Cinerário
narrower: Cruz funerária
narrower: Estela funerária
narrower: Laje sepulcral
narrower: Ossário
narrower: Túmulo
related: Escultura funerária

Catafalco
type: Concept
scope note: Estrado alto para a exposição do esquife funerário, podendo estar sobre degraus
in scheme: Tesauro SIPA
preferred label: Catafalque @en
alternative label: Essa
broader: Objetos funerários

Cinerário
type: Concept
scope note: Objeto onde se colocam as cinzas de um defunto
in scheme: Tesauro SIPA
preferred label: Cinerary urn @en
preferred label: Urne cinéraire @fr
preferred label: Urna cineraria @it
broader: Objetos funerários

Cruz funerária
type: Concept
in scheme: Tesauro SIPA
preferred label: Funerary cross @en
preferred label: Croix funéraire @fr
preferred label: Croce funeraria @it
broader: Objetos funerários

Estela funerária
type: Concept
scope note: Pequeno monólito colocado sobre uma sepultura ou um cenotáfio, com inscrições ou decoração gravada ou esculpida. No caso de assumir a forma de uma coluna ou pilastra, é um cipo
in scheme: Tesauro SIPA
preferred label: Funerary stele @en
preferred label: Stèle funéraire @fr
preferred label: Stele funeraria @it
broader: Objetos funerários

Laje sepulcral
type: Concept
in scheme: Tesauro SIPA
preferred label: Burial slab @en
preferred label: Dalle funéraire @fr
preferred label: Lasta sepolcrale @it
broader: Objetos funerários
narrower: Lâmina funerária
narrower: Lápide (Laje sepulcral)

Lâmina funerária
type: Concept
in scheme: Tesauro SIPA
preferred label: Funerary plaque @en
preferred label: Plaque funéraire @fr
preferred label: Lamina funeraria @it
broader: Laje sepulcral

Lápide (Laje sepulcral)
type: Concept
scope note: Pedra que cobre o túmulo e constitui a parte superior de uma campa rasa, podendo ser removida e aceder à campa ou a um carneiro. Pode encontrar-se embutida numa parede e apresenta inscrições, como epitáfios e, por vezes, elementos heráldicos
in scheme: Tesauro SIPA
preferred label: Pierre tombale @fr
preferred label: Headstone (Burial slab) @en
preferred label: Lapide (Lastra sepolcrale) @it
broader: Laje sepulcral

Ossário
type: Concept
scope note: Objeto destinado a recolher os ossos retirados de uma sepultura
in scheme: Tesauro SIPA
preferred label: Ossario @it
preferred label: Ossuary @en
preferred label: Ossuaire @fr
broader: Objetos funerários

Túmulo
type: Concept
in scheme: Tesauro SIPA
preferred label: Tomba @it
preferred label: Tomb @en
preferred label: Tombe @fr
broader: Objetos funerários
narrower: Arca tumular
narrower: Tampa

Arca tumular
type: Concept
scope note: Elemento que compõe um túmulo, por norma paralelepipédico, onde se deposita o féretro
in scheme: Tesauro SIPA
preferred label: Tomb ark @en
preferred label: Coffre funéraire @fr
preferred label: Cassa di sepoltura @it
broader: Túmulo
narrower: Edícula (Túmulo)
narrower: Facial da cabeceira
narrower: Facial dos pés
narrower: Frontal (Túmulo)

Edícula (Túmulo)
type: Concept
in scheme: Tesauro SIPA
preferred label: Tomb shrine (tomb) @en
preferred label: Édicule (tombe) @fr
preferred label: Edicola (tomba) @it
broader: Arca tumular

Facial da cabeceira
type: Concept
scope note: Face da arca tumular que indica a zona da cabeça do tumulado
in scheme: Tesauro SIPA
preferred label: Head panel (tomb) @en
preferred label: Panneau de tête (tombe) @fr
preferred label: Facciata della testa (tomba) @it
broader: Arca tumular

Facial dos pés
type: Concept
scope note: Face da arca tumular que indica a zona dos pés do tumulado
in scheme: Tesauro SIPA
preferred label: Foot panel (tomb) @en
preferred label: Panneau des pieds (tombe) @fr
preferred label: Facciata dei piedi (tomba) @it
broader: Arca tumular

Frontal (Túmulo)
type: Concept
in scheme: Tesauro SIPA
preferred label: Frontal (of the tomb) @en
preferred label: Fronton (tombe) @fr
preferred label: Frontale (tomba) @it
broader: Arca tumular

Tampa
type: Concept
in scheme: Tesauro SIPA
preferred label: Cover @en
preferred label: Couvercle @fr
preferred label: Copertura @it
broader: Túmulo
narrower: Baldaquino funerário (Túmulo)
narrower: Jacente

Baldaquino funerário (Túmulo)
type: Concept
scope note: Elementos arquitetónico, decorado, colocado no topo da cabeça do tumulado
in scheme: Tesauro SIPA
preferred label: Funerary baldachin @en
preferred label: Baldaquin funéraire @fr
preferred label: Baldacchino funebre @it
broader: Tampa

Jacente
type: Concept
scope note: Representação do tumulado em vulto, representando-o morto deitado e com as suas melhores vestes. Encimam as tampas dos túmulos, ou são representados sobre um leito de aparato
in scheme: Tesauro SIPA
preferred label: Recumbent @en
preferred label: Couché (Recouvert) @fr
preferred label: Giacente @it
broader: Tampa

Objetos móveis segundo a forma de agregação
type: Concept
in scheme: Tesauro SIPA
preferred label: Objects according to aggregation form @en
preferred label: Objets selon la forme d'agrégation @fr
preferred label: Oggetti secondo la forma di aggregazione @it
hidden label: Objectos móveis segundo a forma de agregação
broader: Objetos móveis
narrower: Acervo
narrower: Coleção (Objetos)

Acervo
type: Concept
scope note: Conjunto ou coleção de bens, objetos, conhecimentos ou valores que pertencem a alguém ou a uma instituição, acumulados ao longo do tempo
in scheme: Tesauro SIPA
preferred label: Collection @en
preferred label: Colletta @it
broader: Objetos móveis segundo a forma de agregação
narrower: Acervo arqueológico
narrower: Acervo documental
narrower: Acervo museológico

Acervo arqueológico
type: Concept
scope note: Conjunto ou coleção de bens arqueológicos, resultantes de uma escavação num sítio arqueológico
in scheme: Tesauro SIPA
preferred label: Archaeological collection @en
preferred label: Collection archéologique @fr
preferred label: Collezione archeologica @it
broader: Acervo

Acervo documental
type: Concept
scope note: Conjunto ou coleção de documentos que pertencem a alguém ou a uma instituição, acumulados ao longo do tempo
in scheme: Tesauro SIPA
preferred label: Document archive/collection @en
preferred label: Collection documentaire @fr
preferred label: Collezione documentaria @it
broader: Acervo

Acervo museológico
type: Concept
scope note: Conjunto ou coleção de bens existentes num museu
in scheme: Tesauro SIPA
preferred label: Museum collection @en
preferred label: Collection muséologique @fr
preferred label: Collezione museale @it
broader: Acervo

Coleção (Objetos)
type: Concept
in scheme: Tesauro SIPA
preferred label: Collection (Objects) @en
preferred label: Collection (Objets) @fr
preferred label: Collezione (Oggetti) @it
hidden label: Coleçcão (Objectos)
broader: Objetos móveis segundo a forma de agregação

Objetos móveis segundo a função
type: Concept
in scheme: Tesauro SIPA
preferred label: Mobile objects according to function @en
preferred label: Objets mobiles selon la fonction @fr
preferred label: Oggetti mobili secondo la funzione @it
hidden label: Objectos móveis segundo a função
broader: Objetos móveis
narrower: Armamento
narrower: Objetos móveis de ablução
narrower: Objetos móveis de acesso
narrower: Objetos de armazenamento e transporte
narrower: Objetos de brincar
narrower: Objetos móveis genéricos de carga e transporte
narrower: Objetos de cozinha e de mesa
narrower: Objetos distintivos
narrower: c cac347fe
narrower: c 9e07818d
narrower: c 8c86b862
narrower: c 064430d6
narrower: c_50946332
narrower: c 673579fc

Armamento
type: Concept
scope note: Conjunto de armas e equipamento bélico para defesa militar ou pessoal
in scheme: Tesauro SIPA
preferred label: Weaponry @en
preferred label: Armement @fr
broader: Objetos móveis segundo a função
narrower: Arma branca
narrower: Arma de fogo

Arma branca
type: Concept
scope note: Objeto portátil, possuindo uma lâmina cortante ou perfurante. São consideradas armas brancas uma faca, canivete, punhal, adaga, espada, machado, etc.
in scheme: Tesauro SIPA
preferred label: Melee/ Cold weapon @en
preferred label: Arme blanche @fr
preferred label: Arma bianca @it
broader: Armamento

Arma de fogo
type: Concept
scope note: Objeto portátil ou fixo que usa a força expansiva dos gases produzidos pela queima de um propelente, normalmente pólvora, para lançar um projétil a alta velocidade através de um cano. São consideradas armas de fogo pistolas, revólveres, rifles, espingardas, etc.
in scheme: Tesauro SIPA
preferred label: Firearm @en
preferred label: Arme à feu @fr
preferred label: Arma da fuoco @it
broader: Armamento

Objetos móveis de ablução
type: Concept
in scheme: Tesauro SIPA
preferred label: Mobile ablution objects @en
preferred label: Objets mobiles pour les ablutions @fr
preferred label: Oggetti mobili per l'abluzione @it
hidden label: Objectos móveis de ablução
broader: Objetos móveis segundo a função
narrower: Aquamanil
narrower: Bacia de lava-pés

Aquamanil
type: Concept
scope note: Recipiente do tipo jarro, que armazena água para lavar as mãos, em metal ou cerâmica e apresentando decoração antropomórfica ou zoomórfica.
in scheme: Tesauro SIPA
preferred label: Aquamanile @fr
broader: Objetos móveis de ablução

Bacia de lava-pés
type: Concept
scope note: Bacia larga e profunda, utilizado pelo Papa, bispos e arcebispos nas cerimónias de lava-pés, que ocorre no dia de Quinta-feira Santa, sendo-lhe associado um jarro, que verte a água sobre os pés para dentro do recipiente. Este tipo de cerimónia é realizado, na mesma data, pelos irmãos das Misericórdias.
in scheme: Tesauro SIPA
preferred label: Foot wash basin @en
preferred label: Bassin pour le lavement des pieds @fr
preferred label: Bacile per la lavanda dei piedi @it
broader: Objetos móveis de ablução

Objetos móveis de acesso
type: Concept
in scheme: Tesauro SIPA
preferred label: Mobile access objects @en
preferred label: Objets mobiles d'accès @fr
preferred label: Oggetti mobili di accesso @it
hidden label: Objectos móveis de acesso
broader: Objetos móveis segundo a função
narrower: Bailéu (Equipamentos de acesso)
narrower: Escada de mão
narrower: Escadote

Bailéu (Equipamentos de acesso)
type: Concept
in scheme: Tesauro SIPA
preferred label: Scaffolding (Access equipments) @en
broader: Objetos móveis de acesso

Escada de mão
type: Concept
in scheme: Tesauro SIPA
preferred label: Handhold ladder @en
preferred label: Échelle @fr
preferred label: Scala @it
broader: Objetos móveis de acesso

Escadote
type: Concept
in scheme: Tesauro SIPA
preferred label: Ladder @en
preferred label: Escabeau @fr
preferred label: Scala a libretto @it
broader: Objetos móveis de acesso

Objetos de armazenamento e transporte
type: Concept
in scheme: Tesauro SIPA
preferred label: Outils agricoles @fr
preferred label: Agricultural equipment @en
preferred label: Attrezzi agricoli @it
hidden label: Objectos de armazenamento e transporte
broader: Objetos móveis segundo a função
narrower: Ânfora
narrower: Bilha
narrower: Caixa
narrower: Pote
narrower: Talha

Ânfora
type: Concept
scope note: Vaso cerâmico, decorado ou não, composto por corpo bojudo, mais estreito na base, com duas asas, para armazenamento de líquidos, como o vinho ou o azeite
in scheme: Tesauro SIPA
preferred label: Amphora @en
preferred label: Amphore @fr
preferred label: Anfora @it
broader: Objetos de armazenamento e transporte

Bilha
type: Concept
in scheme: Tesauro SIPA
preferred label: Clay jug (Churn) @en
preferred label: Cruche @fr
preferred label: Orciolo @it
broader: Objetos de armazenamento e transporte

Caixa
type: Concept
in scheme: Tesauro SIPA
preferred label: Box @en
preferred label: Boîte @fr
preferred label: Scatola @it
broader: Objetos de armazenamento e transporte

Pote
type: Concept
in scheme: Tesauro SIPA
preferred label: Pot @en
preferred label: Vaso @it
broader: Objetos de armazenamento e transporte

Talha
type: Concept
in scheme: Tesauro SIPA
preferred label: Cruche @fr
preferred label: Jug @en
broader: Objetos de armazenamento e transporte

Objetos de brincar
type: Concept
in scheme: Tesauro SIPA
preferred label: Toy objects @en
preferred label: Objets jouets @fr
preferred label: Oggetti giocattolo @it
hidden label: Objectos de brincar
broader: Objetos móveis segundo a função
narrower: Boneco

Boneco
type: Concept
in scheme: Tesauro SIPA
preferred label: Puppet @en
preferred label: Poupée; Petit bonhomme @fr
preferred label: Pupazzo @it
broader: Objetos de brincar
narrower: Boneca de papel

Boneca de papel
type: Concept
scope note: Brinquedo infantil composto por figuras humanas de papel que são recortadas, com roupas e acessórios cortados separadamente, permitindo várias combinações de adereços
in scheme: Tesauro SIPA
preferred label: Paper dolls @en
preferred label: Poupée en papier @fr
preferred label: Bambola di carta @it
broader: Boneco

Objetos móveis genéricos de carga e transporte
type: Concept
in scheme: Tesauro SIPA
preferred label: Loading and transport equipments @en
preferred label: Équipement de chargement et de transport @fr
preferred label: Attrezzature di carico e trasporto @it
hidden label: Objetcos móveis genéricos de carga e transporte
broader: Objetos móveis segundo a função
narrower: Balde
narrower: Carretão
narrower: Carro de mão
narrower: Coucho
narrower: Cubo
narrower: Padiola
narrower: Polé

Balde
type: Concept
in scheme: Tesauro SIPA
preferred label: Bucket @en
preferred label: Seau @fr
preferred label: Benna @it
broader: Objetos móveis genéricos de carga e transporte

Carretão
type: Concept
in scheme: Tesauro SIPA
preferred label: Charriot @en
broader: Objetos móveis genéricos de carga e transporte

Carro de mão
type: Concept
in scheme: Tesauro SIPA
preferred label: Brouette @fr
preferred label: Carriola @it
preferred label: Handcarts; Wheelbarrow @en
broader: Objetos móveis genéricos de carga e transporte

Coucho
type: Concept
in scheme: Tesauro SIPA
preferred label: Cork container @en
broader: Objetos móveis genéricos de carga e transporte

Cubo
type: Concept
in scheme: Tesauro SIPA
preferred label: Pail (Loading and transport equipments) @en
preferred label: Seau (Équipement de chargement et de transport) @fr
preferred label: Secchio (Attrezzature di carico e trasporto) @it
broader: Objetos móveis genéricos de carga e transporte

Padiola
type: Concept
in scheme: Tesauro SIPA
preferred label: Brancard @fr
preferred label: Barella @it
preferred label: Strecher; Handbarrow @en
broader: Objetos móveis genéricos de carga e transporte

Polé
type: Concept
in scheme: Tesauro SIPA
preferred label: Pulley @en
broader: Objetos móveis genéricos de carga e transporte

Objetos de cozinha e de mesa
type: Concept
in scheme: Tesauro SIPA
preferred label: Kitchen and table tools @en
preferred label: Ustensiles de cuisine et de table @fr
preferred label: Utensili da cucina e da tavola @it
hidden label: Objectos de cozinha e de mesa
broader: Objetos móveis segundo a função
narrower: Açucareiro
narrower: Baixela
narrower: Bandeja
narrower: Bule
narrower: Cafeteira
narrower: Copo
narrower: Faqueiro
narrower: Galheteiro
narrower: Jarro
narrower: Panela
narrower: Prato
narrower: Púcaro
narrower: Saleiro
narrower: Taça
narrower: Tacho
narrower: Terrina
narrower: Tigela

Açucareiro
type: Concept
in scheme: Tesauro SIPA
preferred label: Sugar bowl @en
preferred label: Sucrier @fr
preferred label: Zuccheriera @it
broader: Objetos de cozinha e de mesa

Baixela
type: Concept
in scheme: Tesauro SIPA
preferred label: Tableware @en
preferred label: Vaisselle @fr
preferred label: Stoviglie @it
broader: Objetos de cozinha e de mesa

Bandeja
type: Concept
in scheme: Tesauro SIPA
preferred label: Plateau @fr
preferred label: Tray @en
preferred label: Vassoio @it
broader: Objetos de cozinha e de mesa

Bule
type: Concept
in scheme: Tesauro SIPA
preferred label: Teapot @en
preferred label: Théière @fr
preferred label: Teiera @it
broader: Objetos de cozinha e de mesa

Cafeteira
type: Concept
in scheme: Tesauro SIPA
preferred label: Coffee maker @en
preferred label: Cafetière @fr
preferred label: Caffettiera @it
broader: Objetos de cozinha e de mesa

Copo
type: Concept
in scheme: Tesauro SIPA
preferred label: Glass @en
preferred label: Verre @fr
preferred label: Bicchiere @it
broader: Objetos de cozinha e de mesa

Faqueiro
type: Concept
in scheme: Tesauro SIPA
preferred label: Cutlery set @en
preferred label: Batterie de cuisine @fr
preferred label: Posate @it
broader: Objetos de cozinha e de mesa

Galheteiro
type: Concept
in scheme: Tesauro SIPA
preferred label: Cruet set @en
preferred label: Salière et vinaigrier @fr
preferred label: Set di condimenti @it
broader: Objetos de cozinha e de mesa

Jarro
type: Concept
in scheme: Tesauro SIPA
preferred label: Anfora @it
preferred label: Jug @en
preferred label: Jarre @fr
broader: Objetos de cozinha e de mesa

Panela
type: Concept
in scheme: Tesauro SIPA
preferred label: Pan @en
preferred label: Casserole @fr
preferred label: Pentola @it
broader: Objetos de cozinha e de mesa

Prato
type: Concept
in scheme: Tesauro SIPA
preferred label: Plate @en
preferred label: Assiette @fr
preferred label: Piatto @it
broader: Objetos de cozinha e de mesa

Púcaro
type: Concept
in scheme: Tesauro SIPA
preferred label: Pitcher @en
broader: Objetos de cozinha e de mesa

Saleiro
type: Concept
in scheme: Tesauro SIPA
preferred label: Salt shaker @en
preferred label: Salière @fr
preferred label: Saliera @it
broader: Objetos de cozinha e de mesa

Taça
type: Concept
in scheme: Tesauro SIPA
preferred label: Coupe @fr
preferred label: Goblet @en
preferred label: Coppa @it
broader: Objetos de cozinha e de mesa

Tacho
type: Concept
in scheme: Tesauro SIPA
preferred label: Pot @en
preferred label: Marmite @fr
preferred label: Pentola grande @it
broader: Objetos de cozinha e de mesa

Terrina
type: Concept
in scheme: Tesauro SIPA
preferred label: Terrine @en
broader: Objetos de cozinha e de mesa

Tigela
type: Concept
in scheme: Tesauro SIPA
preferred label: Bowl @en
preferred label: Bol @fr
preferred label: Ciotola @it
broader: Objetos de cozinha e de mesa

Objetos distintivos
type: Concept
in scheme: Tesauro SIPA
preferred label: Distinctive objects @en
preferred label: Objets distinctifs @fr
preferred label: Oggetti distintivi @it
hidden label: Objectos distintivos
broader: Objetos móveis segundo a função
narrower: Bandeira (Objetos distintivos)
narrower: Coroa (Objetos distintivos)
narrower: Coronel

Bandeira (Objetos distintivos)
type: Concept
scope note: Pano geralmente de forma retangular, de uma ou mais cores, por vezes com emblemas e legendas, preso a uma haste, que serve de distintivo e de símbolo de uma nação, corporação, partido, regimento, etc.
in scheme: Tesauro SIPA
preferred label: Flag (Distinctive objects) @en
preferred label: Drapeau (Objets distinctifs) @fr
preferred label: Bandiera (Oggetti distintivi) @it
broader: Objetos distintivos
narrower: Bandeira institucional
narrower: Bandeira militar
narrower: Bandeira nacional

Bandeira institucional
type: Concept
scope note: Pano que serve como insígnia de uma entidade
in scheme: Tesauro SIPA
preferred label: Institutional flag @en
preferred label: Drapeau institutionnel @fr
preferred label: Bandiera istituzionale @it
broader: Bandeira (Objetos distintivos)

Bandeira militar
type: Concept
scope note: Pano que serve como insígnia de uma unidade militar
in scheme: Tesauro SIPA
preferred label: Military Flag @en
preferred label: Drapeau militaire @fr
preferred label: Bandiera militare @it
broader: Bandeira (Objetos distintivos)

Bandeira nacional
type: Concept
scope note: Pano que serve de distintivo e de símbolo de uma nação
in scheme: Tesauro SIPA
preferred label: National flag @en
preferred label: Drapeau national @fr
preferred label: Bandiera nazionale @it
broader: Bandeira (Objetos distintivos)

Coroa (Objetos distintivos)
type: Concept
scope note: Motivo que adorna a cabeça, sendo símbolo de dignidade, já utilizado, com esse fim, no Oriente Antigo, surgindo, na Idade Média, como símbolo da soberania temporal, podendo adotar várias formas.
in scheme: Tesauro SIPA
preferred label: Crown (Distinctive objects) @en
preferred label: Couronne (Objets distinctifs) @fr
preferred label: Corona (Oggetti distintivi) @it
broader: Objetos distintivos
narrower: Coroa condal
narrower: Coroa de marquesado
narrower: Coroa de principado
narrower: Coroa ducal
narrower: Coroa imperial
narrower: Coroa real

Coroa condal
type: Concept
in scheme: Tesauro SIPA
preferred label: Count’s coronet @en
preferred label: Couronne comtale @fr
preferred label: Corona comitale @it
broader: Coroa (Objetos distintivos)

Coroa de marquesado
type: Concept
in scheme: Tesauro SIPA
preferred label: Marquess’s coronet @en
preferred label: Couronne marquisale @fr
preferred label: Corona marchesale @it
broader: Coroa (Objetos distintivos)

Coroa de principado
type: Concept
in scheme: Tesauro SIPA
preferred label: Prince’s coronet @en
preferred label: Couronne princière @fr
preferred label: Corona principesca @it
broader: Coroa (Objetos distintivos)

Coroa ducal
type: Concept
in scheme: Tesauro SIPA
preferred label: Ducal coronet @en
preferred label: Couronne ducale @fr
preferred label: Corona ducale @it
broader: Coroa (Objetos distintivos)

Coroa imperial
type: Concept
in scheme: Tesauro SIPA
preferred label: Imperial crown @en
preferred label: Couronne impériale @fr
preferred label: Corona imperiale @it
broader: Coroa (Objetos distintivos)

Coroa real
type: Concept
scope note: Coroa aberta ou fechada, apanágio dos soberanos de um estado monárquico ou principado
in scheme: Tesauro SIPA
preferred label: Royal crown @en
preferred label: Couronne royale @fr
preferred label: Corona reale @it
broader: Coroa (Objetos distintivos)

Coronel
type: Concept
in scheme: Tesauro SIPA
preferred label: Torse; Wreath @en
preferred label: Bourrelet; Cimier @fr
preferred label: Cercine; Torciere @it
broader: Objetos distintivos
narrower: Coronel de nobreza
narrower: c d598cbbc

Coronel de nobreza
type: Concept
in scheme: Tesauro SIPA
preferred label: Nobiliary torse; Nobiliary wreath @en
preferred label: Bourrelet nobiliaire @fr
preferred label: Cercine nobiliare @it
broader: Coronel
narrower: Barão
narrower: Visconde

Barão
type: Concept
in scheme: Tesauro SIPA
preferred label: Baron @en
preferred label: Barone @it
broader: Coronel de nobreza

Visconde
type: Concept
in scheme: Tesauro SIPA
preferred label: Viscount @en
preferred label: Vicomte @fr
preferred label: Visconte @it
broader: Coronel de nobreza