Lexvo - ISO 639-3 language codes
type: Ontology
type: ConceptScheme
label: Lexvo - códigos de língua ISO 639-3 @pt

Ghotuo
type: Language
type: Concept
ISO 639-3 code: aaa
alternative label: Ghotuo language
definition: Ghotuo (also Otwa, Otuo) is an Edoid language spoken in Edo State, mostly in the Owan and Akoko-Edo areas of Edo state, Nigeria.
in scheme: Lexvo - ISO 639-3 language codes
notation: aaa

Language
type: Class
label: Língua @pt
subclass of: Thing

ISO 639-3 code
type: Property
label: Código ISO 639-3 @pt

Wanggom
type: Language
type: Concept
ISO 639-3 code: wng
in scheme: Lexvo - ISO 639-3 language codes
notation: wng

Alumu-Tesu
type: Language
type: Concept
ISO 639-3 code: aab
alternative label: Alumu language
definition: Alumu (Alumu–Akpondu, Alumu–Tesu) is a Niger–Congo language spoken by approximately 7000 people in Nassarawa State, Nigeria. It has lost the nominal affix system characteristic of the Niger–Congo family.
in scheme: Lexvo - ISO 639-3 language codes
notation: aab

Ari
type: Language
type: Concept
ISO 639-3 code: aac
alternative label: Ari language
definition: The Ari language is a Papuan language of the Trans–New Guinea family. As of the 2000 census there were only 50 Ari speakers, living in two villages.
in scheme: Lexvo - ISO 639-3 language codes
notation: aac

Amal
type: Language
type: Concept
ISO 639-3 code: aad
alternative label: Amal language
definition: Amal is a language of Papua New Guinea.
in scheme: Lexvo - ISO 639-3 language codes
notation: aad
preferred label: Idioma amal @es

Arbëresh language
type: Language
type: Concept
ISO 639-3 code: aae
alternative label: Albanian, Arbëreshë
alternative label: Arbëreshë Albanian
definition: Arbëreshë, also known as Arbërisht, is an ethnolect spoken by the Arbëreshë, the group of Albanian-speaking minorities in Italy.
in scheme: Lexvo - ISO 639-3 language codes
notation: aae
preferred label: Arbërisht @fr
preferred label: Dialecto arbëreshë @es
preferred label: Lingua arbëreshë @it

Zan Gula
type: Language
type: Concept
ISO 639-3 code: zna
in scheme: Lexvo - ISO 639-3 language codes
notation: zna

Aranadan
type: Language
type: Concept
ISO 639-3 code: aaf
alternative label: Aranadan language
definition: Aranadan is a Dravidian language spoken by approximately 200 people, predominantly in the Malappuram District of Kerala state, India. It is similar to Malayalam and Tamil, and also contains elements of the Kannada language. It is also known as Aranatan and Eranadans.
in scheme: Lexvo - ISO 639-3 language codes
notation: aaf

Ndzwani Comorian
type: Language
type: Concept
ISO 639-3 code: wni
alternative label: Comorian, Ndzwani
in scheme: Lexvo - ISO 639-3 language codes
notation: wni

Ambrak
type: Language
type: Concept
ISO 639-3 code: aag
alternative label: Ambrak language
definition: Ambrak is a Torricelli language spoken in the Nuku District of the Sandaun Province in Papua New Guinea. According to the 2000 census, there are approximately 290 speakers.
in scheme: Lexvo - ISO 639-3 language codes
notation: aag

Abu' Arapesh
type: Language
type: Concept
ISO 639-3 code: aah
alternative label: Arapesh, Abu'
in scheme: Lexvo - ISO 639-3 language codes
notation: aah

Arifama-Miniafia
type: Language
type: Concept
ISO 639-3 code: aai
in scheme: Lexvo - ISO 639-3 language codes
notation: aai

Ankave
type: Language
type: Concept
ISO 639-3 code: aak
alternative label: Ankave language
definition: Ankave or Angave is a Papuan language spoken by the approximately 1,600 Angave people in Kereme District, Gulf Province, Papua New Guinea.
in scheme: Lexvo - ISO 639-3 language codes
notation: aak

Afade
type: Language
type: Concept
ISO 639-3 code: aal
alternative label: Afade language
definition: Afade is an Afro-Asiatic language spoken in eastern Nigeria and northwestern Cameroon.
in scheme: Lexvo - ISO 639-3 language codes
notation: aal

Aramanik
type: Language
type: Concept
ISO 639-3 code: aam
alternative label: Aramanik language
definition: Aramanik (Laramanik) is a Nilo-Saharan language spoken in the Arusha Region of Tanzania by 3,000 people. It is the primary language of the hunter-gatherer Aramanik, who have limited comprehension of other languages. The Aramanik are also called derogatory Dorobo (Ndorobo).
in scheme: Lexvo - ISO 639-3 language codes
notation: aam

Anambé
type: Language
type: Concept
ISO 639-3 code: aan
alternative label: Anambé language
definition: Anambé is a possibly extinct Tupi language spoken in Pará, on the Cairari River in Brazil. It is being supplanted by Portuguese and is considered an endangered language.
in scheme: Lexvo - ISO 639-3 language codes
notation: aan

Saharan Arabic
type: Language
type: Concept
ISO 639-3 code: aao
alternative label: Algerian Saharan Arabic
alternative label: Arabic, Algerian Saharan
definition: Algerian Saharan Arabic (also known as Saharan Arabic, Tamanrasset Arabic, Tamanghasset Arabic) is a structurally distinct variety of Arabic spoken by an estimated 100,000 people in Algeria, predominantly along the Moroccan border with the Atlas mountains range. It is also spoken by about 10,000 people in neighbouring Niger.
in scheme: Lexvo - ISO 639-3 language codes
notation: aao
preferred label: Arabe saharien @fr
preferred label: Árabe sahariano @es

Wanukaka
type: Language
type: Concept
ISO 639-3 code: wnk
alternative label: Wanukaka language
definition: The Wanukaka language is an Bima–Sumba language spoken in Indonesia. It has about 10 000 native speakers mainly on the island of Sumba. The language has two main dialects.
in scheme: Lexvo - ISO 639-3 language codes
notation: wnk

Pará Arára
type: Language
type: Concept
ISO 639-3 code: aap
alternative label: Arára, Pará
in scheme: Lexvo - ISO 639-3 language codes
notation: aap

Eastern Abnaki
type: Language
type: Concept
ISO 639-3 code: aaq
alternative label: Abnaki, Eastern
alternative label: Eastern Abnaki language
definition: Eastern Abnaki is an extinct language once spoken by the Penobscot in the coastal area of the state of Maine, United States. The last known speaker died in the 1990s in Penobscot, Maine.
in scheme: Lexvo - ISO 639-3 language codes
notation: aaq

Afar
type: Language
type: Concept
ISO 639-1 code: aa
ISO 639-2 Bibliographical code: aar
ISO 639-2 Terminological code: aar
ISO 639-3 code: aar
alternative label: Afar language
alternative label: Idioma afar @es
alternative label: Lingua afar @it
alternative label: Língua afar @pt
preferred label: afar @es
definition: Afar is a Lowland East Cushitic language spoken in Ethiopia, Eritrea and Djibouti. It is believed to have 1.5 million speakers, the Afar. The basic word order in Afar, like in other East Cushitic languages, is subject–object–verb. Its speakers have a literacy rate of between one and three per cent. Its closest relative is the Saho language.
in scheme: Lexvo - ISO 639-3 language codes
notation: aar

ISO 639-1 code
type: Property
label: Código ISO 639-1 @pt

ISO 639-2 Bibliographical code
type: Property
label: Código bibliográfico ISO 639-2 @pt

ISO 639-2 Terminological code
type: Property
label: Código terminológico ISO 639-2 @pt

Aasáx
type: Language
type: Concept
ISO 639-3 code: aas
alternative label: Asa language
definition: The Asa language, Aasáx (also Asax, Asá, Aasá, Assa, Asak) was apparently a Cushitic language spoken by the Assa people in Tanzania. The language is extinct; ethnic Assa in northern Tanzania remember only a few words they overheard their elders use. Little is known of the language, and it is not clear it was entirely Cushitic, or if it retained a non-Cushitic layer from language shift. Perhaps most closely related to Kw'adza.
in scheme: Lexvo - ISO 639-3 language codes
notation: aas
preferred label: Aasax @es

Arvanitika
type: Language
type: Concept
ISO 639-3 code: aat
alternative label: Albanian, Arvanitika
alternative label: Arvanitika Albanian
definition: Arvanitika also known Arvanitic (Arvanitika: αρbε̰ρίσ̈τ arbërisht, Greek: αρβανίτικα arvanitika) is the variety of Albanian traditionally spoken by the Arvanites, a population group in Greece. Arvanitika is today an endangered language, as its speakers have been shifting to the use of Greek and most younger members of the community no longer speak it.
in scheme: Lexvo - ISO 639-3 language codes
notation: aat
preferred label: Arvanitico @it
preferred label: Língua arvanitica @pt

Abau
type: Language
type: Concept
ISO 639-3 code: aau
alternative label: Abau language
definition: Abau is a Papuan language spoken in the Sandaun Province of Papua New Guinea, primarily along the shores of the Sepik River.
in scheme: Lexvo - ISO 639-3 language codes
notation: aau

Solong
type: Language
type: Concept
ISO 639-3 code: aaw
in scheme: Lexvo - ISO 639-3 language codes
notation: aaw

Mandobo Atas
type: Language
type: Concept
ISO 639-3 code: aax
in scheme: Lexvo - ISO 639-3 language codes
notation: aax

Amarasi
type: Language
type: Concept
ISO 639-3 code: aaz
in scheme: Lexvo - ISO 639-3 language codes
notation: aaz

Abé
type: Language
type: Concept
ISO 639-3 code: aba
alternative label: Abé language
definition: Abé (also spelled Abbé, Abbey, Abi) is a language of uncertain classification within the Kwa branch of the Niger–Congo family. It is spoken in Côte d'Ivoire.
in scheme: Lexvo - ISO 639-3 language codes
notation: aba

Zaza
type: Language
type: Concept
ISO 639-2 Bibliographical code: zza
ISO 639-2 Terminological code: zza
ISO 639-3 code: zza
alternative label: Dimili
alternative label: Dimli
alternative label: Dimli (macrolanguage)
alternative label: Kirdki
alternative label: Kirmanjki
alternative label: Kirmanjki (macrolanguage)
alternative label: Zazaki
preferred label: zazaki @es
in scheme: Lexvo - ISO 639-3 language codes
notation: zza
preferred label: zaza @fr

Bankon
type: Language
type: Concept
ISO 639-3 code: abb
alternative label: Bankon language
definition: Bankon (Abo, Abaw, Bo, Bon) is a Bantu language spoken in the Moungo department of the Littoral Province of southwestern Cameroon. It has a lexical similarity of 86% with Rombi which is spoken in the nearby Meme department of Southwest Province.
in scheme: Lexvo - ISO 639-3 language codes
notation: abb

Wanggamala
type: Language
type: Concept
ISO 639-3 code: wnm
in scheme: Lexvo - ISO 639-3 language codes
notation: wnm

Ambala Ayta
type: Language
type: Concept
ISO 639-3 code: abc
alternative label: Ambala language
alternative label: Ayta, Ambala
definition: Ambala is a Sambalic language spoken in the Philippines. It has more than 2,000 speakers (Ramos 2004) and is spoken within Aeta communities in the Zambal municipalities of Subic, San Marcelino, and Castillejos; in the city of Olongapo; and in Dinalupihan, Bataan.
in scheme: Lexvo - ISO 639-3 language codes
notation: abc

Manide
type: Language
type: Concept
ISO 639-3 code: abd
in scheme: Lexvo - ISO 639-3 language codes
notation: abd

Western Abnaki
type: Language
type: Concept
ISO 639-3 code: abe
alternative label: Abnaki, Western
alternative label: Western Abnaki language
definition: Western Abnaki (also known as Abenaki or St. Francis Abenaki) is one of the World's most endangered languages. In 1991 it was spoken by 20 individuals along the St. Lawrence River between Montreal and Quebec City, who lived mostly at Odanak, the site of the former mission village of St. Francis and about 50 individuals living throughout New York state and Connecticut. It is now considered nearly extinct. However, a new generation of speakers are actively preserving and revitalizing the language. Fluent speakers Joseph Elie Joubert from the Odanak reservation and fluent speaker Jesse Bowman Bruchac lead partial immersion classes in the language across the northeast. They have also created several new books in and about the language as well as audio, video and web-based media to help others learn the language.
in scheme: Lexvo - ISO 639-3 language codes
notation: abe
preferred label: Westliche Abenaki @de

Abai Sungai
type: Language
type: Concept
ISO 639-3 code: abf
in scheme: Lexvo - ISO 639-3 language codes
notation: abf

Abaga
type: Language
type: Concept
ISO 639-3 code: abg
alternative label: Abaga language
definition: Abaga is a nearly extinct Kalam language of Papua New Guinea. It had once been classified as Finisterre.
in scheme: Lexvo - ISO 639-3 language codes
notation: abg

Tajiki Arabic
type: Language
type: Concept
ISO 639-3 code: abh
alternative label: Arabic, Tajiki
definition: Tajiki Arabic (also known as Jugari, Bukhara Arabic, Buxara Arabic, Tajiji Arabic, Balkh Arabic) is a variety of Arabic spoken by a few thousand people in Afghanistan and Tajikistan. Language use is declining. There is no diglossia with Standard Arabic. It is a variety of Central Asian Arabic.
in scheme: Lexvo - ISO 639-3 language codes
notation: abh

Zande
type: Language
type: Concept
ISO 639-3 code: zne
alternative label: Zande (individual language)
alternative label: Zande language
definition: Zande is an Ubangian language spoken by the Azande, primarily in the northeast of the Democratic Republic of the Congo and western South Sudan, but also in the eastern part of the Central African Republic.
in scheme: Lexvo - ISO 639-3 language codes
notation: zne
preferred label: Azande @de
preferred label: Língua zande @pt
preferred label: Zandé @fr

Abidji
type: Language
type: Concept
ISO 639-3 code: abi
alternative label: Abidji language
definition: Abidji (Abiji) is a language of uncertain classification within the Kwa branch of the Niger–Congo family. It is spoken in Ivory Coast.
in scheme: Lexvo - ISO 639-3 language codes
notation: abi
preferred label: Abidschi @de
preferred label: Lingua abidji @it

Wunumara
type: Language
type: Concept
in scheme: Lexvo - ISO 639-3 language codes

Aka-Bea
type: Language
type: Concept
ISO 639-3 code: abj
alternative label: Aka-Bea language
definition: The Bea language, Aka-Bea, is an extinct Great Andamanese language of the Southern group. It was spoken around the western Andaman Strait and around the northern and western coast of South Andaman.
in scheme: Lexvo - ISO 639-3 language codes
notation: abj
preferred label: Idioma bea @es

Abkhazian
type: Language
type: Concept
ISO 639-1 code: ab
ISO 639-2 Bibliographical code: abk
ISO 639-2 Terminological code: abk
ISO 639-3 code: abk
alternative label: Abchasische Sprache @de
alternative label: Abkhaz language
alternative label: Abkhaze @fr
alternative label: Idioma abjasio @es
alternative label: Lingua abcasa @it
alternative label: Língua abecásia @pt
definition: Abkhaz (Аҧсуа бызшәа) is a Northwest Caucasian language spoken mainly by the Abkhaz people. It is the official language of Abkhazia where around 100,000 people speak it. Furthermore, it is spoken by thousands of members of the Abkhazian diaspora in Turkey, Georgia's autonomous republic of Adjara, Syria, Jordan and several Western countries. Russia has 9447 Abkhaz speakers, according to the 2002 census.
in scheme: Lexvo - ISO 639-3 language codes
notation: abk
preferred label: Abchasisch @de
preferred label: abcázio @pt
preferred label: abjasio @es
preferred label: abkhaze @fr
preferred label: abkhazian @it

Lampung Nyo
type: Language
type: Concept
ISO 639-3 code: abl
in scheme: Lexvo - ISO 639-3 language codes
notation: abl

Abanyom
type: Language
type: Concept
ISO 639-3 code: abm
alternative label: Abanyom language
definition: Abanyom is a language of the Ekoid subfamily of Niger–Congo. It is spoken by the Abanyom people in the Cross River State region of Nigeria, numbering about 12,500 people in 1986. A member of the Southern Bantoid group, Abanyom is fairly closely related to the Bantu languages. It is tonal and has a typical Niger–Congo noun class system.
in scheme: Lexvo - ISO 639-3 language codes
notation: abm

Abua
type: Language
type: Concept
ISO 639-3 code: abn
alternative label: Abua language
definition: Abua (Abuan) is a Central Delta language of Nigeria.
in scheme: Lexvo - ISO 639-3 language codes
notation: abn
preferred label: Lingua abua @it

Wano
type: Language
type: Concept
ISO 639-3 code: wno
in scheme: Lexvo - ISO 639-3 language codes
notation: wno

Abon
type: Language
type: Concept
ISO 639-3 code: abo
in scheme: Lexvo - ISO 639-3 language codes
notation: abo

Abellen Ayta
type: Language
type: Concept
ISO 639-3 code: abp
alternative label: Abellen language
alternative label: Ayta, Abellen
definition: Abellen, Abenlen, or Aburlin is a Sambalic language. It has about 3,500 speakers (Stone 2005) and is spoken within an Aeta community in the province of Tarlac in the Philippines.
in scheme: Lexvo - ISO 639-3 language codes
notation: abp

Abaza
type: Language
type: Concept
ISO 639-3 code: abq
alternative label: Abaza language
definition: The Abaza language (Абаза Бызшва, Abaza Byzšwa) is a language of the Caucasus mountains in the Russian Karachay–Cherkess Republic by the Abazins. It consists of two dialects, the Ashkherewa dialect and the Tapanta dialect, which is the literary standard.
in scheme: Lexvo - ISO 639-3 language codes
notation: abq
preferred label: Abasinische Sprache @de
preferred label: Idioma abaza @es
preferred label: Lingua abazina @it
preferred label: Língua abaza @pt

Abron
type: Language
type: Concept
ISO 639-3 code: abr
alternative label: Abron dialect
definition: Abron or Bono is the language of the Abron people and a major dialect of the Akan language of southern Ghana. It is spoken by 1,050,000 in southwestern Ghana (2003), as well as 131,700 in eastern Côte d'Ivoire in the departments of Tanda and Bondoukou. Alternative or former names include Brong, Bron, Doma, and Gyaman.
in scheme: Lexvo - ISO 639-3 language codes
notation: abr
preferred label: Língua abron @pt

Ambonese Malay
type: Language
type: Concept
ISO 639-3 code: abs
alternative label: Malay, Ambonese
in scheme: Lexvo - ISO 639-3 language codes
notation: abs

Ambulas
type: Language
type: Concept
ISO 639-3 code: abt
alternative label: Abelam language
definition: Abelam is the most populous of the Ndu languages of Sepik River region of northern Papua New Guinea.
in scheme: Lexvo - ISO 639-3 language codes
notation: abt

Abouré
type: Language
type: Concept
ISO 639-3 code: abu
alternative label: Abure language
definition: Abure (Aboulé), also known as Abonwa or Akaplass, is a Tano language (Kwa, Niger–Congo) spoken near Abidjan in Ivory Coast.
in scheme: Lexvo - ISO 639-3 language codes
notation: abu
preferred label: Abure

Wanap
type: Language
type: Concept
ISO 639-3 code: wnp
alternative label: Wanap language
definition: Wanap or Kayik is a Torricelli language of Papua New Guinea.
in scheme: Lexvo - ISO 639-3 language codes
notation: wnp

Bahrani Arabic
type: Language
type: Concept
ISO 639-3 code: abv
alternative label: Arabic, Baharna
alternative label: Baharna Arabic
definition: Baharna Arabic also known as Bahrani and Bahrani Arabic) is a variety of Arabic spoken by the Bahranis of Bahrain and some parts of Saudi Eastern Province, and also in Oman.
in scheme: Lexvo - ISO 639-3 language codes
notation: abv

Pal
type: Language
type: Concept
ISO 639-3 code: abw
alternative label: Pal language
definition: Pal is a Papuan language of Madang Province, Papua New Guinea.
in scheme: Lexvo - ISO 639-3 language codes
notation: abw

Inabaknon
type: Language
type: Concept
ISO 639-3 code: abx
alternative label: Abaknon language
definition: The Inabaknon language, also known as the Abaknon language or the Capul language (according to the Summer Institute of Linguistics' Ethnologue, alternative names for this language include: Abaknon, Abaknon Sama, Capul, Capuleño, Kapul, Sama) is a language primarily spoken in the island-municipality of Capul, Northern Samar in the Eastern Visayas region of the Visayas area in the country of the Philippines.
in scheme: Lexvo - ISO 639-3 language codes
notation: abx
preferred label: Abaknon @fr

Aneme Wake
type: Language
type: Concept
ISO 639-3 code: aby
in scheme: Lexvo - ISO 639-3 language codes
notation: aby

Abui
type: Language
type: Concept
ISO 639-3 code: abz
alternative label: Abui language
definition: Abui is a language of the Alor Archipelago. It belongs to the Trans–New Guinea family spoken approximately by 16,000 speakers in the central part of the Alor Island in Eastern Indonesia, East Nusa Tenggara province. The native name is Abui tanga which literally translates as mountain language.
in scheme: Lexvo - ISO 639-3 language codes
notation: abz

Achagua
type: Language
type: Concept
ISO 639-3 code: aca
alternative label: Achawa language
definition: Achagua (Achawa) is a language spoken in the Meta Department of Colombia, similar to Piapoco. It is estimated that 400 individuals speak the language, most or all of whom are trilingual in Piapoco and Spanish.
in scheme: Lexvo - ISO 639-3 language codes
notation: aca

Áncá
type: Language
type: Concept
ISO 639-3 code: acb
in scheme: Lexvo - ISO 639-3 language codes
notation: acb

Gikyode
type: Language
type: Concept
ISO 639-3 code: acd
in scheme: Lexvo - ISO 639-3 language codes
notation: acd

Achinese
type: Language
type: Concept
ISO 639-2 Bibliographical code: ace
ISO 639-2 Terminological code: ace
ISO 639-3 code: ace
alternative label: Aceh @fr
alternative label: Acehnese language
alternative label: Achinesische Sprache @de
alternative label: Idioma achenés @es
alternative label: Lingua aceh @it
alternative label: Língua achém @pt
definition: Acehnese (also Achinese, Achehnese) or Aceh (formerly Atjeh) is a Malayo-Polynesian language spoken by Acehnese people natively in Aceh, Sumatra, Indonesia. This language also spoken in some parts in Malaysia by Acehnese descendents there, such as in Yan, Kedah.
in scheme: Lexvo - ISO 639-3 language codes
notation: ace
preferred label: Aceh-Sprache @de
preferred label: accinese @it
preferred label: aceh @fr
preferred label: acehnés @es
preferred label: achém @pt

Saint Lucian Creole French
type: Language
type: Concept
ISO 639-3 code: acf
alternative label: Creole French, Saint Lucian
definition: French Creole is a creole French which is the generally spoken language in Saint Lucia.
in scheme: Lexvo - ISO 639-3 language codes
notation: acf
preferred label: Créole sainte-lucien @fr

Acoli
type: Language
type: Concept
ISO 639-2 Bibliographical code: ach
ISO 639-2 Terminological code: ach
ISO 639-3 code: ach
preferred label: Acholi @de
alternative label: Acholi language
alternative label: Acholi-Sprache @de
alternative label: Língua acholi @pt
definition: Acholi (also Acoli, Akoli, Acooli, Atscholi, Shuli, Gang, Lwoo, Lwo, Lok Acoli, Dok Acoli) is a language primarily spoken by the Acholi people in the districts of Gulu, Kitgum and Pader, a region known as Acholiland in northern Uganda. Acholi is also spoken in the southern part of the Opari District of South Sudan. As of 1996 there were reported approximately 773,800 Acholi speakers in the world. However this has gradually grown to over 800,000. Song of Lawino and its sequel, Song of Ocol, well known among African literature, were written in Acholi by Okot p'Bitek.
in scheme: Lexvo - ISO 639-3 language codes
notation: ach
preferred label: acioli @it
preferred label: acoli @es

Usan
type: Language
type: Concept
ISO 639-3 code: wnu
alternative label: Usan language
definition: Usan (Wanuma) is a Papuan language of Papua New Guinea.
in scheme: Lexvo - ISO 639-3 language codes
notation: wnu

Aka-Cari
type: Language
type: Concept
ISO 639-3 code: aci
alternative label: Aka-Cari language
definition: The Cari language, Aka-Cari (also known as Chariar), is an extinct Great Andamanese language, of the Northern group. It was spoken on the north coast of North Andaman and on Landfall and other nearby small islands.
in scheme: Lexvo - ISO 639-3 language codes
notation: aci

Aka-Kora
type: Language
type: Concept
ISO 639-3 code: ack
alternative label: Aka-Kora language
definition: The Kora language, Aka-Kora, is an extinct Great Andamanese language, of the Northern group. It was spoken on the northeast and north central coasts of North Andaman and on Smith Island.
in scheme: Lexvo - ISO 639-3 language codes
notation: ack
preferred label: Idioma kora @es

Akar-Bale
type: Language
type: Concept
ISO 639-3 code: acl
alternative label: Akar-Bale language
definition: The Bale language, Akar-Bale (also Balwa), is an extinct Southern Great Andamanese language once spoken in the Andaman Islands in Ritchie's Archipelago, Havelock Island, and Neill Island.
in scheme: Lexvo - ISO 639-3 language codes
notation: acl

Iraqi Arabic
type: Language
type: Concept
ISO 639-3 code: acm
alternative label: Arabic, Mesopotamian
alternative label: Mesopotamian Arabic
definition: Iraqi Arabic (also known as Mesopotamian Arabic) is a continuum of mutually intelligible Arabic varieties native to the Mesopotamian basin of Iraq as well as spanning into eastern and northern Syria, western Iran, and spoken in respective Iraqi diaspora communities.
in scheme: Lexvo - ISO 639-3 language codes
notation: acm
preferred label: Irakisch-Arabisch @de
preferred label: Árabe iraquiano @pt

Achang
type: Language
type: Concept
ISO 639-3 code: acn
alternative label: Achang language
definition: The Achang language is a Tibeto-Burman language spoken by the Achang ( Maingtha) in China.
in scheme: Lexvo - ISO 639-3 language codes
notation: acn

Eastern Acipa
type: Language
type: Concept
ISO 639-3 code: acp
alternative label: Acipa, Eastern
in scheme: Lexvo - ISO 639-3 language codes
notation: acp

Ta'izzi-Adeni Arabic
type: Language
type: Concept
ISO 639-3 code: acq
alternative label: Arabic, Ta'izzi-Adeni
definition: Ta'izzi-Adeni Arabic (also known as South Yemeni Arabic) is an Afro-Asiatic language spoken in south Yemen and Djibouti. It is a variety of Yemeni Arabic.
in scheme: Lexvo - ISO 639-3 language codes
notation: acq

Achi
type: Language
type: Concept
ISO 639-3 code: acr
alternative label: Achi’ language
definition: Achi’ (Achí in Spanish) is a Mayan language very closely related to Kiche (Quiché in the older orthography). It is spoken by the Achi people, primarily in the department of Baja Verapaz in Guatemala.
in scheme: Lexvo - ISO 639-3 language codes
notation: acr
preferred label: Achí-Sprache @de
preferred label: Idioma achí @es
preferred label: Língua achi @pt

Acroá
type: Language
type: Concept
ISO 639-3 code: acs
in scheme: Lexvo - ISO 639-3 language codes
notation: acs

Achterhoeks
type: Language
type: Concept
ISO 639-3 code: act
alternative label: Achterhooks
definition: Achterhooks (, ) is a Dutch Low Saxon dialect.
in scheme: Lexvo - ISO 639-3 language codes
notation: act

Achuar-Shiwiar
type: Language
type: Concept
ISO 639-3 code: acu
alternative label: Shiwiar language
definition: Shiwiar, also known as Achuar, Jivaro, Maina, is a Jivaroan language spoken along the Pastaza and Bobonaza rivers in Ecuador.
in scheme: Lexvo - ISO 639-3 language codes
notation: acu
preferred label: Achuar @fr

Wintu
type: Language
type: Concept
in scheme: Lexvo - ISO 639-3 language codes

Achumawi
type: Language
type: Concept
ISO 639-3 code: acv
alternative label: Achumawi language
definition: The Achumawi language (also Achomawi or Pit River language) is the native language spoken by the Pit River people of present-day California. The term Achumawi is an anglicization of the name of the Fall River band, ajúmmááwí, from ajúmmá "river". Originally there were nine bands, with dialect differences among them but primarily between upriver and downriver dialects, demarcated by the Big Valley mountains east of the Fall River valley.
in scheme: Lexvo - ISO 639-3 language codes
notation: acv

Hijazi Arabic
type: Language
type: Concept
ISO 639-3 code: acw
alternative label: Arabic, Hijazi
alternative label: Hejazi Arabic
definition: Hejazi Arabic (also known as Hijazi Arabic [ISO 639-3], West Arabian Arabic) is a variety of the Arabic language spoken in the western region of Saudi Arabia. Although, strictly speaking, there are two distinct dialects spoken in the Hejaz region, one by the bedouin and rural tribes, and another by the urban population, the term most often applies to the urban variety, spoken in cities such as Jeddah, Mecca, Yanbu, and Medina. Outside of Arabia, Urban Hejazi appears to be most closely related to the Arabic dialects of Northern Sudan and Upper Egypt (Ingham 1971).
in scheme: Lexvo - ISO 639-3 language codes
notation: acw
preferred label: Árabe hiyazí @es

Omani Arabic
type: Language
type: Concept
ISO 639-3 code: acx
alternative label: Arabic, Omani
definition: Omani Arabic (also known as Omani Hadari Arabic) is a variety of Gulf Arabic dialect spoken in the Hajar Mountains of Oman and in a few neighboring coastal regions. It was formerly spoken by colonists in Kenya and Tanzania, but most or all of them have shifted to Swahili.
in scheme: Lexvo - ISO 639-3 language codes
notation: acx

Cypriot Arabic
type: Language
type: Concept
ISO 639-3 code: acy
alternative label: Arabic, Cypriot
alternative label: Cypriot Maronite Arabic
definition: Cypriot Arabic, known as Cypriot Maronite Arabic, is a variety of Arabic spoken by the Maronite community of Cyprus. Most speakers are situated in the capital, Nicosia, while others are located in Kormakitis and Limassol. The majority of speakers are over 30 years of age, as many in the younger generations only speak Cypriot Greek, partially because of intermarriage with ethnic Greek Cypriots. The language was first introduced to the island by Maronites fleeing Syria and Lebanon in the 8th century.
in scheme: Lexvo - ISO 639-3 language codes
notation: acy
preferred label: Zyprisches Arabisch @de

Acheron
type: Language
type: Concept
ISO 639-3 code: acz
alternative label: Acheron language
definition: Acheron (Asheron) is a Niger–Congo language in the Talodi family of Kordofan, Sudan.
in scheme: Lexvo - ISO 639-3 language codes
notation: acz

Wanyi
type: Language
type: Concept
ISO 639-3 code: wny
in scheme: Lexvo - ISO 639-3 language codes
notation: wny

Adangme
type: Language
type: Concept
ISO 639-2 Bibliographical code: ada
ISO 639-2 Terminological code: ada
ISO 639-3 code: ada
alternative label: Adangme language
definition: Adangme (also called Dangme), is a Kwa language spoken in south-eastern Ghana by 800,000 people. Some sources list Adangbe as another name for the same language whereas lists it as a different language in the Kwa family, and it has a separate ISO 639-3 code of adq.
in scheme: Lexvo - ISO 639-3 language codes
notation: ada
preferred label: Dangme @de
preferred label: adangme @es

Adabe
type: Language
type: Concept
ISO 639-3 code: adb
alternative label: Adabe language
definition: Adabe is a Papuan language spoken by the Adabe people on Atauro Island, East Timor. It has also been known as Ataura (Atauru, Atauro) and Raklu-Un (Raklu Un).
in scheme: Lexvo - ISO 639-3 language codes
notation: adb

Dzodinka
type: Language
type: Concept
ISO 639-3 code: add
in scheme: Lexvo - ISO 639-3 language codes
notation: add

Adele
type: Language
type: Concept
ISO 639-3 code: ade
alternative label: Adele language
definition: The Adele language is spoken in central eastern Ghana and central western Togo. It belongs to the geographic group of Ghana Togo Mountain languages (traditionally called the Togorestsprachen or Togo Remnant languages) of the Kwa branch of Niger–Congo. The speakers themselves call the language Gidire.
in scheme: Lexvo - ISO 639-3 language codes
notation: ade
preferred label: Idioma adele @es
preferred label: Língua adele @pt

Dhofari Arabic
type: Language
type: Concept
ISO 639-3 code: adf
alternative label: Arabic, Dhofari
definition: Dhofari Arabic (also known as Dhofari, Zofari) is a variety of Arabic spoken in Salalah, Oman and the surrounding coastal regions (Dhofar).
in scheme: Lexvo - ISO 639-3 language codes
notation: adf

Andegerebinha
type: Language
type: Concept
ISO 639-3 code: adg
alternative label: Andegerebinha language
definition: The Andegerebinha language, also known as Andigibinha and Antekerrepinhe, is an aboriginal language of the Northwest Territory of Australia spoken around the Hay River, Pituri Creek area according to Ethnologue. It was spoken by only ten individuals as of 1981, so it may now be extinct.
in scheme: Lexvo - ISO 639-3 language codes
notation: adg

Adhola
type: Language
type: Concept
ISO 639-3 code: adh
alternative label: Adhola language
definition: The Adhola language, also known as japadhola and Ludama, is the language of the Adhola people ( Jopadhola or Badama) of Uganda. Dhopadhola is generally mutually intelligible with Acholi, Lango, Kumam, and Alur of Uganda and Dholuo of Kenya.
in scheme: Lexvo - ISO 639-3 language codes
notation: adh

Tyaraity
type: Language
type: Concept
ISO 639-3 code: woa
in scheme: Lexvo - ISO 639-3 language codes
notation: woa

Adi
type: Language
type: Concept
ISO 639-3 code: adi
alternative label: Adi language
definition: Adi, or Abor, is a small Tibetan–Burman language of India. The various dialects in the box at right, and perhaps a few more, may be distinct languages.
in scheme: Lexvo - ISO 639-3 language codes
notation: adi

Adioukrou
type: Language
type: Concept
ISO 639-3 code: adj
alternative label: Adjukru language
definition: Adjukru (Adioukrou, Adyoukrou, Adyukru, Ajukru) is a language of uncertain classification within the Kwa branch of the Niger–Congo family. It is spoken in Ivory Coast.
in scheme: Lexvo - ISO 639-3 language codes
notation: adj
preferred label: Adiukru @de
preferred label: Adjoukrou @fr

Galo
type: Language
type: Concept
ISO 639-3 code: adl
alternative label: Gallong language
definition: The Gallong or Galo language is a Tibeto-Burman language of the Tani group, spoken by the Galo people. Its precise position within Tani is not yet certain, due primarily to its central location in the Tani area and the strong effects of intra-Tani contacts on the development of Tani languages. It is an endangered language according to the normal definitions, although prospects for its survival are better than most similarly-placed languages in the world. The major Galo dialects are Pugo, spoken around the district capital Aalo, Lare, spoken to the south of Aaloo, and a dialect provisionally describable as "North-Western", spoken in the North-West near the Tagin area. There may be additional Galo dialects further to the North, which remains largely un-researched. Subdialects are numerous, and often correspond to regional or clan groupings. Neighbouring languages include Assamese, Nepali, Bodo, Mising, Minyong, Hills Miri, Tagin, Nishi, Bori, Pailibo, Ramo and Bokar.
in scheme: Lexvo - ISO 639-3 language codes
notation: adl

Adang
type: Language
type: Concept
ISO 639-3 code: adn
alternative label: Adang language
definition: The Adang language is spoken on the island of Alor in Indonesia. According to Ethnologue the language has 31,814 speakers . The language is agglutinative
in scheme: Lexvo - ISO 639-3 language codes
notation: adn

Abu
type: Language
type: Concept
ISO 639-3 code: ado
alternative label: Adjora language
definition: Adjora (Adjoria, Azao) Abu is a Ramu language of Papua New Guinea.
in scheme: Lexvo - ISO 639-3 language codes
notation: ado

Adap
type: Language
type: Concept
ISO 639-3 code: adp
in scheme: Lexvo - ISO 639-3 language codes
notation: adp

Adangbe
type: Language
type: Concept
ISO 639-3 code: adq
in scheme: Lexvo - ISO 639-3 language codes
notation: adq

Wè Northern
type: Language
type: Concept
ISO 639-3 code: wob
alternative label: Wobé language
definition: Wobé (Ouobe) is a Kru language spoken in Ivory Coast. It is one of several languages in a dialect continuum called Wèè (Wɛɛ).
in scheme: Lexvo - ISO 639-3 language codes
notation: wob

Adonara
type: Language
type: Concept
ISO 639-3 code: adr
in scheme: Lexvo - ISO 639-3 language codes
notation: adr

Adamorobe Sign Language
type: Language
type: Concept
ISO 639-3 code: ads
definition: Adamorobe Sign Language (AdaSL) is an indigenous sign language used in Adamorobe, an Akan village in eastern Ghana. It is used by about 30 deaf and 1370 hearing people.”. Ethnologue reports a total of 3,400 signers, including hearing users, but a recent census mentions a total of 1400 inhabitants.
in scheme: Lexvo - ISO 639-3 language codes
notation: ads
preferred label: Adamorobe-Gebärdensprache @de
preferred label: Lengua de señas adamorobe @es
preferred label: Língua Gestual de Adamorobe @pt

Adnyamathanha
type: Language
type: Concept
ISO 639-3 code: adt
alternative label: Adnyamathanha language
definition: Adnyamathanha (many other names; see below) is a moribund Australian Aboriginal language. It is the traditional language of the Adnyamathanha people.
in scheme: Lexvo - ISO 639-3 language codes
notation: adt

Aduge
type: Language
type: Concept
ISO 639-3 code: adu
in scheme: Lexvo - ISO 639-3 language codes
notation: adu

Amundava
type: Language
type: Concept
ISO 639-3 code: adw
in scheme: Lexvo - ISO 639-3 language codes
notation: adw

Amdo Tibetan
type: Language
type: Concept
ISO 639-3 code: adx
alternative label: Amdo Tibetan language
alternative label: Tibetan, Amdo
definition: The Amdo language (; also called Am kä) is the spoken language of the majority of the people of Amdo in northeastern Tibet, in Chinese states of Qinghai and some parts of Sichuan (Aba) and Gansu (Ganlho). It is one of the four main spoken languages of Tibetan, the other three being Standard Tibetan (ü ke) Kham (kham ke) and Ladakhi (tö ke). All four main languages of Tibetan share a common written script but their spoken pronunciations, vocabularies and grammars are different. These differences may have emerged due to geographical isolation of the regions of Tibet. Unlike Khams language and standard Tibetan, Amdo language is not tonal. It retains many word-initial consonant clusters which have been lost in Central Tibetan.
in scheme: Lexvo - ISO 639-3 language codes
notation: adx

Adyghe
type: Language
type: Concept
ISO 639-2 Bibliographical code: ady
ISO 639-2 Terminological code: ady
ISO 639-3 code: ady
alternative label: Adygei
alternative label: Adygeische Sprache @de
alternative label: Adyghe language
alternative label: Adyguéen @fr
alternative label: Idioma adigué @es
alternative label: Lingua adighè @it
alternative label: Língua adigue @pt
alternative label: adyghéen @fr
definition: Adyghe language (, adygabze, , adəgăbză adâgăbză), also known as West Circassian (see: Circassian language), is one of the two official languages of the Republic of Adygea in the Russian Federation, the other being Russian. It is spoken by various tribes of the Adyghe people: Abzekh, Adamey, Bzhedug; Hatukuay, Kemirgoy, Makhosh; Natekuay, Shapsug; Zhane, Yegerikuay, each with its own dialect. The language is referred to by its speakers as Adygebze or Adəgăbză, and alternatively spelled in English as Adygean, Adygeyan or Adygei.
in scheme: Lexvo - ISO 639-3 language codes
notation: ady
preferred label: Adygeisch @de
preferred label: adigeo @es
preferred label: adigue @pt
preferred label: adyghe @it
preferred label: adyghé @fr

Adzera
type: Language
type: Concept
ISO 639-3 code: adz
in scheme: Lexvo - ISO 639-3 language codes
notation: adz

Areba
type: Language
type: Concept
ISO 639-3 code: aea
in scheme: Lexvo - ISO 639-3 language codes
notation: aea

Tunisian Arabic
type: Language
type: Concept
ISO 639-3 code: aeb
alternative label: Arabic, Tunisian
definition: Tunisian Arabic (locally: or derja) is a Maghrebi dialect of the Arabic language, spoken by some 11 million people. It is usually known by its own speakers as Derja, which means dialect, to distinguish it from Standard Arabic, or as Tunsi, which means Tunisian. It is spoken all over Tunisia, and merges, as part of a dialect continuum, into similar varieties in eastern Algeria and western Libya. Its morphology, syntax, pronunciation and vocabulary are quite different from Standard or Classical Arabic. Tunisian Arabic, like other Maghrebi dialects, has a vocabulary mostly Arabic, with significant Berber substrates, and many words and loanwords borrowed from Berber, French, Turkish, Italian and Spanish. Derja is mutually spoken and understood in the Maghreb countries, especially Morocco, Algeria and Tunisia, but hard to understand for orientals.
in scheme: Lexvo - ISO 639-3 language codes
notation: aeb

Saidi Arabic
type: Language
type: Concept
ISO 639-3 code: aec
alternative label: Arabic, Saidi
alternative label: Sa'idi Arabic
definition: Sa`idi Arabic (, locally: , ; also known as Saidi Arabic ) is the variety of Arabic spoken by Sa'idis south of Cairo, Egypt to the border of Sudan. It shares linguistic features both with Egyptian Arabic, as well as Sudanese Arabic. Dialects include Middle and Upper Egyptian Arabic. Speakers of Egyptian Arabic do not always understand more conservative varieties of Sa`idi Arabic.
in scheme: Lexvo - ISO 639-3 language codes
notation: aec

Wogeo
type: Language
type: Concept
ISO 639-3 code: woc
in scheme: Lexvo - ISO 639-3 language codes
notation: woc

Argentine Sign Language
type: Language
type: Concept
ISO 639-3 code: aed
definition: Argentine Sign Language is used in Argentina. Deaf people attend separate schools, and use local sign languages out of class. A manual alphabet for spelling Spanish has been developed. Sign language is usually banned in the classroom, due to the belief that allowing deaf children to sign would hinder their ability to communicate with hearing people.
in scheme: Lexvo - ISO 639-3 language codes
notation: aed
preferred label: Lengua de señas argentina @es
preferred label: Língua gestual argentina @pt

Northeast Pashayi
type: Language
type: Concept
ISO 639-3 code: aee
alternative label: Pashayi, Northeast
in scheme: Lexvo - ISO 639-3 language codes
notation: aee

Haeke
type: Language
type: Concept
ISO 639-3 code: aek
in scheme: Lexvo - ISO 639-3 language codes
notation: aek

Ambele
type: Language
type: Concept
ISO 639-3 code: ael
alternative label: Ambele language
definition: Ambele is a divergent, apparently Grassfields language of Cameroon.
in scheme: Lexvo - ISO 639-3 language codes
notation: ael

Arem
type: Language
type: Concept
ISO 639-3 code: aem
alternative label: Arem language
definition: Arem is an endangered language spoken in a small area on either side of the Laos-Vietnam border. In 1996 there were estimated to be about twenty speakers in each country. It is therefore on the verge of extinction. Its nearest relative may be the Chut language of Vietnam.
in scheme: Lexvo - ISO 639-3 language codes
notation: aem

Armenian Sign Language
type: Language
type: Concept
ISO 639-3 code: aen
definition: Armenian Sign Language, also known as Caucasian Sign Language, is the indigenous sign language of Armenia. It is not directly related to the sign languages of Europe, though it may have historical connections to monastic sign language. It developed under marriage speech taboos similar to those operating in Aboriginal Australia (see Aboriginal Australian sign languages). It is not clear if it is used by the deaf community, or if they have their own sign language.
in scheme: Lexvo - ISO 639-3 language codes
notation: aen
preferred label: Língua gestual armeniana @pt

Aer
type: Language
type: Concept
ISO 639-3 code: aeq
in scheme: Lexvo - ISO 639-3 language codes
notation: aeq

Wolani
type: Language
type: Concept
ISO 639-3 code: wod
in scheme: Lexvo - ISO 639-3 language codes
notation: wod

Eastern Arrernte
type: Language
type: Concept
ISO 639-3 code: aer
alternative label: Arrernte, Eastern
in scheme: Lexvo - ISO 639-3 language codes
notation: aer

Alsea
type: Language
type: Concept
ISO 639-3 code: aes
alternative label: Alsea language
definition: Alsea or Alsean (also Yakonan) was two closely related speech varieties spoken along the central Oregon coast. They are sometimes taken to be different languages, but it is difficult to be sure given the poor state of attestation; Mithun (1999) believes they were probably dialects of a single language.
in scheme: Lexvo - ISO 639-3 language codes
notation: aes
preferred label: Alséa @fr
preferred label: Lenguas alseanas @es

Akeu
type: Language
type: Concept
ISO 639-3 code: aeu
in scheme: Lexvo - ISO 639-3 language codes
notation: aeu

Ambakich
type: Language
type: Concept
ISO 639-3 code: aew
in scheme: Lexvo - ISO 639-3 language codes
notation: aew

Amele
type: Language
type: Concept
ISO 639-3 code: aey
alternative label: Amele language
definition: Amele (Amale) is a Papuan language of Papua New Guinea. Dialects are Huar, Jagahala, Haija.
in scheme: Lexvo - ISO 639-3 language codes
notation: aey

Aeka
type: Language
type: Concept
ISO 639-3 code: aez
in scheme: Lexvo - ISO 639-3 language codes
notation: aez

Gulf Arabic
type: Language
type: Concept
ISO 639-3 code: afb
alternative label: Arabic, Gulf
definition: Gulf Arabic (also known as Khaliji, al-lahja al-khalijiya اللهجة الخليجية) is a variety of the Arabic language spoken around the shore of the Persian Gulf such as in Kuwait, Saudi Arabia, Bahrain, Qatar, the United Arab Emirates and Oman. Some notable characteristics that set it apart from other Arabian dialects are the presence of Persian loanwords and a pronunciation of k as ch (kalb "dog," read as chalb); q as g (daqiqa "minute," read as dagiga); and, in some instances, the pronunciation j as y (jeeb "bring" (masc), read as yeeb).
in scheme: Lexvo - ISO 639-3 language codes
notation: afb
preferred label: Arabe du Golfe @fr

Woleaian
type: Language
type: Concept
ISO 639-3 code: woe
alternative label: Woleaian language
definition: Woleaian is the main language of the island of Woleai and surrounding smaller islands in the state of Yap of the Federated States of Micronesia. Woleaian is a Trukic language, and within that family its closest relative is Satawalese, with which it is largely mutually intelligible. Woleaian is divided into two dialects: Woleaian proper and Lamotrek. There are approximately 1700 speakers of Woleaian.
in scheme: Lexvo - ISO 639-3 language codes
notation: woe
preferred label: Woleai @fr
preferred label: Woleaianische Sprache @de
preferred label: Woleaiano @it

Andai
type: Language
type: Concept
ISO 639-3 code: afd
alternative label: Andai language
definition: Andai (Meakambut, Pundungum, Wangkai) is a Ramu language of Papua New Guinea.
in scheme: Lexvo - ISO 639-3 language codes
notation: afd

Putukwam
type: Language
type: Concept
ISO 639-3 code: afe
in scheme: Lexvo - ISO 639-3 language codes
notation: afe

Afghan Sign Language
type: Language
type: Concept
ISO 639-3 code: afg
in scheme: Lexvo - ISO 639-3 language codes
notation: afg

Afrihili
type: Language
type: Concept
ISO 639-2 Bibliographical code: afh
ISO 639-2 Terminological code: afh
ISO 639-3 code: afh
preferred label: afrihili @es
definition: Afrihili (Ni Afrihili Oluga the Afrihili language) is a constructed language designed in 1970 by Ghanaian historian K. A. Kumi Attobrah (Kumi Atɔbra) to be used as a lingua franca in all of Africa. The name of the language is a combination of Africa and Swahili. The author, a native of Akrokerri (Akrokɛri) in Ghana, originally conceived of the idea in 1967 while on a sea voyage from Dover to Calais. His intention was that "it would promote unity and understanding among the different peoples of the continent, reduce costs in printing due to translations and promote trade". It is meant to be easy for Africans to learn.
in scheme: Lexvo - ISO 639-3 language codes
notation: afh

Akrukay
type: Language
type: Concept
ISO 639-3 code: afi
in scheme: Lexvo - ISO 639-3 language codes
notation: afi

Nanubae
type: Language
type: Concept
ISO 639-3 code: afk
alternative label: Nanubae language
definition: Nanubae (Kapagmai, Aunda) is a Ramu language of Papua New Guinea.
in scheme: Lexvo - ISO 639-3 language codes
notation: afk

Defaka
type: Language
type: Concept
ISO 639-3 code: afn
alternative label: Defaka language
definition: The Defaka language is an Ijoid branch of the Niger–Congo languages, spoken in Nigeria. It is an endangered language.
in scheme: Lexvo - ISO 639-3 language codes
notation: afn

Eloyi
type: Language
type: Concept
ISO 639-3 code: afo
alternative label: Eloyi language
definition: Eloyi is a poorly attested Plateau language of uncertain classification. Ethnologue classifies it as Idomoid based on a proposal by Armstrong (1955, 1983), but that identification was based on a single word list and Armstrong later expressed doubts. All other preliminary accounts classify it as Plateau, and Blench (2008) leaves it as a separate branch of Plateau.
in scheme: Lexvo - ISO 639-3 language codes
notation: afo

Tapei
type: Language
type: Concept
ISO 639-3 code: afp
in scheme: Lexvo - ISO 639-3 language codes
notation: afp

Afrikaans
type: Language
type: Concept
ISO 639-1 code: af
ISO 639-2 Bibliographical code: afr
ISO 639-2 Terminological code: afr
ISO 639-3 code: afr
alternative label: Lingua afrikaans @it
alternative label: Língua africâner @pt
alternative label: africâner @pt
preferred label: afrikaans @fr
definition: Afrikaans is a West Germanic language, spoken natively in South Africa, Namibia and to a lesser extent in Botswana and Zimbabwe. It developed from 17th century Dutch dialects, and was previously referred to as "Cape Dutch" (a term also used to refer collectively to the early Cape settlers). Although Afrikaans adopted words from languages such as Malay, Portuguese, the Bantu languages, and the Khoisan languages, an estimated 90 to 95 percent of Afrikaans vocabulary is ultimately of Dutch origin. Therefore, differences with Dutch often lie in a more regular morphology, grammar, and spelling of Afrikaans. There is a large degree of mutual intelligibility between the two languages—especially in written form—although it is easier for Dutch-speakers to understand Afrikaans than the other way around.
in scheme: Lexvo - ISO 639-3 language codes
notation: afr
preferred label: Afrikáans @es

Afro-Seminole Creole
type: Language
type: Concept
ISO 639-3 code: afs
alternative label: Creole, Afro-Seminole
definition: Afro-Seminole Creole is an English-based creole spoken by Black Seminoles in scattered communities in Oklahoma, Texas, and Northern Mexico. It was first identified as a language by Ian Hancock, a linguist at the University of Texas.
in scheme: Lexvo - ISO 639-3 language codes
notation: afs
preferred label: Afro-Seminolisches Kreol @de

Afitti
type: Language
type: Concept
ISO 639-3 code: aft
alternative label: Afitti language
definition: Dinik, also known as Afitti (Ditti, Unietti), is an East Sudanic language spoken in the Nuba Mountains.
in scheme: Lexvo - ISO 639-3 language codes
notation: aft

Awutu
type: Language
type: Concept
ISO 639-3 code: afu
alternative label: Efutu language
definition: Awutu is a Guang language spoken by 180,000 in coastal Ghana.
in scheme: Lexvo - ISO 639-3 language codes
notation: afu

Obokuitai
type: Language
type: Concept
ISO 639-3 code: afz
in scheme: Lexvo - ISO 639-3 language codes
notation: afz

Gambian Wolof
type: Language
type: Concept
ISO 639-3 code: wof
alternative label: Wolof, Gambian
in scheme: Lexvo - ISO 639-3 language codes
notation: wof

Aguano
type: Language
type: Concept
ISO 639-3 code: aga
alternative label: Aguano language
definition: Aguano is a possible extinct language of Peru. It is not listed in Kaufman (1994). Ruhlen (1987) says it's the same language as Chamicuro, but Chamicuro speakers say that the Aguano language was not the same as theirs, but rather that the Aguano people spoke Quechua (Wise 1987).
in scheme: Lexvo - ISO 639-3 language codes
notation: aga
preferred label: Idioma aguano @es

Legbo
type: Language
type: Concept
ISO 639-3 code: agb
alternative label: Gbo language
definition: The Gbo language, known as Legbo or after the people as Agbo, is a Upper Cross River language of Nigeria.
in scheme: Lexvo - ISO 639-3 language codes
notation: agb

Agatu
type: Language
type: Concept
ISO 639-3 code: agc
in scheme: Lexvo - ISO 639-3 language codes
notation: agc

Agarabi
type: Language
type: Concept
ISO 639-3 code: agd
alternative label: Agarabi language
definition: Agarabi, also called Bare, is a Kainantu language spoken in Papua New Guinea.
in scheme: Lexvo - ISO 639-3 language codes
notation: agd

Angal
type: Language
type: Concept
ISO 639-3 code: age
in scheme: Lexvo - ISO 639-3 language codes
notation: age

Arguni
type: Language
type: Concept
ISO 639-3 code: agf
in scheme: Lexvo - ISO 639-3 language codes
notation: agf

Angor
type: Language
type: Concept
ISO 639-3 code: agg
alternative label: Angor language
definition: Angor (Anggor) Senagi is a Senagi language of Papua New Guinea.
in scheme: Lexvo - ISO 639-3 language codes
notation: agg

Ngelima
type: Language
type: Concept
ISO 639-3 code: agh
alternative label: Ngelima language
definition: Ngelima, or Angba (Leangba), is a Bantu language spoken in the Democratic Republic of Congo. The four dialects (Beo, Buru (Boro), Tungu, Hanga) are quite distinct, and may be separate languages.
in scheme: Lexvo - ISO 639-3 language codes
notation: agh

Wogamusin
type: Language
type: Concept
ISO 639-3 code: wog
alternative label: Wogamusin language
definition: Wogamusin is a Papuan language spoken by about 700 people in four villages in the Ambunti District of East Sepik Province, Papua New Guinea.
in scheme: Lexvo - ISO 639-3 language codes
notation: wog

Agariya
type: Language
type: Concept
ISO 639-3 code: agi
alternative label: Agariya language
definition: The Agariya language is spoken by the Agariya people, especially in Madhya Pradesh in India. It is a Munda language.
in scheme: Lexvo - ISO 639-3 language codes
notation: agi

Argobba
type: Language
type: Concept
ISO 639-3 code: agj
alternative label: Argobba language
definition: Argobba is an Ethiopian Semitic spoken in an area north-east of Addis Ababa by the Argobba people. It belongs to the South Ethiopian Semitic subgroup together with Amharic and the Gurage languages. Writing in the mid-1960s, Edward Ullendorff noted that it "is disappearing rapidly in favour of Amharic, and only a few hundred elderly people are still able to speak it."
in scheme: Lexvo - ISO 639-3 language codes
notation: agj
preferred label: Língua argobba @pt

Isarog Agta
type: Language
type: Concept
ISO 639-3 code: agk
alternative label: Agta, Isarog
in scheme: Lexvo - ISO 639-3 language codes
notation: agk

Fembe
type: Language
type: Concept
ISO 639-3 code: agl
in scheme: Lexvo - ISO 639-3 language codes
notation: agl

Angaataha
type: Language
type: Concept
ISO 639-3 code: agm
alternative label: Angaataha language
definition: Angaatiha (Angaatiya, Angaataha) is the most divergent of the Angan languages of Papua New Guinea. Langimar.
in scheme: Lexvo - ISO 639-3 language codes
notation: agm

Agutaynen
type: Language
type: Concept
ISO 639-3 code: agn
alternative label: Agutaynen language
definition: The Agutaynen language is spoken on Agutaya Island in the province of Palawan in the Philippines.
in scheme: Lexvo - ISO 639-3 language codes
notation: agn

Tainae
type: Language
type: Concept
ISO 639-3 code: ago
in scheme: Lexvo - ISO 639-3 language codes
notation: ago

Aghem
type: Language
type: Concept
ISO 639-3 code: agq
alternative label: Aghem language
definition: Aghem is a Bantoid language spoken in the Wum Central Sub-division in Menchum Division of the North West Region of Cameroon in the continent of Africa. Aghem is a tribe consisting of over 60 matrilineal clans and intramarriage is forbidden among the matriclans.
in scheme: Lexvo - ISO 639-3 language codes
notation: agq
preferred label: aghem @es

Aguaruna
type: Language
type: Concept
ISO 639-3 code: agr
alternative label: Aguaruna language
definition: Aguaruna is an indigenous American language of the Jivaroan family spoken by about 45,000 Aguaruna people in Peru. The speakers live along the western portion of the Marañón River and also along the Potro, Mayo, and Cahuapanas rivers. Native speakers currently prefer the name Awajún. According to the Ethnologue there are almost no monolingual speakers; nearly all also speak Spanish. The school system begins with Aguaruna only; as the students progress, Spanish is gradually added. There is a positive outlook and connotation in regard to bilingualism. 60 to 100% are literate and 50 to 75% are literate in Spanish. Huambisa and Achuar-Siwiar are closely related languages. A modest dictionary of the language has been published.
in scheme: Lexvo - ISO 639-3 language codes
notation: agr
preferred label: Idioma aguaruna @es

Esimbi
type: Language
type: Concept
ISO 639-3 code: ags
alternative label: Esimbi language
definition: Esimbi is a language of the Cameroons spoken by some 45,000 people. It's generally classified as Tivoid, but with little evidence.
in scheme: Lexvo - ISO 639-3 language codes
notation: ags

Central Cagayan Agta
type: Language
type: Concept
ISO 639-3 code: agt
alternative label: Agta, Central Cagayan
in scheme: Lexvo - ISO 639-3 language codes
notation: agt

Kamang
type: Language
type: Concept
ISO 639-3 code: woi
in scheme: Lexvo - ISO 639-3 language codes
notation: woi

Aguacateco
type: Language
type: Concept
ISO 639-3 code: agu
alternative label: Awakatek language
definition: Qa'yol also known as Awakatek, is a Mayan language spoken in primarily Huehuetenango, Guatemala in and around Aguacatán. It is a living language with some 18,000 speakers.
in scheme: Lexvo - ISO 639-3 language codes
notation: agu
preferred label: Awakatekisch @de
preferred label: Awakateko @fr
preferred label: Idioma aguacateco @es
preferred label: Língua aguacateca @pt

Sinauna language
type: Language
type: Concept
ISO 639-3 code: agv
alternative label: Dumagat, Remontado
alternative label: Remontado Dumagat
definition: Sinauna, also known as Remontado Agta and Hatang Kayey, is a language spoken in Tanay, Rizal, General Nakar, Quezon, Rodriguez, Rizal and Antipolo City. Sinauna is closely related to Kapampangan and Sambalic languages. The Laiban Dam project is planned in Kaliwa-Kanan River River Valley, the ancestral land of the Sinauna/Remontado Agta.
in scheme: Lexvo - ISO 639-3 language codes
notation: agv

Kahua
type: Language
type: Concept
ISO 639-3 code: agw
alternative label: Kahua language
definition: The Kahua language is a member of the family of San Cristobal languages, and is spoken in the southern part of the island of Makira, formerly known as San Cristobal in the Solomon Islands. It has also been called Anganiwai, Narihua, Wanoni.
in scheme: Lexvo - ISO 639-3 language codes
notation: agw

Aghul
type: Language
type: Concept
ISO 639-3 code: agx
alternative label: Aghul language
definition: Aghul, also spelled Agul, is a language spoken by the Aguls who live in southern Dagestan, Russia and in Azerbaijan. It is spoken by about 28,300 people (2002 census).
in scheme: Lexvo - ISO 639-3 language codes
notation: agx
preferred label: Aghulische Sprache @de
preferred label: Agul @fr
preferred label: Língua agul @pt

Southern Alta
type: Language
type: Concept
ISO 639-3 code: agy
alternative label: Alta, Southern
in scheme: Lexvo - ISO 639-3 language codes
notation: agy

Mt. Iriga Agta
type: Language
type: Concept
ISO 639-3 code: agz
alternative label: Agta, Mt. Iriga
in scheme: Lexvo - ISO 639-3 language codes
notation: agz

Ahanta
type: Language
type: Concept
ISO 639-3 code: aha
in scheme: Lexvo - ISO 639-3 language codes
notation: aha

Longto
type: Language
type: Concept
ISO 639-3 code: wok
in scheme: Lexvo - ISO 639-3 language codes
notation: wok

Axamb
type: Language
type: Concept
ISO 639-3 code: ahb
in scheme: Lexvo - ISO 639-3 language codes
notation: ahb

Qimant
type: Language
type: Concept
ISO 639-3 code: ahg
alternative label: Qimant language
definition: The Qimant language is a highly endangered language spoken by a small and elderly fraction of the Qemant people in Northern Ethiopia mainly in Chilga Woreda in Semien Gondar Zone between Gondar and Metemma.
in scheme: Lexvo - ISO 639-3 language codes
notation: ahg

Aghu
type: Language
type: Concept
ISO 639-3 code: ahh
in scheme: Lexvo - ISO 639-3 language codes
notation: ahh

Tiagbamrin Aizi
type: Language
type: Concept
ISO 639-3 code: ahi
alternative label: Aizi, Tiagbamrin
in scheme: Lexvo - ISO 639-3 language codes
notation: ahi

Akha
type: Language
type: Concept
ISO 639-3 code: ahk
alternative label: Akha language
definition: Akha is the language spoken by the Akha people. It is sometimes considered a dialect of the Hani language spoken in China, although most speakers live in eastern Burma.
in scheme: Lexvo - ISO 639-3 language codes
notation: ahk

Igo
type: Language
type: Concept
ISO 639-3 code: ahl
alternative label: Ahlon language
definition: The Ahlon language, Igo, is spoken in the Plateau Region of Togo. It is considered one of the Ghana–Togo Mountain languages of the Kwa family. Variations of its official name are Achlo, Ahlõ, Ahlo, Ahlon-Bogo, Ahonlan, Anlo.
in scheme: Lexvo - ISO 639-3 language codes
notation: ahl

Mang
type: Language
type: Concept
ISO 639-3 code: zng
alternative label: Mang language
definition: Mang (Chinese 莽语 ) is an Austro-Asiatic language of Vietnam and across the border in China.
in scheme: Lexvo - ISO 639-3 language codes
notation: zng

Mobumrin Aizi
type: Language
type: Concept
ISO 639-3 code: ahm
alternative label: Aizi, Mobumrin
in scheme: Lexvo - ISO 639-3 language codes
notation: ahm

Wolof
type: Language
type: Concept
ISO 639-1 code: wo
ISO 639-2 Bibliographical code: wol
ISO 639-2 Terminological code: wol
ISO 639-3 code: wol
in scheme: Lexvo - ISO 639-3 language codes
notation: wol
preferred label: uolof @es
preferred label: uólofe @pt
preferred label: volof @it
preferred label: wolof @fr

Àhàn
type: Language
type: Concept
ISO 639-3 code: ahn
alternative label: Ahan language
definition: Ahaan (Àhàn) is a divergent Volta–Niger language of Nigeria, closely related only to Ayere.
in scheme: Lexvo - ISO 639-3 language codes
notation: ahn
preferred label: Ahan @de

Ahom
type: Language
type: Concept
ISO 639-3 code: aho
alternative label: Ahom language
definition: The Ahom language is a nearly extinct Tai language spoken by the Ahom people who ruled the Brahmaputra river valley in the Indian state of Assam between the 13th and the 18th centuries.
in scheme: Lexvo - ISO 639-3 language codes
notation: aho
preferred label: Idioma ahom @es

Aproumu Aizi
type: Language
type: Concept
ISO 639-3 code: ahp
alternative label: Aizi, Aproumu
in scheme: Lexvo - ISO 639-3 language codes
notation: ahp

Ahirani
type: Language
type: Concept
ISO 639-3 code: ahr
in scheme: Lexvo - ISO 639-3 language codes
notation: ahr

Ashe
type: Language
type: Concept
ISO 639-3 code: ahs
in scheme: Lexvo - ISO 639-3 language codes
notation: ahs

Ahtena
type: Language
type: Concept
ISO 639-3 code: aht
alternative label: Ahtna language
definition: Ahtna or Ahtena is the Na-Dené language of the Ahtna ethnic group of the Copper River area of Alaska. The language is also known as Copper River or Mednovskiy. There are 80 speakers out of a population of 500, and the language is facing extinction but many younger people are learning it to try to keep it from extinction.
in scheme: Lexvo - ISO 639-3 language codes
notation: aht
preferred label: Ahtna @de
preferred label: Língua ahtna @pt

Arosi
type: Language
type: Concept
ISO 639-3 code: aia
alternative label: Arosi language
definition: The Arosi language is a member of the family of San Cristobal languages, and is spoken in the northwest part of the island of Makira, formerly known as San Cristobal in the Solomon Islands. Population is 6.750.
in scheme: Lexvo - ISO 639-3 language codes
notation: aia

Ainu
type: Language
type: Concept
ISO 639-3 code: aib
alternative label: Ainu (China)
alternative label: Äynu language
definition: Äynu (or Aini, Ejnu, Abdal ) is a Turkic language spoken in western China known in various spelling as Aini, Aynu, Ainu, Eyni or by the Uyghur Abdal (ئابدال), in Russian sources Эйну́, Айну, Абдал, by the Chinese as Ainu. Some linguists call it a mixed language, having a mostly Turkic grammar, essentially Uyghur, but a mainly Iranian vocabulary. Other linguists argue that it does not meet the technical requirements of a mixed language. It is spoken by the Äynu, a nomadic people. The Äynu people call their language Äynú (ئەينۇ) .
in scheme: Lexvo - ISO 639-3 language codes
notation: aib
preferred label: Aïnou @fr
preferred label: Idioma aini @es
preferred label: Lingua aini @it
preferred label: Língua aini @pt
preferred label: Äynu @de

Ainbai
type: Language
type: Concept
ISO 639-3 code: aic
in scheme: Lexvo - ISO 639-3 language codes
notation: aic

Alngith
type: Language
type: Concept
ISO 639-3 code: aid
alternative label: Alngith dialect
definition: Alngith is an extinct Paman language formerly spoken on the Cape York Peninsula of Queensland, Australia, by the Alngith people. Its date of extinction is unknown. Phonologically, this language variety is very similar to the related variety Linngithigh, the only difference being that this language has the process of metathesis whereas Linngithigh does not.
in scheme: Lexvo - ISO 639-3 language codes
notation: aid

Amara
type: Language
type: Concept
ISO 639-3 code: aie
alternative label: Amara language
definition: Amara is an Austronesian language spoken by about 1200 individuals along the northwest coast of West New Britain Province, Papua New Guinea on the island of New Britain. Speakers have close to a 100% bilingualism with Bariai, and many also speak Tok Pisin.
in scheme: Lexvo - ISO 639-3 language codes
notation: aie

Agi
type: Language
type: Concept
ISO 639-3 code: aif
in scheme: Lexvo - ISO 639-3 language codes
notation: aif

Leeward Caribbean Creole English
type: Language
type: Concept
ISO 639-3 code: aig
alternative label: Antigua and Barbuda Creole English
alternative label: Creole English, Antigua and Barbuda
definition: Leeward Caribbean Creole English, also known by the names of the various islands on which it is spoken (Antiguan Creole, Saint Kitts Creole, etc.) is an English-based creole language spoken in the Leeward Islands of the Caribbean, namely the countries of Antigua and Barbuda, Montserrat and Saint Kitts and Nevis.
in scheme: Lexvo - ISO 639-3 language codes
notation: aig

Ai-Cham
type: Language
type: Concept
ISO 639-3 code: aih
alternative label: Ai-Cham language
definition: Ai-Cham (autonym: ʔai3 ȶam1; ) is a language spoken mainly in Diwo and Boyao Townships, Jialiang District, Libo County, Qiannan Prefecture, Guizhou, China. Alternative names for the language are Jiamuhua, Jinhua and Atsam. Fang-Kuei Li first distinguished the language in 1943. Nearby languages include Bouyei and Mak.
in scheme: Lexvo - ISO 639-3 language codes
notation: aih
preferred label: Ai-cham @fr

Assyrian Neo-Aramaic
type: Language
type: Concept
ISO 639-3 code: aii
alternative label: Neo-Aramaic, Assyrian
definition: Assyrian Neo-Aramaic (also known as Assyrian, Aisorski, Assyrianci, Assyriski, Lishana Aturaya, Neo-Syriac, Sooreth, Suret, Sureth, or Suryaya Swadaya) is a Neo-Aramaic dialect, spoken by an estimated 220,000 people (1994 SIL estimate), formerly in the area between Lake Urmia, north-western Iran, and Siirt, south-eastern Turkey, but now more widely throughout the Assyrian–Chaldean–Syriac diaspora. Ethnologue estimates that as of the mid 1990s, about 80,000 speakers lived in the Assyrian homeland in the Middle East, while the majority of speakers lived abroad, most of them in the United States or in Europe. Most speakers are members of the Assyrian Church of the East and the Ancient Church of the East. Assyrian Neo-Aramaic is to a considerable extent mutually intelligible with Chaldean Neo-Aramaic and to a lesser extent with Turoyo.
in scheme: Lexvo - ISO 639-3 language codes
notation: aii
preferred label: Assyrisch-Neuaramäische Sprache @de
preferred label: Neoarameo asirio @es

Lishanid Noshan
type: Language
type: Concept
ISO 639-3 code: aij
definition: Lishanid Noshan is a modern Jewish Aramaic language, often called Neo-Aramaic or Judeo-Aramaic. It was originally spoken in southern and eastern Iraq, in the region of Arbil. Most speakers now live in Israel. Lishanid Noshan means the language of our selves; speakers often also call it Lishana Didan, which means our language. However, as similar names are used by most of the dialects of Jewish Neo-Aramaic, scholarly sources tend to call it Arbil Jewish Neo-Aramaic. Other popular names for the language are Hulaula, Jewish, Galigalu, mine-yours (noting the difference in grammar from other dialects), and Kurdit, Kurdish'.
in scheme: Lexvo - ISO 639-3 language codes
notation: aij

Ake
type: Language
type: Concept
ISO 639-3 code: aik
in scheme: Lexvo - ISO 639-3 language codes
notation: aik

Aimele
type: Language
type: Concept
ISO 639-3 code: ail
in scheme: Lexvo - ISO 639-3 language codes
notation: ail

Aimol
type: Language
type: Concept
ISO 639-3 code: aim
in scheme: Lexvo - ISO 639-3 language codes
notation: aim

Ainu
type: Language
type: Concept
ISO 639-2 Bibliographical code: ain
ISO 639-2 Terminological code: ain
ISO 639-3 code: ain
alternative label: Ainu (Japan)
alternative label: Ainu language
alternative label: Ainu-Sprache @de
alternative label: Aïnou @fr
alternative label: Idioma ainu @es
alternative label: Lingua ainu @it
alternative label: Língua ainu @pt
definition: Ainu (Ainu: , Aynu itak; Japanese: Ainu-go; Cyrillic: ) is one of the Ainu languages, spoken by members of the Ainu ethnic group on the northern Japanese island of Hokkaidō.
in scheme: Lexvo - ISO 639-3 language codes
notation: ain
preferred label: ainu @es
preferred label: aïnou @fr

Wom
type: Language
type: Concept
ISO 639-3 code: wom
alternative label: Wom (Nigeria)
alternative label: Wom language
definition: Wom, or Perema, is a Leko language of Nigeria.
in scheme: Lexvo - ISO 639-3 language codes
notation: wom

Aiton
type: Language
type: Concept
ISO 639-3 code: aio
in scheme: Lexvo - ISO 639-3 language codes
notation: aio

Burumakok
type: Language
type: Concept
ISO 639-3 code: aip
in scheme: Lexvo - ISO 639-3 language codes
notation: aip

Aimaq
type: Language
type: Concept
ISO 639-3 code: aiq
alternative label: Aimaq dialect
definition: Aimaq is a dialect of the Persian language spoken west of the Hazarajat (or Hazarastan), in central northwest Afghanistan, eastern Iran, and Tajikistan. It is the dominant dialect of Persian spoken by the Aymāq people. It is very close to Khorasani and Dari dialects. The Aimaq people are thought to have a 5-15% literacy rate.
in scheme: Lexvo - ISO 639-3 language codes
notation: aiq

Airoran
type: Language
type: Concept
ISO 639-3 code: air
alternative label: Airoran language
definition: Airoran is a language of Indonesia, spoken in the north coast area on the lower Apauwer River of Papua (Irian Jaya), in the villages of Subu, Motobiak, Isirania, etc. It is rather divergent from other Kwerba languages, though clearly related.
in scheme: Lexvo - ISO 639-3 language codes
notation: air

Nataoran Amis
type: Language
type: Concept
ISO 639-3 code: ais
alternative label: Amis, Nataoran
alternative label: Nataoran language
definition: Nataoran is one of the Formosan languages of the Amis and Sakizaya, indigenous tribal peoples living along the east coast of Taiwan. The Sakizaya variety is highly divergent, and sometimes considered a separate language from Nataoran, but in recent years both have begun to converge with Central Amis, which is culturally dominant.
in scheme: Lexvo - ISO 639-3 language codes
notation: ais

Arikem
type: Language
type: Concept
ISO 639-3 code: ait
in scheme: Lexvo - ISO 639-3 language codes
notation: ait

Aari
type: Language
type: Concept
ISO 639-3 code: aiw
alternative label: Aari language
definition: Aari (also spelled Ari, Ara, Aro, Aarai) is an Omotic language of Ethiopia. The speakers of this language have been known as Shankilla (or Shanqella), a name which is considered derogatory. According to the 2007 census, over 285,000 people speak Aari as a mother tongue.
in scheme: Lexvo - ISO 639-3 language codes
notation: aiw
preferred label: Idioma arí @es

Aighon
type: Language
type: Concept
ISO 639-3 code: aix
alternative label: Aigon language
definition: Aigon is an Austronesian language spoken by about 2000 individuals between the Avio and Amgen rivers in West New Britain Province, Papua New Guinea on the island of New Britain.
in scheme: Lexvo - ISO 639-3 language codes
notation: aix

Ali
type: Language
type: Concept
ISO 639-3 code: aiy
alternative label: Ali language
definition: Ali is a Ubangian language of the southwestern Central African Republic.
in scheme: Lexvo - ISO 639-3 language codes
notation: aiy

Aja
type: Language
type: Concept
ISO 639-3 code: aja
alternative label: Aja (Sudan)
alternative label: Aja language
definition: Aja is a Central Sudanic language spoken in the southern South Sudanese province of Bahr el Ghazal and along the South Sudanese border in the Central African Republic. Although the Aja are ethnically Kresh, their language is unintelligible to other Kresh languages. It is largely Banda in vocabulary, though it remains Kresh in structure. Most members of the tribe are bilingual in Kresh. Alternate spellings are Adja and Ajja.
in scheme: Lexvo - ISO 639-3 language codes
notation: aja

Aja
type: Language
type: Concept
ISO 639-3 code: ajg
alternative label: Aja (Benin)
alternative label: Aja language
definition: The Aja language is a Gbe language of the Niger–Congo language spoken by the Aja people; and it is closely related to other Gbe languages such as Ewe, Mina, Fon, and Phla Phera.
in scheme: Lexvo - ISO 639-3 language codes
notation: ajg
preferred label: Aja-gbe @fr

Ajië
type: Language
type: Concept
ISO 639-3 code: aji
alternative label: Ajië language
definition: Ajië (also known as Houailou, Wailu, Wai, Anjie, and A'jie) is an Oceanic language spoken in New Caledonia. It has approximately 4,000 speakers.
in scheme: Lexvo - ISO 639-3 language codes
notation: aji

Wongo
type: Language
type: Concept
ISO 639-3 code: won
in scheme: Lexvo - ISO 639-3 language codes
notation: won

Andajin
type: Language
type: Concept
ISO 639-3 code: ajn
in scheme: Lexvo - ISO 639-3 language codes
notation: ajn

South Levantine Arabic
type: Language
type: Concept
ISO 639-3 code: ajp
alternative label: Arabic, South Levantine
in scheme: Lexvo - ISO 639-3 language codes
notation: ajp

Judeo-Tunisian Arabic
type: Language
type: Concept
ISO 639-3 code: ajt
alternative label: Arabic, Judeo-Tunisian
definition: Judeo-Tunisian Arabic is a variety of Arabic spoken by Jews living or formerly living in Tunisia. 99% of all speakers now live in Israel. Speakers are older adults and the younger generation has only a passive knowledge of the language.
in scheme: Lexvo - ISO 639-3 language codes
notation: ajt
preferred label: Judéo-tunisien @fr

Judeo-Moroccan
type: Language
type: Concept
ISO 639-3 code: aju
alternative label: Arabic, Judeo-Moroccan
alternative label: Judeo-Moroccan Arabic
definition: Judeo-Moroccan Arabic is a variety of Arabic spoken by Jews living or formerly living in Morocco. The vast majority of all current speakers now live in France and Israel. The few speakers remaining in Morocco are usually older adults.
in scheme: Lexvo - ISO 639-3 language codes
notation: aju

Ajawa
type: Language
type: Concept
ISO 639-3 code: ajw
alternative label: Ajawa language
definition: Ajawa is an extinct Afro-Asiatic language formerly spoken in Bauchi State, Nigeria. Ajawa became extinct between 1920 and 1940 as speakers switched to Hausa.
in scheme: Lexvo - ISO 639-3 language codes
notation: ajw

Amri Karbi
type: Language
type: Concept
ISO 639-3 code: ajz
alternative label: Amri language
alternative label: Karbi, Amri
definition: Amri, or Amri Karbi, is spoken by the Karbi people of Assam and Meghalaya. Roman Script is used for institutional practice but it is seen, in various published megagines, that the authors use both Roman Script and Assamese script . Sociolinguistically, it's a variety of the Karbi language, though it is not mutually intelligible, and indeed may not be a single language itself.
in scheme: Lexvo - ISO 639-3 language codes
notation: ajz

Akan
type: Language
type: Concept
ISO 639-1 code: ak
ISO 639-2 Bibliographical code: aka
ISO 639-2 Terminological code: aka
ISO 639-3 code: aka
alternative label: Akan language
alternative label: Akan-Sprachen @de
alternative label: Idioma acano @es
alternative label: Lingua akan @it
alternative label: Língua akan @pt
definition: Akan, also known as Twi and Fante, is an Akan language that is the principal native language of Ghana, spoken over much of the southern half of that country, by about 52% of the population, and to a lesser extent across the border in eastern Côte d'Ivoire. Three dialects have been developed as literary standards with distinct orthographies, Asante, Akuapem (together called Twi), and Fante, which despite being mutually intelligible were inaccessible in written form to speakers of the other standards. In 1978 the Akan Orthography Committee established a common orthography for all of Akan, which is used as the medium of instruction in primary school by speakers of several other Akan languages such as Anyi, Sefwi, Ahanta as well as the Guang languages.
in scheme: Lexvo - ISO 639-3 language codes
notation: aka
preferred label: akan @es

Manombai
type: Language
type: Concept
ISO 639-3 code: woo
in scheme: Lexvo - ISO 639-3 language codes
notation: woo

Batak Angkola
type: Language
type: Concept
ISO 639-3 code: akb
in scheme: Lexvo - ISO 639-3 language codes
notation: akb

Mpur
type: Language
type: Concept
ISO 639-3 code: akc
alternative label: Amberbaken language
definition: Amberbaken, also known as Mpur, Kebar, Ekware, and Dekwambre, is a divergent language of New Guinea. It is not closely related to any other language, and though Ross (2005) tentatively assigned it to the West Papuan languages, based on similarities in pronouns, Ethnologue (2009) removed it as a language isolate.
in scheme: Lexvo - ISO 639-3 language codes
notation: akc

Ukpet-Ehom
type: Language
type: Concept
ISO 639-3 code: akd
alternative label: Akpet language
definition: Akpet, also known as Ukpet-Ehom or Akpet-Ehom, is a dialect cluster of the Upper Cross River languages of Nigeria. The varieties are Ukpet (Akpet) and Ehom (Ubeteng, Ebeteng).
in scheme: Lexvo - ISO 639-3 language codes
notation: akd

Akawaio
type: Language
type: Concept
ISO 639-3 code: ake
alternative label: Akawaio language
definition: Akawaio is a Cariban language spoken mainly in Guyana, most commonly in the region of the Upper Mazaruni. Though many speakers don't live in villages, there are a number of population centers, notably Kamarang, Jawalla, Waramadong, and Kako. Some 6,000 people speak Akawaio. It is also spoken to a lesser extent in Venezuela.
in scheme: Lexvo - ISO 639-3 language codes
notation: ake
preferred label: Idioma akawayo @es

Akpa
type: Language
type: Concept
ISO 639-3 code: akf
in scheme: Lexvo - ISO 639-3 language codes
notation: akf

Anakalangu
type: Language
type: Concept
ISO 639-3 code: akg
in scheme: Lexvo - ISO 639-3 language codes
notation: akg

Angal Heneng
type: Language
type: Concept
ISO 639-3 code: akh
in scheme: Lexvo - ISO 639-3 language codes
notation: akh

Woria
type: Language
type: Concept
ISO 639-3 code: wor
in scheme: Lexvo - ISO 639-3 language codes
notation: wor

Aiome
type: Language
type: Concept
ISO 639-3 code: aki
in scheme: Lexvo - ISO 639-3 language codes
notation: aki

Aka-Jeru
type: Language
type: Concept
ISO 639-3 code: akj
in scheme: Lexvo - ISO 639-3 language codes
notation: akj

Akkadian
type: Language
type: Concept
ISO 639-2 Bibliographical code: akk
ISO 639-2 Terminological code: akk
ISO 639-3 code: akk
alternative label: Akkadian language
alternative label: Akkadische Sprache @de
alternative label: Idioma acadio @es
alternative label: Lingua accadica @it
alternative label: Língua acádia @pt
alternative label: akkadien @fr
definition: Akkadian (lišānum akkadītum, 𒀝𒂵𒌈 ak.kADû) (also Accadian, Assyro-Babylonian ) is an extinct Semitic language (part of the greater Afroasiatic language family) that was spoken in ancient Mesopotamia. The earliest attested Semitic language, it used the cuneiform writing system derived ultimately from ancient Sumerian, an unrelated language isolate. The name of the language is derived from the city of Akkad, a major center of Mesopotamian civilization.
in scheme: Lexvo - ISO 639-3 language codes
notation: akk
preferred label: Akkadien @fr
preferred label: Akkadisch @de
preferred label: acadiano @pt
preferred label: acadio @es
preferred label: accado @it

Aklanon
type: Language
type: Concept
ISO 639-3 code: akl
in scheme: Lexvo - ISO 639-3 language codes
notation: akl

Aka-Bo
type: Language
type: Concept
ISO 639-3 code: akm
alternative label: Aka-Bo language
definition: The Bo language, Aka-Bo (also known as Ba), is an extinct Great Andamanese language, of the Northern group. It was spoken on the west central coast of North Andaman and on North Reef Island of the Andaman Islands in India. The Aka- at the beginning of the language name is a common Great Andamanese prefix for words related to the tongue, which includes language.
in scheme: Lexvo - ISO 639-3 language codes
notation: akm
preferred label: Aka-bo @fr
preferred label: Língua aka-bo @pt

Akurio
type: Language
type: Concept
ISO 639-3 code: ako
in scheme: Lexvo - ISO 639-3 language codes
notation: ako

Siwu
type: Language
type: Concept
ISO 639-3 code: akp
alternative label: Siwu language
definition: Siwu is spoken in the mountainous central part of the Volta Region of Ghana. It belongs to the geographic group of Ghana Togo Mountain languages (traditionally called the Togorestsprachen or Togo Remnant languages) of the Kwa branch of Niger–Congo. The speakers of Siwu call themselves the Mawu and their land Kawu.
in scheme: Lexvo - ISO 639-3 language codes
notation: akp

Hanga Hundi
type: Language
type: Concept
ISO 639-3 code: wos
alternative label: Kwasengen language
definition: Kwasengen, also known as Hanga Hundi, is one of the Ndu languages of Sepik River region of northern Papua New Guinea.
in scheme: Lexvo - ISO 639-3 language codes
notation: wos

Ak
type: Language
type: Concept
ISO 639-3 code: akq
in scheme: Lexvo - ISO 639-3 language codes
notation: akq

Araki
type: Language
type: Concept
ISO 639-3 code: akr
alternative label: Araki language
definition: Araki is a nearly extinct language spoken in the small island of Araki (locally known as ), south of Espiritu Santo Island in Vanuatu. Araki is gradually being replaced by Tangoa, a language from a neighbouring island.
in scheme: Lexvo - ISO 639-3 language codes
notation: akr
preferred label: Idioma Araki @es

Akaselem
type: Language
type: Concept
ISO 639-3 code: aks
in scheme: Lexvo - ISO 639-3 language codes
notation: aks

Akolet
type: Language
type: Concept
ISO 639-3 code: akt
in scheme: Lexvo - ISO 639-3 language codes
notation: akt

Akum
type: Language
type: Concept
ISO 639-3 code: aku
in scheme: Lexvo - ISO 639-3 language codes
notation: aku

Akhvakh
type: Language
type: Concept
ISO 639-3 code: akv
alternative label: Akhvakh language
definition: The Akhvakh language (alternatively spelled Akhwakh) is a Northeast Caucasian language from the Avar–Andic branch. Ethnologue lists 6500 speakers, but Magomedova and Abulaeva (2007) list 20,000 speakers of the language. Akhvakh has several dialects, though sources do not agree on the number. Ethnologue lists Kaxib, Northern Akhvakh and Southern Akhvakh (which can be further subdivided into the Tlyanub and Tsegob subdialects ). Creissels (2010) lists Northern Akhvakh and three dialects of Southern Akhvakh (Cegob, Tljanub, and Ratlub).
in scheme: Lexvo - ISO 639-3 language codes
notation: akv
preferred label: Lingua akhvakh @it
preferred label: Língua akhvakh @pt

Akwa
type: Language
type: Concept
ISO 639-3 code: akw
in scheme: Lexvo - ISO 639-3 language codes
notation: akw

Aka-Kede
type: Language
type: Concept
ISO 639-3 code: akx
alternative label: Aka-Kede language
definition: The Kede language, Aka-Kede, is an extinct Great Andamanese language, of the Northern group. It was spoken in the Northern section of Middle Andaman island (Justin 2000).
in scheme: Lexvo - ISO 639-3 language codes
notation: akx

Aka-Kol
type: Language
type: Concept
ISO 639-3 code: aky
alternative label: Aka-Kol language
definition: The Kol language, Aka-Kol, is an extinct Great Andamanese language, of the Central group. It was spoken in the southeast section of Middle Andaman.
in scheme: Lexvo - ISO 639-3 language codes
notation: aky

Alabama
type: Language
type: Concept
ISO 639-3 code: akz
alternative label: Alabama language
definition: Alabama (also known as Alibamu) is a Native American language, spoken by the Alabama-Coushatta tribe of Texas. It was once spoken by the Alabama-Quassarte Tribal Town of Oklahoma, but there are no more Alabama speakers in Oklahoma. It is a Muskogean language, and is believed to have been related to the Muklasa and Tuskegee languages, which are no longer extant. Alabama is closely related to Koasati and Apalachee, and more distantly to other Muskogean languages like Hitchiti, Chickasaw and Choctaw.
in scheme: Lexvo - ISO 639-3 language codes
notation: akz
preferred label: Idioma alabama @es

Alago
type: Language
type: Concept
ISO 639-3 code: ala
in scheme: Lexvo - ISO 639-3 language codes
notation: ala

Wawonii
type: Language
type: Concept
ISO 639-3 code: wow
in scheme: Lexvo - ISO 639-3 language codes
notation: wow

Qawasqar
type: Language
type: Concept
ISO 639-3 code: alc
alternative label: Kawésqar language
definition: Kawésqar (also known as Qawasqar [ISO 639-3], Alacaluf, Halakwulup, Kaweskar, Alakaluf, Kawaskar, Kawesqar, Qawashqar, Halakwalip, Hekaine, Kaueskar, Aksana, Aksanás) is an Alacalufan language spoken in southern Chile by the Kawésqar people. Originally there were several distinct dialects. Kakauhua is sometimes listed as a dialect, but is usually listed as a separate language, as in ISO 639-3 and Ethnologue. The language family containing these two languages is known as Alacalufan. Only about 20 speakers remain, half of them on Wellington Island, off the southwestern coast of Chile.
in scheme: Lexvo - ISO 639-3 language codes
notation: alc
preferred label: Idioma kawésqar @es
preferred label: Kawésqar @fr
preferred label: Língua kawésqar @pt

Alladian
type: Language
type: Concept
ISO 639-3 code: ald
in scheme: Lexvo - ISO 639-3 language codes
notation: ald

Aleut
type: Language
type: Concept
ISO 639-2 Bibliographical code: ale
ISO 639-2 Terminological code: ale
ISO 639-3 code: ale
alternative label: Aleut language
alternative label: Aleutische Sprache @de
alternative label: Aléoute @fr
alternative label: Idioma aleutiano @es
alternative label: Lingua aleutina @it
alternative label: Língua aleúte @pt
definition: Aleut (Unangam Tunuu) is a language of the Eskimo–Aleut language family. It is the heritage language of the Aleut people living in the Aleutian Islands, Pribilof Islands, and Commander Islands. As of 2007 there were about 150 speakers of Aleut (Krauss 2007, p. 408).
in scheme: Lexvo - ISO 639-3 language codes
notation: ale
preferred label: Aleutisch @de
preferred label: aleutiano @es
preferred label: aleuto @it
preferred label: aleúte @pt
preferred label: aléoute @fr

Alege
type: Language
type: Concept
ISO 639-3 code: alf
in scheme: Lexvo - ISO 639-3 language codes
notation: alf

Alawa
type: Language
type: Concept
ISO 639-3 code: alh
alternative label: Alawa Language
definition: Alawa is an Indigenous Australian language spoken by the Alawa people of the Northern Territory. In 1991, it had 18 remaining speakers and 4 semi-speakers.
in scheme: Lexvo - ISO 639-3 language codes
notation: alh

Amaimon
type: Language
type: Concept
ISO 639-3 code: ali
alternative label: Amaimon language
definition: Amaimon is a Papuan language spoken by 1,781 people in Madang Province, Papua New Guinea.
in scheme: Lexvo - ISO 639-3 language codes
notation: ali

Alangan
type: Language
type: Concept
ISO 639-3 code: alj
alternative label: Alangan language
definition: The Alangan language is a language spoken by Mangyans in the province of Mindoro in the Philippines.
in scheme: Lexvo - ISO 639-3 language codes
notation: alj

Weyto
type: Language
type: Concept
ISO 639-3 code: woy
alternative label: Weyto language
definition: The Weyto language is believed to be an extinct language formerly spoken in the Lake Tana region of Ethiopia by the Weyto, a small group of hippopotamus hunters who now speak Amharic.
in scheme: Lexvo - ISO 639-3 language codes
notation: woy

Alak
type: Language
type: Concept
ISO 639-3 code: alk
alternative label: Alak language
definition: Alak is a language spoken by some 4,000 people in southern Laos, especially in the Provinces of Salavan and Sekong (where the Alak people make up over a fifth of the population). It is closely related to the language spoken by the Bahnars of Vietnam.
in scheme: Lexvo - ISO 639-3 language codes
notation: alk

Allar
type: Language
type: Concept
ISO 639-3 code: all
alternative label: Allar language
definition: Allar is a Dravidian language spoken in India.
in scheme: Lexvo - ISO 639-3 language codes
notation: all

Amblong
type: Language
type: Concept
ISO 639-3 code: alm
in scheme: Lexvo - ISO 639-3 language codes
notation: alm

Gheg Albanian
type: Language
type: Concept
ISO 639-3 code: aln
alternative label: Albanian, Gheg
definition: Gheg (or Geg) is one of the two major varieties of Albanian. The other one is Tosk, on which standard Albanian is based. The dividing line between these two varieties is the Shkumbin River, which winds its way through central Albania.
in scheme: Lexvo - ISO 639-3 language codes
notation: aln
preferred label: Albanés guego @es
preferred label: Gegisch @de
preferred label: Ghego @it
preferred label: Guègue @fr

Larike-Wakasihu
type: Language
type: Concept
ISO 639-3 code: alo
in scheme: Lexvo - ISO 639-3 language codes
notation: alo

Alune
type: Language
type: Concept
ISO 639-3 code: alp
in scheme: Lexvo - ISO 639-3 language codes
notation: alp

Algonquin
type: Language
type: Concept
ISO 639-3 code: alq
alternative label: Algonquin language
definition: :For the larger language family of which Algonquin is but one member, see Algonquian languages.
in scheme: Lexvo - ISO 639-3 language codes
notation: alq
preferred label: Língua algonquina @pt

Alutor
type: Language
type: Concept
ISO 639-3 code: alr
alternative label: Alyutor language
definition: Alyutor or Alutor is a language of Russia that belongs to the Chukotkan branch of the Chukotko-Kamchatkan languages.
in scheme: Lexvo - ISO 639-3 language codes
notation: alr
preferred label: Alioutor @fr
preferred label: Língua alutor @pt

Tosk Albanian
type: Language
type: Concept
ISO 639-3 code: als
alternative label: Albanian, Tosk
definition: Tosk is the southern dialect of the Albanian language. The line of demarcation between Tosk and Gheg (the northern dialect) is the Shkumbin River. Tosk is the basis of the standard Albanian language.
in scheme: Lexvo - ISO 639-3 language codes
notation: als
preferred label: Albanés tosco @es
preferred label: Tosco @it
preferred label: Toskisch @de
preferred label: Tosque @fr

Southern Altai
type: Language
type: Concept
ISO 639-2 Bibliographical code: alt
ISO 639-2 Terminological code: alt
ISO 639-3 code: alt
alternative label: Altai, Southern
alternative label: Southern Altai language
alternative label: altai du Sud @fr
definition: Southern Altai (also known as Oirot, Oyrot, Altai) is a Turkic language spoken in the Gorno-Altai Ao mountains of Russia on the border of Mongolia and the People's Republic of China. There is no mutual intelligibility with Northern Altai. Written Altai is based on Southern Altai, but is rejected by Northern Altai children. Dialects include Altai Proper and Talangit.
in scheme: Lexvo - ISO 639-3 language codes
notation: alt
preferred label: Süd-Altaisch @de
preferred label: altai do sul @pt
preferred label: altai meridionale @it
preferred label: altaï du Sud @fr
preferred label: altái meridional @es

'Are'are
type: Language
type: Concept
ISO 639-3 code: alu
alternative label: 'Are'are language
definition: The Areare language is a language that is spoken by the Areare people, who live mainly on the Solomon Islands. It is spoken by 17,800, which makes them the second largest language in the Solomons after the Kwara'ae (also from Malaita). According to Ethnologue, the literacy rate is somewhere between 30-60%.
in scheme: Lexvo - ISO 639-3 language codes
notation: alu
preferred label: 'are'are @fr
preferred label: ʻAreʻare @de

Maco
type: Language
type: Concept
ISO 639-3 code: wpc
alternative label: Wirö dialect
definition: Wirö (also called Itoto, Wotuja, Jojod, or various forms of Maku) is an indigenous language of Colombia and Venezuela. It is attested only by a list of 38 words collected ca. 1900, but this is enough to show it is a dialect of Piaroa, or at least a closely related language.
in scheme: Lexvo - ISO 639-3 language codes
notation: wpc
preferred label: Idioma maku @es

Wanbasana
type: Language
type: Concept
ISO 639-3 code: alw
alternative label: Alaba-K'abeena language
alternative label: Alaba-K’abeena
definition: Alaba-Kabeena (also known as Alaba, Allaaba, Halaba) is an Afro-Asiatic language spoken in Ethiopia in the Great Rift Valley southwest of Lake Shala. The literacy rate of native speakers in their language is below 1%, while their literacy rate in second languages is 8.6%; Alaba-Kabeena is taught in primary schools. It has an 81% lexical similarity with Kambaata. However Fleming (1976) classifies K'abeena (also transliterated "Qebena") as a dialect of Kambaata. The 2007 census in Ethiopia lists Alaba and Qebena as separate languages.
in scheme: Lexvo - ISO 639-3 language codes
notation: alw

Amol
type: Language
type: Concept
ISO 639-3 code: alx
in scheme: Lexvo - ISO 639-3 language codes
notation: alx

Alyawarr
type: Language
type: Concept
ISO 639-3 code: aly
in scheme: Lexvo - ISO 639-3 language codes
notation: aly

Alur
type: Language
type: Concept
ISO 639-3 code: alz
alternative label: Alur language
definition: Alur is spoken in northwestern Uganda and northeastern Democratic Republic of the Congo by the Alur people.
in scheme: Lexvo - ISO 639-3 language codes
notation: alz
preferred label: Língua alur @pt

Amanayé
type: Language
type: Concept
ISO 639-3 code: ama
alternative label: Amanayé language
definition: Amanayé is a possibly extinct Tupi language last spoken in the São Domingos do Capim Municipality on the Capim River in Brazil.
in scheme: Lexvo - ISO 639-3 language codes
notation: ama

Ambo
type: Language
type: Concept
ISO 639-3 code: amb
in scheme: Lexvo - ISO 639-3 language codes
notation: amb

Amahuaca
type: Language
type: Concept
ISO 639-3 code: amc
alternative label: Amahuaca language
definition: Amahuaca is an indigenous American Panoan-family language spoken by several dozen people in the Amazon Basin in Perú but up to 130 and also in Brazil by 220 people. It is also known as Amawaka, Amaguaco, Ameuhaque, Ipitineri, and Sayaco. The most closely related languages are Cashinahua and Shipibo. It is an official language. There are 20 monolinguals. 30% are literate and 50% are literate in Spanish. Amahuaca uses a Latin based script. Schools are bilingual, but the language has a negative connotation. A dictionary has been developed along with grammar rules and bible portions.
in scheme: Lexvo - ISO 639-3 language codes
notation: amc
preferred label: Idioma amahuaca @es

Yanesha'
type: Language
type: Concept
ISO 639-3 code: ame
alternative label: Yanesha' language
definition: Yanesha (; literally we the people'), also called Amuesha or Amoesha is a language spoken by the Amuesha people of Peru in central and eastern Pasco Region.
in scheme: Lexvo - ISO 639-3 language codes
notation: ame
preferred label: Yanesha @fr

Hamer-Banna
type: Language
type: Concept
ISO 639-3 code: amf
alternative label: Hamer-Banna language
definition: Hamer or Hamer-Banna is an Omotic language of the Afro-Asiatic language family. It is spoken primarily in the southern part of Ethiopia by the Hamer and Banna people.
in scheme: Lexvo - ISO 639-3 language codes
notation: amf

Amurdak
type: Language
type: Concept
ISO 639-3 code: amg
alternative label: Amurdag language
definition: Amurdag (also Amurdak, Amurag, Amarag, Wureidbug) is an Indigenous Australian language historically spoken in the Northern Territory of Australia. This is an Pama–Nyungan language that belongs to the Iwaidjan language family. According to a report by the National Geographic Society and the Living Tongues Institute for Endangered Languages, it is an endangered language. There is at least one living speaker, Charlie Mungulda, who has been working with Australian linguists, e.g. Nick Evans, Robert Handelsmann and others, over the past several decades to record his language.
in scheme: Lexvo - ISO 639-3 language codes
notation: amg

Amharic
type: Language
type: Concept
ISO 639-1 code: am
ISO 639-2 Bibliographical code: amh
ISO 639-2 Terminological code: amh
ISO 639-3 code: amh
in scheme: Lexvo - ISO 639-3 language codes
notation: amh
preferred label: Amharisch @de
preferred label: amarico @it
preferred label: amharique @fr
preferred label: amárico @es

Amis
type: Language
type: Concept
ISO 639-3 code: ami
alternative label: Amis language
definition: Amis is the Formosan language of the Amis Ami, an indigenous tribal people living along the east coast of Taiwan (see Taiwanese aborigines). It is spoken from Hualien in the north to Taitung in the south, with another population near the southern end of the island, though the northern varieties are sometimes considered a separate language.
in scheme: Lexvo - ISO 639-3 language codes
notation: ami
preferred label: Amisisch @de
preferred label: Língua amis @pt

Warapu
type: Language
type: Concept
ISO 639-3 code: wra
alternative label: Barupu language
definition: Barupu (Warapu) is a language spoken in Papua New Guinea.
in scheme: Lexvo - ISO 639-3 language codes
notation: wra

Amdang
type: Language
type: Concept
ISO 639-3 code: amj
alternative label: Amdang language
definition: Amdang Biltine (autonym: sìmí amdangtí) is a language closely related to Fur spoken in Chad by about 5,000 people , while Ethnologue places the number in 2000 at 41,000. It is mainly spoken in Chad north of Biltine, and sporadically elsewhere in Ouaddaï. There are also small colonies of speakers in Darfur near Woda'a and Fafa, and in Kordofan in the Abu Daza district and at Magrur north of Bara. Most of the ethnic group now speaks Arabic. It is also termed Mimi, Mima, or Biltine. (The term "Mimi" is also applied, however, to several other languages of the area).
in scheme: Lexvo - ISO 639-3 language codes
notation: amj
preferred label: Idioma amdang @es

Ambai
type: Language
type: Concept
ISO 639-3 code: amk
alternative label: Ambai language
definition: The Ambai language is an Austronesian language spoken in Indonesian New Guinea (Papua Province), mostly on the Ambai Islands as well as the southern part of Yapen Island. The number of speakers is estimated between 7,500 – 10,000.
in scheme: Lexvo - ISO 639-3 language codes
notation: amk

War
type: Language
type: Concept
ISO 639-3 code: aml
alternative label: War language
alternative label: War-Jaintia
definition: War (also spelled Waar), War-Jaintia or Amwi is an Austro-Asiatic language spoken by about 16,000 people in Bangladesh and 12,000 people in India.
in scheme: Lexvo - ISO 639-3 language codes
notation: aml

Ama
type: Language
type: Concept
ISO 639-3 code: amm
alternative label: Ama (Papua New Guinea)
alternative label: Ama language
definition: Ama (Sawiyanu) is a Left May language of New Guinea, in East Sepik Province. Former dialects have merged.
in scheme: Lexvo - ISO 639-3 language codes
notation: amm

Amanab
type: Language
type: Concept
ISO 639-3 code: amn
alternative label: Amanab language
definition: Amanab is a Papuan language spoken by 4,419 people in Amanab District, Sandaun Province, Papua New Guinea.
in scheme: Lexvo - ISO 639-3 language codes
notation: amn

Amo
type: Language
type: Concept
ISO 639-3 code: amo
alternative label: Amo language
definition: Amo (Among), or Map (Timap), is a divergent Kainji language of Nigeria.
in scheme: Lexvo - ISO 639-3 language codes
notation: amo

Alamblak
type: Language
type: Concept
ISO 639-3 code: amp
alternative label: Alamblak language
definition: The Alamblak language is spoken in the Angoram District of East Sepik Province, Papua New Guinea. According to , there are 9 villages with 900 speakers on the Middle Karawari and Wagupmeri rivers, and there is another dialect of 400 speakers in 4 villages near Kuvanmas Lake.
in scheme: Lexvo - ISO 639-3 language codes
notation: amp

Amahai
type: Language
type: Concept
ISO 639-3 code: amq
in scheme: Lexvo - ISO 639-3 language codes
notation: amq

Amarakaeri
type: Language
type: Concept
ISO 639-3 code: amr
alternative label: Amarakaeri language
definition: Amarakaeri is an indigenous American language of the Harakmbet language family spoken in Perú along the Madre de Dios and Colorado rivers. There is less than 1% literacy compared to 5 to 15% literacy in second language Spanish. There is one dialect called Kisambaeri. It is an official language and has a dictionary. Amarakaeri speakers include the Kochimberi, Küpondirideri, Wíntaperi, Wakitaneri, and Kareneri gold panning tribes. There is a common misconception is that Amarakaeri is an Arawakan language. Alternate names include Amarakaire, Amaracaire, and Mashco; the latter of which is considered a pejorative term.
in scheme: Lexvo - ISO 639-3 language codes
notation: amr
preferred label: Língua amarakaeri @pt

Southern Amami-Oshima
type: Language
type: Concept
ISO 639-3 code: ams
alternative label: Amami-Oshima, Southern
in scheme: Lexvo - ISO 639-3 language codes
notation: ams

Amto
type: Language
type: Concept
ISO 639-3 code: amt
alternative label: Amto language
definition: Amto (also known as Ki) is an Amto–Musan language spoken in Sandaun Province of Papua New Guinea in the Amanab and Rocky Peak Districts, south of the Upper Sepik River, toward the headwaters of the Left May River on the Samaia River. There are two villages, Amto and Habiyon.
in scheme: Lexvo - ISO 639-3 language codes
notation: amt
preferred label: Idioma amto @es

Warluwara
type: Language
type: Concept
ISO 639-3 code: wrb
alternative label: Warluwara language
definition: Warluwara is a moribund Australian Aboriginal language of Queensland.
in scheme: Lexvo - ISO 639-3 language codes
notation: wrb

Guerrero Amuzgo
type: Language
type: Concept
ISO 639-3 code: amu
alternative label: Amuzgo, Guerrero
alternative label: Guerrero Amuzgo language
definition: The Amuzgo Guerrero language is an Amuzgo language spoken in southwest Guerrero state in Mexico.
in scheme: Lexvo - ISO 639-3 language codes
notation: amu

Ambelau
type: Language
type: Concept
ISO 639-3 code: amv
alternative label: Ambelau language
definition: Ambelau is an Austronesian language; as of 1989, it was spoken by about 5,700 Ambelau people, of whom more than 5,000 lived on the Indonesian island Ambelau and most others in the village Wae Tawa of the nearby island Buru . is the southern dialect of Buru language, Masarete. The preservation of the language was also unaffected by the fact that Ambelau people compose only half of the Ambelau island population, and the communication with the Bugis and Javanese people composing the other half usually occurs in the official language of the country, Indonesian. Ambelau language has no dialects; so the Ambelau community on Buru island speaks identical language to that used on Ambelau. The language has no writing system.
in scheme: Lexvo - ISO 639-3 language codes
notation: amv

Western Neo-Aramaic
type: Language
type: Concept
ISO 639-3 code: amw
alternative label: Neo-Aramaic, Western
definition: Western Neo-Aramaic is a modern Aramaic language. Today, it is spoken in three villages in the Anti-Lebanon mountains of western Syria. Western Neo-Aramaic is the only modern living Aramaic language (neo-Aramaic) drawn from the branch of Western Aramaic languages. All other modern living Aramaic languages are of the Eastern Aramaic languages.
in scheme: Lexvo - ISO 639-3 language codes
notation: amw
preferred label: Neuwestaramäische Sprache @de
preferred label: Néo-araméen occidental @fr

Anmatyerre
type: Language
type: Concept
ISO 639-3 code: amx
in scheme: Lexvo - ISO 639-3 language codes
notation: amx

Ami
type: Language
type: Concept
ISO 639-3 code: amy
in scheme: Lexvo - ISO 639-3 language codes
notation: amy

Atampaya
type: Language
type: Concept
ISO 639-3 code: amz
alternative label: Atampaya dialect
definition: Atampaya is an inland dialect of the Urradhi group of Paman languages on Cape York Peninsula of Queensland. Australia, and is possibly extinct. It is spoken by the Atampaya people. It forms part of a group of closely related and highly mutually intelligible dialects, these being Urradhi on the coast to the south-west, Angkamuthi to the west north of Urradhi, Utudhanamu inland north from Atampaya, Yantaykenu further north, being the language of the Bamaga area, Yadhaykenu on the east coast north of Wudhadhi, and Yaraytyana further north again. This group has no common language name, though Urradhi is commonly used as a cover name. There are a few partial speakers of Atampaya.
in scheme: Lexvo - ISO 639-3 language codes
notation: amz

Andaqui
type: Language
type: Concept
ISO 639-3 code: ana
alternative label: Andaqui language
definition: Andaqui (or: Andaki) is an extinct language from the southern highlands of Colombia. It may be one of the Paezan or Barbacoan languages, which may be related to each other.
in scheme: Lexvo - ISO 639-3 language codes
notation: ana
preferred label: Andaquí @fr
preferred label: Idioma andaquí @es

Andoa
type: Language
type: Concept
ISO 639-3 code: anb
alternative label: Andoa language
definition: Andoa is an extinct Zaparoan language of Peru. It was found in the Pastaza River region of Peru. It is also known as Shimigae/Semigae and Gae/Gay. The Andoa people have integrated into the Quechua and now speak either Pastaza Quechua or Spanish. In Ecuador there remains one fluent speaker who is attempting to teach the language to others to keep it alive. The last known speaker died in 1993.
in scheme: Lexvo - ISO 639-3 language codes
notation: anb
preferred label: Idioma andoa-shimigae @es

Angas
type: Language
type: Concept
ISO 639-3 code: anc
alternative label: ngas language
definition: Ngas is an Afro-Asiatic language spoken in Plateau State, Nigeria. Dialects are Hill Angas and Plain Angas.
in scheme: Lexvo - ISO 639-3 language codes
notation: anc
preferred label: Ngas

Ansus
type: Language
type: Concept
ISO 639-3 code: and
alternative label: Ansus language
definition: Ansus is a Austronesian language spoken in Indonesian New Guinea.
in scheme: Lexvo - ISO 639-3 language codes
notation: and

Manangkari
type: Language
type: Concept
ISO 639-3 code: znk
alternative label: Manangkari language
definition: About the language and its speakers Manangkari which is sometimes also referred to as "Naragani"(?) is an extinct Australian aboriginal language once spoken in the Cobourg Peninsula, Northern Territory. Manangkari belongs to the Iwaidjan family of languages and is closely related to Iwaidja. This is a Pama-Nyungan language.
in scheme: Lexvo - ISO 639-3 language codes
notation: znk

Xârâcùù
type: Language
type: Concept
ISO 639-3 code: ane
alternative label: Xaracuu language
definition: Xârâcùù is an Oceanic language spoken in New Caledonia. It has about 4,000 speakers.
in scheme: Lexvo - ISO 639-3 language codes
notation: ane

Warduji
type: Language
type: Concept
ISO 639-3 code: wrd
in scheme: Lexvo - ISO 639-3 language codes
notation: wrd

Animere
type: Language
type: Concept
ISO 639-3 code: anf
alternative label: Animere language
definition: Animere (sometimes Anyimere or Kunda, the latter being a toponym) is a language spoken in Ghana, in the Kecheibe and Kunda villages of the Benimbere people. It is most closely related to Kebu or Akebu of Togo. Both are Ghana Togo Mountain languages (GTM), classified as members of the Ka-Togo group by Heine (1968). Like most other GTM languages, Animere is a noun class language.
in scheme: Lexvo - ISO 639-3 language codes
notation: anf

Old English
type: Language
type: Concept
ISO 639-2 Bibliographical code: ang
ISO 639-2 Terminological code: ang
ISO 639-3 code: ang
alternative label: Altenglische Sprache @de
alternative label: Antico inglese @it
alternative label: English, Old (ca. 450-1100)
alternative label: English, Old (ca.450-1100)
alternative label: Idioma anglosajón @es
alternative label: Old English (ca. 450-1100)
alternative label: ancien anglais @fr
alternative label: anglo-saxon (ca.450-1100) @fr
alternative label: inglês arcaico @pt
definition: Old English (Ænglisc, Anglisc, Englisc) or Anglo-Saxon is an early form of the English language that was spoken and written by the Anglo-Saxons and their descendants in parts of what are now England and southern and eastern Scotland between at least the mid-5th century and the mid-12th century. What survives through writing represents primarily the literary register of Anglo-Saxon.
in scheme: Lexvo - ISO 639-3 language codes
notation: ang
preferred label: Altenglisch @de
preferred label: Inglês antigo @pt
preferred label: Vieil anglais @fr
preferred label: inglese antico @it
preferred label: inglés antiguo @es

Nend
type: Language
type: Concept
ISO 639-3 code: anh
alternative label: Nend language
definition: Nend (Nent) is a Papuan language spoken by the Angaua people of Madang Province, Papua New Guinea.
in scheme: Lexvo - ISO 639-3 language codes
notation: anh

Andi
type: Language
type: Concept
ISO 639-3 code: ani
alternative label: Andi language
definition: The Andi language is part of the Avar–Andic branch of the Northeast Caucasian languages. The Andi population was about 8,000 in 1926. In 2002 approximately 21,800 speakers were identified. There are four dialects, Munin, Rikvani, Kvanxidatl, and Gagatl, which appear quite divergent. Speakers generally use Avar or Russian as their literary language(s).
in scheme: Lexvo - ISO 639-3 language codes
notation: ani
preferred label: Andische Sprache @de
preferred label: Língua andi @pt

Anor
type: Language
type: Concept
ISO 639-3 code: anj
in scheme: Lexvo - ISO 639-3 language codes
notation: anj

Ankwé
type: Language
type: Concept
ISO 639-3 code: ank
alternative label: Goemai language
definition: Goemai is an Afro-Asiatic (Chadic, West Chadic A) language spoken in the Plateau state of Central Nigeria by approximately 200,000 people. Its speakers refer to themselves and their language as Goemai; in older linguistic, historical and ethnographical literature the term Ankwe has been used to refer to the people.
in scheme: Lexvo - ISO 639-3 language codes
notation: ank
preferred label: Goemai

Anu-Hkongso Chin
type: Language
type: Concept
ISO 639-3 code: anl
alternative label: Chin, Anu-Hkongso
in scheme: Lexvo - ISO 639-3 language codes
notation: anl

Warungu
type: Language
type: Concept
ISO 639-3 code: wrg
alternative label: Warrungu language
definition: Warrungu (or Warrangu, Warrango) is an Australian Aboriginal language, one of the dozen languages of the Maric branch of the Pama–Nyungan family. It was formerly spoken in the area around Townsville, Queensland, Australia. Its last native speaker was Alf Palmer, who died in 1981.
in scheme: Lexvo - ISO 639-3 language codes
notation: wrg

Anal
type: Language
type: Concept
ISO 639-3 code: anm
alternative label: Anal language
definition: Anal, also known as Namfau, is a Northern Kukish language, part of the Sino-Tibetan language family, spoken by a dwindling number of Anal people in India, Burma, and possibly Bangladesh. UNESCO lists Anal as having 23,000 speakers in total, making it a vulnerable language. It has two principal dialects, Laizo and Malshom, and is closest to Lamkang. The language of wider communication is Meithei.
in scheme: Lexvo - ISO 639-3 language codes
notation: anm
preferred label: Idioma anal @es

Obolo
type: Language
type: Concept
ISO 639-3 code: ann
alternative label: Obolo language
definition: Obolo, or Andoni, is a major Lower Cross River language of Nigeria.
in scheme: Lexvo - ISO 639-3 language codes
notation: ann

Andoque
type: Language
type: Concept
ISO 639-3 code: ano
alternative label: Andoque language
definition: The Andoque language is an aboriginal language spoken by a few hundred Andoque in Northern South America, and is in decline.
in scheme: Lexvo - ISO 639-3 language codes
notation: ano
preferred label: Andoke @fr
preferred label: Idioma andoque @es

Angika
type: Language
type: Concept
ISO 639-2 Bibliographical code: anp
ISO 639-2 Terminological code: anp
ISO 639-3 code: anp
alternative label: Angika language
alternative label: Idioma angika @es
definition: Angika (Dev. अङ्गिका or अंगिका) is an Indo-Iranian language of the Anga region of India, a 58,000 km² area approx. that falls within the states of Bihar, Jharkhand and West Bengal.
in scheme: Lexvo - ISO 639-3 language codes
notation: anp
preferred label: angika @es

Jarawa
type: Language
type: Concept
ISO 639-3 code: anq
alternative label: Jarawa (India)
alternative label: Jarawa language
definition: Järawa or Jarwa is an Ongan language spoken by the Jarawa people of the interior and south central Rutland Island, central interior and south interior South Andaman Island, and the west coast of Middle Andaman Island.
in scheme: Lexvo - ISO 639-3 language codes
notation: anq
preferred label: Idioma järawa @es

Andh
type: Language
type: Concept
ISO 639-3 code: anr
in scheme: Lexvo - ISO 639-3 language codes
notation: anr

Anserma
type: Language
type: Concept
ISO 639-3 code: ans
alternative label: Anserma language
definition: Anserma (Anserna) is an extinct Chocoan language of Colombia.
in scheme: Lexvo - ISO 639-3 language codes
notation: ans

Antakarinya
type: Language
type: Concept
ISO 639-3 code: ant
alternative label: Antakarinya language
definition: Antakarinya (also Andagarinya) is an Australian Aboriginal language. It is one of the Wati languages of the large Southwest branch of the Pama–Nyungan family.
in scheme: Lexvo - ISO 639-3 language codes
notation: ant
preferred label: Lingua antakarinya @it

Anuak
type: Language
type: Concept
ISO 639-3 code: anu
alternative label: Anuak language
definition: Anuak or Anywa is a Nilotic language of the Nilo-Saharan language family. It is spoken primarily in the Western part of Ethiopia by the Anuak. Other names for this language include: Anyuak, Anywa, Yambo, Jambo, Yembo, Bar, Burjin, Miroy, Moojanga, Nuro.
in scheme: Lexvo - ISO 639-3 language codes
notation: anu
preferred label: Anyua @fr

Denya
type: Language
type: Concept
ISO 639-3 code: anv
alternative label: Denya language
definition: Denya is a Bantoid language of Cameroon in the Mamfe family. The dialects are divergent enough to perhaps be considered separate languages.
in scheme: Lexvo - ISO 639-3 language codes
notation: anv

Anaang
type: Language
type: Concept
ISO 639-3 code: anw
in scheme: Lexvo - ISO 639-3 language codes
notation: anw

Wiradhuri
type: Language
type: Concept
ISO 639-3 code: wrh
alternative label: Wiradjuri language
definition: Wiradjuri (many other spellings; see Wiradjuri) is a Pama–Nyungan language of the Wiradhuric subgroup. It was the traditional language of the Wiradjuri people of Australia, but is no longer in general use. The process of reclaiming the language was greatly assisted by the publication in 2005 of A First Wiradjuri Dictionary by elder Stan Gran Senior and consultant Dr John Rudder. John Rudder described the dictionary: "The Wiradjuri Dictionary has three main sections in just over 400 B5 pages. The first two sections, English to Wiradjuri, and Wiradjuri to English, have about 5000 entries each. The third sections lists Names of Things grouped in categories such as animals, birds, plants, climate, body parts, colours. In addition to those main sections the dictionary contains an introduction to accurate pronunciation, a basic grammar of the language and a sample range of sentence types." A revised edition, holding over 8,000 words, was published in 2010 and launched in Wagga Wagga, a launch well described by the member for Riverina to the Australian Parliament. .
in scheme: Lexvo - ISO 639-3 language codes
notation: wrh

Andra-Hus
type: Language
type: Concept
ISO 639-3 code: anx
in scheme: Lexvo - ISO 639-3 language codes
notation: anx

Agni
type: Language
type: Concept
ISO 639-3 code: any
alternative label: Anyin language
definition: The Anyin language is spoken principally in Côte d'Ivoire and in Ghana. It is an Akan language member of the Kwa branch of the Niger–Congo family of languages. The closest relative of Anyin is Baoulé, and it is also close to Nzema.
in scheme: Lexvo - ISO 639-3 language codes
notation: any
preferred label: Anyin
preferred label: Língua anyin @pt

Anem
type: Language
type: Concept
ISO 639-3 code: anz
alternative label: Anêm language
definition: The Anêm language is a language isolate spoken in five main villages along the northwestern coast of New Britain island, Papua New Guinea: Malasoŋo (where it is spoken alongside Bariai), Karaiai, Mosiliki, Pudêlîŋ, Atiatu (where it is spoken alongside Lusi) and Bolo (where it is spoken alongside a version of Aria). It is also spoken by small numbers of people, mostly of Anêm descent, scattered among the surrounding villages. There are two main dialects. Akiblîk, the dialect of Bolo was near functional extinction in 1982, the youngest speaker being about 35 years of age then. The main dialect is spoken in the other villages named above. There are about 550 speakers.
in scheme: Lexvo - ISO 639-3 language codes
notation: anz
preferred label: Idioma anêm @es

Angolar
type: Language
type: Concept
ISO 639-3 code: aoa
alternative label: Angolar language
definition: Angolar, also Ngola (Lungua N'golá) is a minority language of São Tomé and Príncipe, spoken in the southernmost towns of São Tomé Island and sparsely along the coast. It is a creole language, based partially on Portuguese with a heavy substrate of a dialect of Kimbundu (port. Quimbundo), a Bantu language from inland Angola, where a number of black slaves were taken to this island. Angolan residents and tourists speaking Portuguese and Kimbundu are surprised when they hear this Creole which is almost similar to their dialect.
in scheme: Lexvo - ISO 639-3 language codes
notation: aoa
preferred label: Criollo angolar @es

Abom
type: Language
type: Concept
ISO 639-3 code: aob
alternative label: Abom language
definition: Abom is a nearly extinct language spoken in the Western Province of Papua New Guinea. According to a 2002 census, only 15 people still speak this language, all elderly.
in scheme: Lexvo - ISO 639-3 language codes
notation: aob

Pemon
type: Language
type: Concept
ISO 639-3 code: aoc
alternative label: Pemon language
definition: The Pemon language is a Native American language of the Cariban family spoken by some 30,000 Pemon people, in Venezuela's Southeast, particularly in the Canaima National Park, in the Roraima State of Brazil and in Guyana.
in scheme: Lexvo - ISO 639-3 language codes
notation: aoc
preferred label: Arekuna @fr
preferred label: Idioma pemón @es
preferred label: Pemón @de

Andarum
type: Language
type: Concept
ISO 639-3 code: aod
alternative label: Andarum language
definition: Andarum is a Ramu language of Papua New Guinea. Together with Kanggape, there were something over 2,000 speakers in 1981.
in scheme: Lexvo - ISO 639-3 language codes
notation: aod

Angal Enen
type: Language
type: Concept
ISO 639-3 code: aoe
in scheme: Lexvo - ISO 639-3 language codes
notation: aoe

Bragat
type: Language
type: Concept
ISO 639-3 code: aof
in scheme: Lexvo - ISO 639-3 language codes
notation: aof

Angoram
type: Language
type: Concept
ISO 639-3 code: aog
alternative label: Angoram language
definition: Angoram, also known as Pondo, is a Papuan language of Papua New Guinea.
in scheme: Lexvo - ISO 639-3 language codes
notation: aog

Arma
type: Language
type: Concept
ISO 639-3 code: aoh
in scheme: Lexvo - ISO 639-3 language codes
notation: aoh

Wariyangga
type: Language
type: Concept
ISO 639-3 code: wri
in scheme: Lexvo - ISO 639-3 language codes
notation: wri

Anindilyakwa
type: Language
type: Concept
ISO 639-3 code: aoi
alternative label: Enindhilyagwa language
definition: Enindhilyagwa (several other names; see below) is an Australian language isolate spoken by the Warnindhilyagwa people on Groote Eylandt in the Gulf of Carpentaria in northern Australia. A 2001 Australian government identified more than one thousand speakers of the language, although there are reports of as many as three thousand. In 2008, it was cited in a study on whether humans had an innate ability to count without having words for numbers. While the Enindhilyagwa language traditionally had terms for numbers up to twenty, these are no longer known to younger speakers.
in scheme: Lexvo - ISO 639-3 language codes
notation: aoi
preferred label: Lingua enindhilyagwa @it
preferred label: Língua enindhilyagwa @pt

Mufian
type: Language
type: Concept
ISO 639-3 code: aoj
alternative label: Mufian language
definition: Mufian (Muhian, Muhiang), or Southern Arapesh, is an Arapesh language (Torricelli) of Papua New Guinea. Dialects are Supari, Balif, Filifita (Ilahita), Iwam-Nagalemb, Nagipaem; Filifita speakers are a little over half the population.
in scheme: Lexvo - ISO 639-3 language codes
notation: aoj

Arhö
type: Language
type: Concept
ISO 639-3 code: aok
in scheme: Lexvo - ISO 639-3 language codes
notation: aok

Alor
type: Language
type: Concept
ISO 639-3 code: aol
alternative label: Alorese language
definition: Alorese (Bahasa Alor) is an Austronesian language spoken on Alor and the neighboring islands of the Alor archipelago in eastern Indonesia. It is not to be confused with non-Austronesian (Papuan) languages of the Alor–Pantar family which are also spoken in this region. It is also distinct from Alor Malay, a Malay variety which is currently supplanting Alorese as the language of wider communication in the region. Alorese is the native language of several immigrant communities located along the coast of the Alor archipelago, especially at Alor Kecil on Alor and at Baranusa and Marica on Pantar. It has also been used extensively as a trade language in the region.
in scheme: Lexvo - ISO 639-3 language codes
notation: aol

Ömie
type: Language
type: Concept
ISO 639-3 code: aom
in scheme: Lexvo - ISO 639-3 language codes
notation: aom

Bumbita Arapesh
type: Language
type: Concept
ISO 639-3 code: aon
alternative label: Arapesh, Bumbita
alternative label: Bumbita language
definition: Bumbita (But Arapesh) is an Arapesh language (Torricelli) of Papua New Guinea spoken mainly by older adults, unlike other Arapesh languages. Dialects are Bonahoi, Urita, Timingir, Weril, Werir.
in scheme: Lexvo - ISO 639-3 language codes
notation: aon

Aore
type: Language
type: Concept
ISO 639-3 code: aor
in scheme: Lexvo - ISO 639-3 language codes
notation: aor

Garrwa
type: Language
type: Concept
ISO 639-3 code: wrk
in scheme: Lexvo - ISO 639-3 language codes
notation: wrk

Taikat
type: Language
type: Concept
ISO 639-3 code: aos
alternative label: Taikat language
definition: Taikat (Tajkat) or Arso is a Papuan language of Indonesian Papua.
in scheme: Lexvo - ISO 639-3 language codes
notation: aos

A'tong
type: Language
type: Concept
ISO 639-3 code: aot
alternative label: A'Tong language
definition: A'Tong is a language of the Sino-Tibetan family, related to Koch and Rabha. It is spoken in the Southern Meghalaya (South Garo Hills, Hd. Qtr.-Baghmara) region of India.
in scheme: Lexvo - ISO 639-3 language codes
notation: aot

A'ou
type: Language
type: Concept
ISO 639-3 code: aou
in scheme: Lexvo - ISO 639-3 language codes
notation: aou

Atorada
type: Language
type: Concept
ISO 639-3 code: aox
in scheme: Lexvo - ISO 639-3 language codes
notation: aox

Uab Meto
type: Language
type: Concept
ISO 639-3 code: aoz
alternative label: Uab Meto language
definition: Uab Meto is an Austronesian language spoken by Atoni people of West Timor. The language has a variant spoken in the East Timorese exclave of Oecussi-Ambeno, called Baikenu. Baikenu uses words derived from Portuguese, for example, obrigadu for "thank you", instead of the Indonesian terima kasih.
in scheme: Lexvo - ISO 639-3 language codes
notation: aoz

Sa'a
type: Language
type: Concept
ISO 639-3 code: apb
alternative label: Sa'a language
definition: Saa (also known as South Malaita and Apaeaa) is an Oceanic language spoken on Small Malaita and Ulawa Island in the Solomon Islands.
in scheme: Lexvo - ISO 639-3 language codes
notation: apb
preferred label: Sa’a @fr

North Levantine Arabic
type: Language
type: Concept
ISO 639-3 code: apc
alternative label: Arabic, North Levantine
in scheme: Lexvo - ISO 639-3 language codes
notation: apc

Warlmanpa
type: Language
type: Concept
ISO 639-3 code: wrl
alternative label: Warlmanpa language
definition: Warlmanpa (also Walmala) is a nearly extinct Australian Aboriginal language.
in scheme: Lexvo - ISO 639-3 language codes
notation: wrl

Sudanese Arabic
type: Language
type: Concept
ISO 639-3 code: apd
alternative label: Arabic, Sudanese
definition: Sudanese Arabic is the variety of Arabic spoken throughout northern Sudan. It has much borrowed vocabulary from the local languages (El Rotana). This has resulted in a variety of Arabic that is unique to Sudan, reflecting the way in which the country has been influenced by both African and Arab cultures. Some of the tribes in Sudan still have similar accents to the ones in Saudi Arabia.
in scheme: Lexvo - ISO 639-3 language codes
notation: apd
preferred label: Sudanesisch-Arabisch @de

Bukiyip
type: Language
type: Concept
ISO 639-3 code: ape
alternative label: Bukiyip language
definition: Bukiyip (Bukiyúp), or Mountain Arapesh, is an Arapesh language (Torricelli) of Papua New Guinea.
in scheme: Lexvo - ISO 639-3 language codes
notation: ape

Pahanan Agta
type: Language
type: Concept
ISO 639-3 code: apf
alternative label: Agta, Pahanan
in scheme: Lexvo - ISO 639-3 language codes
notation: apf

Ampanang
type: Language
type: Concept
ISO 639-3 code: apg
in scheme: Lexvo - ISO 639-3 language codes
notation: apg

Athpariya
type: Language
type: Concept
ISO 639-3 code: aph
alternative label: Athpare language
definition: Athpare, also known as Athapre, Athpariya, Athpre, Arthare, Arthare-Khesang, or Jamindar Rai, is an eastern Kiranti language spoken by some 2,000 people living in Dhankuta district in Eastern Nepal.
in scheme: Lexvo - ISO 639-3 language codes
notation: aph

Apiaká
type: Language
type: Concept
ISO 639-3 code: api
alternative label: Apiaká language
definition: Apiacá is a Tupi language of the Apiacá people of the upper Rio Tapajos area of Matto Grosso, Brazil. It is being supplanted by Portuguese.
in scheme: Lexvo - ISO 639-3 language codes
notation: api

Jicarilla Apache
type: Language
type: Concept
ISO 639-3 code: apj
alternative label: Apache, Jicarilla
alternative label: Jicarilla language
definition: Jicarilla is an Eastern Southern Athabaskan language spoken by the Jicarilla Apache.
in scheme: Lexvo - ISO 639-3 language codes
notation: apj
preferred label: Idioma jicarilla @es
preferred label: Jicarilla @fr

Kiowa Apache
type: Language
type: Concept
ISO 639-3 code: apk
alternative label: Apache, Kiowa
alternative label: Plains Apache language
definition: The Plains Apache language (or Kiowa Apache) is a Southern Athabaskan language spoken by the Plains Apache peoples living primarily in central Oklahoma.
in scheme: Lexvo - ISO 639-3 language codes
notation: apk
preferred label: Apache des Plaines @fr

Lipan Apache
type: Language
type: Concept
ISO 639-3 code: apl
alternative label: Apache, Lipan
alternative label: Lipan language
definition: Lipan is an Eastern Southern Athabaskan language spoken by the Lipan Apache. In 1981 it was claimed there were only a few elderly speakers still alive, and it is possible that it has become extinct since then.
in scheme: Lexvo - ISO 639-3 language codes
notation: apl
preferred label: Lipan @fr

Mescalero-Chiricahua Apache
type: Language
type: Concept
ISO 639-3 code: apm
alternative label: Apache, Mescalero-Chiricahua
alternative label: Mescalero-Chiricahua language
definition: Mescalero-Chiricahua (also known as Mescalero-Chiricahua Apache) is a Southern Athabaskan language spoken by the Mescalero and Chiricahua tribes in Oklahoma and New Mexico. It is related to Navajo and Western Apache. Mescalero-Chiricahua has been described in great detail by the anthropological linguist Harry Hoijer (1904–1976), especially in Hoijer & Opler (1938) and Hoijer (1946). Hoijer & Opler's Chiricahua and Mescalero Apache Texts, including a grammatical sketch and traditional religious and secular stories, has been converted into an online "book" available from the University of Virginia.
in scheme: Lexvo - ISO 639-3 language codes
notation: apm
preferred label: Chiricahua @de
preferred label: Idioma mescalero-chiricahua @es

Apinayé
type: Language
type: Concept
ISO 639-3 code: apn
alternative label: Apinayé language
definition: Apinayé (otherwise known as Apinagé, Apinajé) is a SOV Jê language spoken in Tocantins, Brazil by some 1200 speakers of Apinajé people.
in scheme: Lexvo - ISO 639-3 language codes
notation: apn
preferred label: Apinajé @fr
preferred label: Apinajés @pt

Warumungu
type: Language
type: Concept
ISO 639-3 code: wrm
alternative label: Warumungu language
definition: The Warumungu language (or the Warramunga language) is spoken by about 500 of the Warumungu people in Australia's Northern Territory. Traditionally classified in the large Southwest branch of the Pama–Nyungan family, Dixon classifies it as an isolate within Pama–Nyungan.
in scheme: Lexvo - ISO 639-3 language codes
notation: wrm

Ambul
type: Language
type: Concept
ISO 639-3 code: apo
in scheme: Lexvo - ISO 639-3 language codes
notation: apo

Apma
type: Language
type: Concept
ISO 639-3 code: app
alternative label: Apma language
definition: Apma (or Abma) is the language of central Pentecost island in Vanuatu. Apma belongs to the East Vanuatu languages, a branch of the Austronesian languages family.
in scheme: Lexvo - ISO 639-3 language codes
notation: app
preferred label: Língua apma @pt

A-Pucikwar
type: Language
type: Concept
ISO 639-3 code: apq
in scheme: Lexvo - ISO 639-3 language codes
notation: apq

Arop-Lokep
type: Language
type: Concept
ISO 639-3 code: apr
alternative label: Arop-Lokep language
definition: Arop-Lokep (also spelled Arop-Lukep) is an Oceanic language spoken by 3,015 people on four islands in the Siassi chain in the Vitiaz Strait in Papua New Guinea.
in scheme: Lexvo - ISO 639-3 language codes
notation: apr

Arop-Sissano
type: Language
type: Concept
ISO 639-3 code: aps
in scheme: Lexvo - ISO 639-3 language codes
notation: aps

Apatani
type: Language
type: Concept
ISO 639-3 code: apt
alternative label: Apatani language
definition: Apatani (Apa Tani, Apa) is a small Tibetan–Burman language of India. As most endangered oral languages, Apatani does not yet have a standardized orthography, and there is still some debate among the Apatanis on which script should be used to transcribe it.
in scheme: Lexvo - ISO 639-3 language codes
notation: apt

Apurinã
type: Language
type: Concept
ISO 639-3 code: apu
alternative label: Apurinã language
definition: Apurinã is a Southern Maipurean language spoken in Amazonia by the Apurinã people.
in scheme: Lexvo - ISO 639-3 language codes
notation: apu

Alapmunte
type: Language
type: Concept
ISO 639-3 code: apv
in scheme: Lexvo - ISO 639-3 language codes
notation: apv

Western Apache
type: Language
type: Concept
ISO 639-3 code: apw
alternative label: Apache, Western
alternative label: Western Apache language
definition: The Western Apache language is a Southern Athabaskan language spoken by over 12,000 of the Western Apache peoples living primarily in east central Arizona. Goodwin (1938) claims that Western Apache can be divided into five dialect groupings:
in scheme: Lexvo - ISO 639-3 language codes
notation: apw
preferred label: Apache occidental @fr

Aputai
type: Language
type: Concept
ISO 639-3 code: apx
in scheme: Lexvo - ISO 639-3 language codes
notation: apx

Apalaí
type: Language
type: Concept
ISO 639-3 code: apy
alternative label: Apalaí language
definition: Apalaí is a Cariban language spoken in Brazil. Approximately 450 people speak Apalaí.
in scheme: Lexvo - ISO 639-3 language codes
notation: apy
preferred label: Apalai @fr

Warnang
type: Language
type: Concept
ISO 639-3 code: wrn
alternative label: Werni language
definition: The Werni language, Warnang, is a Niger–Congo language of the Heiban family spoken in Kordofan, Sudan.
in scheme: Lexvo - ISO 639-3 language codes
notation: wrn

Safeyoka
type: Language
type: Concept
ISO 639-3 code: apz
in scheme: Lexvo - ISO 639-3 language codes
notation: apz

Archi
type: Language
type: Concept
ISO 639-3 code: aqc
alternative label: Archi language
definition: Archi is a Northeast Caucasian language spoken by the 1,200 Archis in the village of Archib, southern Dagestan, Russia and the six surrounding smaller villages. It is used at home and the speakers have positive attitude toward it. and has a remarkable morphological system with huge paradigms and irregularities on all levels. Mathematically, there are 1,502,839 possible forms that can be derived from a single verb root.
in scheme: Lexvo - ISO 639-3 language codes
notation: aqc
preferred label: Artchi @fr
preferred label: Artschinische Sprache @de
preferred label: Lingua archi @it
preferred label: Língua archi @pt

Ampari Dogon
type: Language
type: Concept
ISO 639-3 code: aqd
alternative label: Dogon, Ampari
definition: Ampari Dogon, also known as Ambange or Ampari kora, is a Dogon language spoken in Mali.
in scheme: Lexvo - ISO 639-3 language codes
notation: aqd

Arigidi
type: Language
type: Concept
ISO 639-3 code: aqg
alternative label: Akoko language
definition: North Akoko, usually abbreviated to Akoko, is a dialect cluster spoken in Nigeria. It appears to form a branch of the "Yoruba–Edo–Akoko–Igbo" group of Niger–Congo languages.
in scheme: Lexvo - ISO 639-3 language codes
notation: aqg
preferred label: Akoko @de

Atohwaim
type: Language
type: Concept
ISO 639-3 code: aqm
in scheme: Lexvo - ISO 639-3 language codes
notation: aqm

Northern Alta
type: Language
type: Concept
ISO 639-3 code: aqn
alternative label: Alta, Northern
in scheme: Lexvo - ISO 639-3 language codes
notation: aqn

Atakapa
type: Language
type: Concept
ISO 639-3 code: aqp
alternative label: Atakapa language
definition: Atakapa is an extinct language isolate native to southwestern Louisiana and nearby coastal eastern Texas. It was spoken by the Atakapa people (also known as "Ishak").
in scheme: Lexvo - ISO 639-3 language codes
notation: aqp
preferred label: Idioma atakapa @es

Arhâ
type: Language
type: Concept
ISO 639-3 code: aqr
in scheme: Lexvo - ISO 639-3 language codes
notation: aqr

Akuntsu
type: Language
type: Concept
ISO 639-3 code: aqz
alternative label: Tuparí language
definition: Tupari is a Tupian language of Brazil.
in scheme: Lexvo - ISO 639-3 language codes
notation: aqz

Arabic
type: Language
type: Concept
ISO 639-1 code: ar
ISO 639-2 Bibliographical code: ara
ISO 639-2 Terminological code: ara
ISO 639-3 code: ara
alternative label: Arabe @fr
alternative label: Arabic language
alternative label: Arabische Sprache @de
alternative label: Idioma árabe @es
alternative label: Lingua araba @it
alternative label: Língua árabe @pt
definition: Arabic ( or ) is a name applied to the descendants of the Classical Arabic language of the 6th century AD. This includes both the literary language (Modern Standard Arabic or Literary Arabic, used in most written documents as well as in formal spoken occasions, such as lectures and radio broadcasts) and the spoken Arabic varieties, spoken in a wide arc of territory stretching across the Middle East and North Africa. Arabic is a Central Semitic language, closely related to Hebrew and the Neo-Aramaic languages, and also related to the South Semitic languages (e.g., Amharic in Ethiopia, Tigrinya in Ethiopia and Eritrea, and Mehri in Yemen and Oman) and the extinct East Semitic languages (e.g., Akkadian, first attested nearly 5,000 years ago). The written language is distinct from and more conservative than all of the spoken varieties, and the two exist in a state known as diglossia, used side-by-side for different societal functions.
in scheme: Lexvo - ISO 639-3 language codes
notation: ara
preferred label: Arabisch @de
preferred label: arabe @fr
preferred label: arabo @it
preferred label: árabe @es

Standard Arabic
type: Language
type: Concept
ISO 639-3 code: arb
alternative label: Arabic, Standard
alternative label: Modern Standard Arabic
definition: Modern Standard Arabic (MSA; "the most eloquent Arabic language"), Standard Arabic, or Literary Arabic is the standard and literary variety of Arabic used in writing and in most formal speech.
in scheme: Lexvo - ISO 639-3 language codes
notation: arb
preferred label: Arabe standard moderne @fr
preferred label: Fusha @it
preferred label: Árabe estándar moderno @es
preferred label: Árabe moderno padrão @pt

Aramaic
type: Language
type: Concept
ISO 639-2 Bibliographical code: arc
ISO 639-2 Terminological code: arc
ISO 639-3 code: arc
alternative label: Aramaic, Imperial (700-300 BCE)
alternative label: Aramaic, Official (700-300 BCE)
alternative label: Imperial Aramaic
alternative label: Imperial Aramaic (700-300 BCE)
alternative label: Official Aramaic
alternative label: Official Aramaic (700-300 BCE)
alternative label: Official Aramaic language
alternative label: araméen d'empire (700-300 BCE) @fr
definition: Official Aramaic is an ancient Afro-Asiatic language spoken in the Near East between about 700 BCE and 300 BCE. It received its name from the fact that it was adopted as the administrative language of the Achaemenid Persian empire beginning about 500 BCE. It succeeded Old Aramaic.
in scheme: Lexvo - ISO 639-3 language codes
notation: arc
preferred label: Aramäisch @de
preferred label: aramaico @it
preferred label: arameo @es
preferred label: araméen @fr

Worrorra
type: Language
type: Concept
ISO 639-3 code: wro
in scheme: Lexvo - ISO 639-3 language codes
notation: wro

Arabana
type: Language
type: Concept
ISO 639-3 code: ard
alternative label: Arabana language
definition: Arabana is an Australian Aboriginal language. It is one of the Karnic languages of the Pama–Nyungan family.
in scheme: Lexvo - ISO 639-3 language codes
notation: ard

Western Arrarnta
type: Language
type: Concept
ISO 639-3 code: are
alternative label: Arrarnta, Western
in scheme: Lexvo - ISO 639-3 language codes
notation: are

Aragonese
type: Language
type: Concept
ISO 639-1 code: an
ISO 639-2 Bibliographical code: arg
ISO 639-2 Terminological code: arg
ISO 639-3 code: arg
alternative label: Aragonais @fr
alternative label: Aragonese language
alternative label: Aragonesische Sprache @de
alternative label: Idioma aragonés @es
alternative label: Lingua aragonese @it
alternative label: Língua aragonesa @pt
definition: Aragonese (; in Aragonese) is a Romance language now spoken in a number of local varieties by between 10,000 and 30,000 people over the valleys of the Aragón River, Sobrarbe and Ribagorza in Aragon, Spain. It is the only remaining speech form derived from medieval Navarro-Aragonese languages.
in scheme: Lexvo - ISO 639-3 language codes
notation: arg
preferred label: Aragonesisch @de
preferred label: aragonais @fr
preferred label: aragonese @it
preferred label: aragonés @es
preferred label: aragonês @pt

Arhuaco
type: Language
type: Concept
ISO 639-3 code: arh
alternative label: Arhuaco language
definition: Arhuaco, oommonly known as Ika, is an Indigenous American language of the Chibchan language family, spoken in South America.
in scheme: Lexvo - ISO 639-3 language codes
notation: arh
preferred label: Idioma arhuaco @es

Arikara
type: Language
type: Concept
ISO 639-3 code: ari
alternative label: Arikara language
definition: Arikara is a Caddoan language spoken by the Arikara people, who reside primarily at Fort Berthold reservation in North Dakota. Arikara is very close to the Pawnee language, but they are not mutually intelligible.
in scheme: Lexvo - ISO 639-3 language codes
notation: ari

Arapaso
type: Language
type: Concept
ISO 639-3 code: arj
in scheme: Lexvo - ISO 639-3 language codes
notation: arj

Arikapú
type: Language
type: Concept
ISO 639-3 code: ark
alternative label: Arikapú language
definition: Arikapú or Maxubí is an endangered Yabutian language that as of 1998 was spoken by only six individuals in Rondônia, Brazil, at the headwaters of the Rio Branco. It is being supplanted by Portuguese.
in scheme: Lexvo - ISO 639-3 language codes
notation: ark

Waropen
type: Language
type: Concept
ISO 639-3 code: wrp
alternative label: Waropen language
definition: Waropen is an Austronesian language in the putative Cenderawasih (Geelvink Bay) of Indonesian Papua. It is fairly closely related to the Yapen languages.
in scheme: Lexvo - ISO 639-3 language codes
notation: wrp

Arabela
type: Language
type: Concept
ISO 639-3 code: arl
alternative label: Arabela language
definition: Arabela is an indigenous American language of the Zaparoan family spoken in two Peruvian villages in tropical forest along the Napo tributary of the Arabela river.
in scheme: Lexvo - ISO 639-3 language codes
notation: arl
preferred label: Idioma arabela @es
preferred label: Língua arabela @pt

Mapuche
type: Language
type: Concept
ISO 639-2 Bibliographical code: arn
ISO 639-2 Terminological code: arn
ISO 639-3 code: arn
alternative label: Araucanian
alternative label: Araukanisch @de
alternative label: Idioma mapuche @es
alternative label: Lingua mapudungun @it
alternative label: Mapuche language
preferred label: Mapudungun
alternative label: mapudungun @es
definition: The Mapuche language, Mapudungun (from earth, land and speak, speech) is a language isolate spoken in south-central Chile and west central Argentina by the Mapuche (from mapu and che people) people. It is also spelled Mapuzugun and sometimes called Mapudungu or Araucanian (Araucano). The latter was the name given to the Mapuche by the Spaniards but nowadays both the Mapuche and others avoid this usage. The number of speakers differs depending on definition and research methodology. In the political struggle between the ethnic minority and the Chilean and Argentinian governments the different groups support different research results. Mapuche-written publications from 2008 supports research showing approximately 700,000 speakers. Other results report approximately 240,000 speakers, with 200,000 in the Central Valley of Chile and 40,000 in several Argentine provinces, where some 150,000 people use the language regularly.
in scheme: Lexvo - ISO 639-3 language codes
notation: arn
preferred label: araucano @es
preferred label: araukan @fr

Araona
type: Language
type: Concept
ISO 639-3 code: aro
alternative label: Araona language
definition: Araona or Cavina is an indigenous language spoken by the South American Araona people; about 90% of the 90 Araona people are fluent (W. Adelaar). Use of the language amongst the tribe is considered vigorous although Spanish knowledge is increasing. The Araonans live in the headwaters of the Manupari river in northwest Bolivia. Their language has a dictionary and portions of the Bible have been translated into Araona.
in scheme: Lexvo - ISO 639-3 language codes
notation: aro
preferred label: Idioma araona @es

Arapaho
type: Language
type: Concept
ISO 639-2 Bibliographical code: arp
ISO 639-2 Terminological code: arp
ISO 639-3 code: arp
alternative label: Arapaho language
definition: The Arapaho language or hinonoeitiit (also "Arapahoe Language" and hiinonoeitiit) is a Plains Algonquian language (an areal rather than genetic grouping) spoken almost entirely by elders in Wyoming, and to a much lesser extent in Oklahoma. It is in great danger of becoming extinct. As of 1996, there were approximately 1,000 speakers of the Northern Arapaho. In 2008, it was reported that a school had been opened to teach the language to children. 22 children are being taught there. The school was established as a matter of urgency, as no person aged under 55 was fluent in Arapaho at that point.
in scheme: Lexvo - ISO 639-3 language codes
notation: arp
preferred label: Arapaho-Sprache @de
preferred label: arapaho @es

Algerian Arabic
type: Language
type: Concept
ISO 639-3 code: arq
alternative label: Arabic, Algerian
definition: Algerian Arabic is the variety or varieties of Arabic spoken in Algeria. In Algeria, as elsewhere, spoken Arabic differs from written Arabic; Algerian Arabic has a vocabulary mostly Arabic, with significant Berber substrates, and many new words and loanwords borrowed from French, Turkish and Spanish.
in scheme: Lexvo - ISO 639-3 language codes
notation: arq
preferred label: Arabe algérien @fr
preferred label: Árabe argelino @es

Karo
type: Language
type: Concept
ISO 639-3 code: arr
alternative label: Karo (Brazil)
alternative label: Ramarama language
definition: Ramarama, also known as Karo, is a Tupian language of Brazil. Besides the dialect names, it also goes by a name variously spelled Itanga, Itogapuc, Itogapúk, Ntogapid, Ntogapig.
in scheme: Lexvo - ISO 639-3 language codes
notation: arr

Najdi Arabic
type: Language
type: Concept
ISO 639-3 code: ars
alternative label: Arabic, Najdi
definition: Najdi Arabic is a variety of the Arabic language spoken in the desert and oases of central Saudi Arabia.
in scheme: Lexvo - ISO 639-3 language codes
notation: ars

Aruá
type: Language
type: Concept
ISO 639-3 code: aru
preferred label: Arawá
alternative label: Arawá language
alternative label: Aruá (Amazonas State)
definition: Aruá is an extinct language of Brazil. The last speaker died in 1877. All that survives is a word list from 1869.
in scheme: Lexvo - ISO 639-3 language codes
notation: aru
preferred label: Idioma arauá @es

Arbore
type: Language
type: Concept
ISO 639-3 code: arv
alternative label: Arbore language
definition: Arbore is an Afro-Asiatic language spoken in southern Ethiopia in a few settlements of Hamer Bena woreda near Lake Chew Bahir.
in scheme: Lexvo - ISO 639-3 language codes
notation: arv
preferred label: Arboré @fr

Arawak
type: Language
type: Concept
ISO 639-2 Bibliographical code: arw
ISO 639-2 Terminological code: arw
ISO 639-3 code: arw
alternative label: Arawak language
alternative label: Idioma arawak-lokono @es
definition: Arawak (Arowak, Aruák) is the eponymous language of the Arawakan language family. The term is often used to cover the closely related Taino language of the Caribbean islands. The ethnonym Lokono may be used more specifically.
in scheme: Lexvo - ISO 639-3 language codes
notation: arw
preferred label: Arawak-Sprache @de
preferred label: arahuaco @es
preferred label: arauaqui @pt
preferred label: arawak @fr
preferred label: aruaco @it

Aruá
type: Language
type: Concept
ISO 639-3 code: arx
alternative label: Aruá (Rodonia State)
in scheme: Lexvo - ISO 639-3 language codes
notation: arx

Wardaman
type: Language
type: Concept
ISO 639-3 code: wrr
alternative label: Wardaman language
definition: Wardaman is an Australian Aboriginal language. It is one of the Northern Non-Pama–Nyungan languages. The language is close to Dagoman and Yangman (both extinct).
in scheme: Lexvo - ISO 639-3 language codes
notation: wrr

Moroccan Arabic
type: Language
type: Concept
ISO 639-3 code: ary
alternative label: Arabic, Moroccan
definition: Moroccan Arabic (also known as Darija, الدارجة) is the variety of Arabic spoken in the Arabic-speaking areas of Morocco. For official communications, the government and other public bodies use Modern Standard Arabic, as is the case in most Arabic-speaking countries. A mixture of French and Moroccan Arabic is used in business. It is within the Maghrebi Arabic dialect continuum.
in scheme: Lexvo - ISO 639-3 language codes
notation: ary
preferred label: Arabe marocain @fr
preferred label: Marokkanisch-Arabisch @de
preferred label: Árabe marroquino @pt
preferred label: Árabe marroquí @es

Egyptian Arabic
type: Language
type: Concept
ISO 639-3 code: arz
alternative label: Arabic, Egyptian
definition: Egyptian Arabic (, "The Modern Egyptian Language"; abbreviated: ‎ "Egyptian") is the language spoken by contemporary Egyptians. It is more commonly known locally as the Egyptian colloquial language ( ) or Egyptian dialect ( ).
in scheme: Lexvo - ISO 639-3 language codes
notation: arz
preferred label: Arabe égyptien @fr
preferred label: Arabo egiziano @it
preferred label: Árabe egipcio @es
preferred label: Árabe egípcio @pt
preferred label: Ägyptisch-Arabisch @de

Asu
type: Language
type: Concept
ISO 639-3 code: asa
alternative label: Asu (Tanzania)
alternative label: Pare language
preferred label: asu @es
definition: Pare (Kipare), also known as Asu (Casu, Chasu, Athu, Chathu), is a Northeast Coast Bantu spoken by the Pare people of Tanzania.
in scheme: Lexvo - ISO 639-3 language codes
notation: asa
preferred label: Pare @de
preferred label: asa @pt
preferred label: assou @fr

Assiniboine
type: Language
type: Concept
ISO 639-3 code: asb
alternative label: Assiniboine language
definition: The Assiniboine language (also Assiniboin, Hohe, or Nakota, Nakoda or Nakona ) is a Nakotan Siouan language of the Northern Plains, spoken by around 200 Assiniboine people, most of them elderly. The name Asiniibwaan is an Ojibwe term meaning "Stone Siouans". Along with the closely related Stoney, Assiniboine is an n variety of the Dakotan languages, meaning its autonym is pronounced with an initial n (thus: Nakʰóta as opposed to Dakʰóta or Lakʰóta, and Nakʰóda or Nakʰóna as opposed to Dakʰód or Lakʰól). The Assiniboine language is also closely related to the Sioux language and to the Stoney language (called likewise Nakoda or Nakota), although they are hardly mutually intelligible.
in scheme: Lexvo - ISO 639-3 language codes
notation: asb

Casuarina Coast Asmat
type: Language
type: Concept
ISO 639-3 code: asc
alternative label: Asmat, Casuarina Coast
in scheme: Lexvo - ISO 639-3 language codes
notation: asc

Asas
type: Language
type: Concept
ISO 639-3 code: asd
in scheme: Lexvo - ISO 639-3 language codes
notation: asd

American Sign Language
type: Language
type: Concept
ISO 639-3 code: ase
definition: American Sign Language, or ASL, is a complex form of manual communication in which hands, limbs, head, facial expression and body language are used to communicate a visual-spatial language without sound. ASL is not related to spoken English, and features an entirely different grammar and vocabulary: linguistically it is a complete, natural and fully realized language in its own right.
in scheme: Lexvo - ISO 639-3 language codes
notation: ase
preferred label: Langue des signes américaine @fr
preferred label: Lengua de signos americana @es
preferred label: Língua de sinais americana @pt

Auslan
type: Language
type: Concept
ISO 639-3 code: asf
alternative label: Australian Sign Language
definition: Auslan is the sign language of the Australian deaf community. The term Auslan is an acronym of "Australian sign language", coined by Trevor Johnston in the early 1980s, although the language itself is much older. Auslan is related to British Sign Language (BSL) and Scottish Sign Language (SSL); the three have descended from the same parent language, and together comprise the BASSL Language Family. Auslan has also been influenced by Irish Sign Language (ISL) and more recently has borrowed signs from American Sign Language (ASL).
in scheme: Lexvo - ISO 639-3 language codes
notation: asf
preferred label: Língua de sinais australiana @pt

Cishingini
type: Language
type: Concept
ISO 639-3 code: asg
in scheme: Lexvo - ISO 639-3 language codes
notation: asg

Abishira
type: Language
type: Concept
ISO 639-3 code: ash
alternative label: Tequiraca language
definition: Tequiraca (Tekiráka), also known as Abishira (Avishiri)*, is a language spoken in Peru. In 1925 there were between 50 and 80 speakers in Puerto Elvira on Lake Vacacocha (connected with the Napo River). It had been presumed extinct some time in the mid 20th century, but in 2010 a few speakers or semi-speakers were found.
in scheme: Lexvo - ISO 639-3 language codes
notation: ash
preferred label: Auishiri @fr
preferred label: Idioma tekiraka @es

Mangas
type: Language
type: Concept
ISO 639-3 code: zns
alternative label: Mangas language
definition: Mangas is an endangered Afro-Asiatic language spoken in Mangas town in Bauchi State, Nigeria.
in scheme: Lexvo - ISO 639-3 language codes
notation: zns

Buruwai
type: Language
type: Concept
ISO 639-3 code: asi
in scheme: Lexvo - ISO 639-3 language codes
notation: asi

Waris
type: Language
type: Concept
ISO 639-3 code: wrs
alternative label: Waris language
definition: Waris or Walsa is a Papuan language spoken by about 2,500 people around Wasengla, Amanab District, Sandaun Province, Papua New Guinea, as well as about 1,500 across the border in the Indonesian province of Papua.
in scheme: Lexvo - ISO 639-3 language codes
notation: wrs

Sari
type: Language
type: Concept
ISO 639-3 code: asj
preferred label: Nsari
alternative label: Saari language
definition: Saari, or Nsari, is an Eastern Beboid language of Cameroon. According to Ethnologue, it's 84% lexically similar to Ncane, making it very close to the Noni cluster.
in scheme: Lexvo - ISO 639-3 language codes
notation: asj

Ashkun
type: Language
type: Concept
ISO 639-3 code: ask
alternative label: Askunu language
definition: Âṣkuňu is a language of Afghanistan spoken by the Âṣkuňu, Saňu, and Grâmsaňâ people in the region of the central Pech Valley around Wâmâ and in some eastern tributary valleys of the upper Alingar River in Afghanistan's Nuristan province. The most used alternative name for all three tribes is Ashkun, which was first noted by George Scott Robertson in 1896.
in scheme: Lexvo - ISO 639-3 language codes
notation: ask

Asilulu
type: Language
type: Concept
ISO 639-3 code: asl
in scheme: Lexvo - ISO 639-3 language codes
notation: asl

Assamese
type: Language
type: Concept
ISO 639-1 code: as
ISO 639-2 Bibliographical code: asm
ISO 639-2 Terminological code: asm
ISO 639-3 code: asm
alternative label: Assamais @fr
alternative label: Assamese language
alternative label: Assamesische Sprache @de
alternative label: Idioma asamés @es
alternative label: Lingua assamese @it
alternative label: Língua assamesa @pt
definition: Assamese ( ) is the easternmost Indo-Aryan language. It is used mainly in the state of Assam in North-East India. It is also the official language of Assam. It is also spoken in parts of Arunachal Pradesh and other northeast Indian states. Nagamese, an Assamese-based Creole language is widely used in Nagaland and parts of Assam. Small pockets of Assamese speakers can be found in Bhutan. The easternmost of Indo-European languages, it is spoken by over 13 million people.
in scheme: Lexvo - ISO 639-3 language codes
notation: asm
preferred label: Assamesisch @de
preferred label: asamés @es
preferred label: assamais @fr
preferred label: assamese @it
preferred label: assamês @pt

Xingú Asuriní
type: Language
type: Concept
ISO 639-3 code: asn
alternative label: Asuriní, Xingú
in scheme: Lexvo - ISO 639-3 language codes
notation: asn

Dano
type: Language
type: Concept
ISO 639-3 code: aso
alternative label: Dano language
definition: Dano (Upper Asaro) is a Papuan language spoken by about 30,000 people in the Goroka District of Eastern Highlands Province, Papua New Guinea.
in scheme: Lexvo - ISO 639-3 language codes
notation: aso

Algerian Sign Language
type: Language
type: Concept
ISO 639-3 code: asp
definition: Algerian Sign Language (French: Langue des signes algérienne (LSA), Tamazight: Tamslayt Tadugamt n Lezzayer, Arabic: لغة الإشارة الجزائر ) is the sign language most commonly used in Algeria. It was officially recognized by the Algerian law on the protection and promotion of persons with a disability enacted on May 8, 2002.
in scheme: Lexvo - ISO 639-3 language codes
notation: asp
preferred label: Langue des signes algérienne @fr
preferred label: Língua de Sinais Algeriana @pt

Austrian Sign Language
type: Language
type: Concept
ISO 639-3 code: asq
definition: Austrian Sign Language, or Österreichische Gebärdensprache (ÖGS), is the sign language used by the Austrian Deaf community — approximately 10,000 people. (see Krausneker 2006)
in scheme: Lexvo - ISO 639-3 language codes
notation: asq
preferred label: Língua de sinais austríaca @pt
preferred label: Österreichische Gebärdensprache @de

Asuri
type: Language
type: Concept
ISO 639-3 code: asr
alternative label: Asuri language
definition: Asuri is a minor Munda language of India.
in scheme: Lexvo - ISO 639-3 language codes
notation: asr

Ipulo
type: Language
type: Concept
ISO 639-3 code: ass
in scheme: Lexvo - ISO 639-3 language codes
notation: ass

Bable
type: Language
type: Concept
ISO 639-2 Bibliographical code: ast
ISO 639-2 Terminological code: ast
ISO 639-3 code: ast
alternative label: Asturian
alternative label: Asturian language
alternative label: Asturische Sprache @de
alternative label: Asturleonese
alternative label: Idioma asturiano @es
alternative label: Leonese
alternative label: Lingua asturiana @it
alternative label: Língua asturiana @pt
alternative label: asturien @fr
definition: Asturian (Asturianu, or bable ) is a Romance language of the West Iberian group, Astur-Leonese Subgroup, spoken in the Spanish Region of Asturias by some Asturian people. In Asturias, even though it is not an official language, it is protected under the Autonomous Statute legislation and is an optional language at schools.
in scheme: Lexvo - ISO 639-3 language codes
notation: ast
preferred label: Asturianisch @de
preferred label: Asturien @fr
preferred label: asturiano @es

Waru
type: Language
type: Concept
ISO 639-3 code: wru
in scheme: Lexvo - ISO 639-3 language codes
notation: wru

Akwáwa language
type: Language
type: Concept
ISO 639-3 code: asu
alternative label: Asurini, Tocantins
alternative label: Tocantins Asurini
definition: Akwáwa (also variously known as Asuriní or Akwaya) is a Tupi–Guarani language which is spoken by the approximately 300 Suruí in western Brazil.
in scheme: Lexvo - ISO 639-3 language codes
notation: asu
preferred label: Língua aquáua @pt

Asoa
type: Language
type: Concept
ISO 639-3 code: asv
alternative label: Asoa language
definition: Asoa, also known as Asua, Asuae, Asuati, or Aka, is a Central Sudanic language spoken by the Mbuti Pygmies known as the Asua. It is closely related to the Mangbetu language, and the Asua live in association with the Mangbetu people, among others. It is the only distinctive Pygmy language in the east.
in scheme: Lexvo - ISO 639-3 language codes
notation: asv

Australian Aborigines Sign Language
type: Language
type: Concept
ISO 639-3 code: asw
in scheme: Lexvo - ISO 639-3 language codes
notation: asw

Muratayak
type: Language
type: Concept
ISO 639-3 code: asx
in scheme: Lexvo - ISO 639-3 language codes
notation: asx

Yaosakor Asmat
type: Language
type: Concept
ISO 639-3 code: asy
alternative label: Asmat, Yaosakor
in scheme: Lexvo - ISO 639-3 language codes
notation: asy

As
type: Language
type: Concept
ISO 639-3 code: asz
in scheme: Lexvo - ISO 639-3 language codes
notation: asz

Pele-Ata
type: Language
type: Concept
ISO 639-3 code: ata
alternative label: Ata language
definition: The Ata language, also known as Pele-Ata or Wasi, is a language isolate spoken on New Britain island, Papua New Guinea. It may be related to the Anêm and Yélî Dnye isolates in a tentative Yele-West New Britain family. There are about 2000 speakers.
in scheme: Lexvo - ISO 639-3 language codes
notation: ata

Waruna
type: Language
type: Concept
ISO 639-3 code: wrv
in scheme: Lexvo - ISO 639-3 language codes
notation: wrv

Zaiwa
type: Language
type: Concept
ISO 639-3 code: atb
alternative label: Zaiwa language
definition: Zaiwa (Tsaiwa, Tsaiva) is a language spoken in parts of China and Burma. There are around 100,000 speakers. It is also known as Atsi, its name in Jingpo. Zaiwa is a member of the Burmish languages.
in scheme: Lexvo - ISO 639-3 language codes
notation: atb

Atsahuaca
type: Language
type: Concept
ISO 639-3 code: atc
in scheme: Lexvo - ISO 639-3 language codes
notation: atc

Ata Manobo
type: Language
type: Concept
ISO 639-3 code: atd
alternative label: Manobo, Ata
in scheme: Lexvo - ISO 639-3 language codes
notation: atd

Atemble
type: Language
type: Concept
ISO 639-3 code: ate
in scheme: Lexvo - ISO 639-3 language codes
notation: ate

Ivbie North-Okpela-Arhe
type: Language
type: Concept
ISO 639-3 code: atg
in scheme: Lexvo - ISO 639-3 language codes
notation: atg

Attié
type: Language
type: Concept
ISO 639-3 code: ati
alternative label: Attié language
definition: Attié (Akie, Akye, Atche, Atie, Atshe) is a language of uncertain classification within the Kwa branch of the Niger–Congo family. It is spoken by perhaps half a million people in Ivory Coast.
in scheme: Lexvo - ISO 639-3 language codes
notation: ati
preferred label: Attie @de

Atikamekw
type: Language
type: Concept
ISO 639-3 code: atj
alternative label: Atikamekw language
definition: The Atikamekw language (also known as Attikamek, Tête de Boule, Attimewk, Atihkamekw, Atikamek), a dialect of Cree, is the language of the Atikamekw people of southwestern Quebec. It is spoken by nearly all the Atikamekw, and therefore it is among the indigenous languages least threatened with extinction according to some studies. The Atikamekw reflex of Proto-Algonquian liquid ("L" sound) *l is (spelled r). The corresponding sound in other Cree dialects is , , , or (it is consistently one of these depending on the dialect). Another way in which Atikamekw is distinctive among dialects of Cree is in having many loanwords from the Anishinaabe language.
in scheme: Lexvo - ISO 639-3 language codes
notation: atj

Gugu Warra
type: Language
type: Concept
ISO 639-3 code: wrw
in scheme: Lexvo - ISO 639-3 language codes
notation: wrw

Ati
type: Language
type: Concept
ISO 639-3 code: atk
in scheme: Lexvo - ISO 639-3 language codes
notation: atk

Mt. Iraya Agta
type: Language
type: Concept
ISO 639-3 code: atl
alternative label: Agta, Mt. Iraya
in scheme: Lexvo - ISO 639-3 language codes
notation: atl

Ata
type: Language
type: Concept
ISO 639-3 code: atm
in scheme: Lexvo - ISO 639-3 language codes
notation: atm

Ashtiani
type: Language
type: Concept
ISO 639-3 code: atn
alternative label: Ashtiani language
definition: Ashtiani is one of the Central Iranian dialects. spoken in the Ashtian and Tafresh area of Iran.
in scheme: Lexvo - ISO 639-3 language codes
notation: atn

Atong
type: Language
type: Concept
ISO 639-3 code: ato
alternative label: Atong language
definition: Atong (Atoŋ) is a Grassfields language of Cameroon.
in scheme: Lexvo - ISO 639-3 language codes
notation: ato

Pudtol Atta
type: Language
type: Concept
ISO 639-3 code: atp
alternative label: Atta, Pudtol
in scheme: Lexvo - ISO 639-3 language codes
notation: atp

Aralle-Tabulahan
type: Language
type: Concept
ISO 639-3 code: atq
in scheme: Lexvo - ISO 639-3 language codes
notation: atq

Wae Rana
type: Language
type: Concept
ISO 639-3 code: wrx
in scheme: Lexvo - ISO 639-3 language codes
notation: wrx

Waimiri-Atroari
type: Language
type: Concept
ISO 639-3 code: atr
in scheme: Lexvo - ISO 639-3 language codes
notation: atr

Gros Ventre
type: Language
type: Concept
ISO 639-3 code: ats
alternative label: Gros Ventre language
definition: Atsina (also known as Gros Ventre, Ananin, Ahahnelin, Atsina, and Ahe ) is the moribund Algonquian ancestral language of the Gros Ventre tribe in Montana. The last fluent speaker died in 1981. Atsina is the name applied by specialists in Algonquian linguistics. Arapaho and Atsina are dialects of a common language usually designated by scholars as "Arapaho-Atsina". Historically, this language had five dialects, and on occasion specialists add a third dialect name to the label, resulting in the designation, "Arapaho-Atsina-Nawathinehena". Compared with Arapaho proper, Gros Ventre had three additional phonemes , , and , and lacked the velar fricative .
in scheme: Lexvo - ISO 639-3 language codes
notation: ats
preferred label: Atsina @fr

Pamplona Atta
type: Language
type: Concept
ISO 639-3 code: att
alternative label: Atta, Pamplona
in scheme: Lexvo - ISO 639-3 language codes
notation: att

Reel
type: Language
type: Concept
ISO 639-3 code: atu
alternative label: Reel language
definition: Reel, or Atwot, is a Nilotic language of South Sudan that is closely related to Nuer. The Reel people are culturally Dinka, and Atwot is their Dinka name.
in scheme: Lexvo - ISO 639-3 language codes
notation: atu

Northern Altai
type: Language
type: Concept
ISO 639-3 code: atv
alternative label: Altai, Northern
alternative label: Northern Altai language
definition: Northern Altai or Northern Altay is one of two Turkic languages spoken in the Altay Republic of Russia on the border of Mongolia, the People's Republic of China, and Kazakhstan. Though traditionally considered one language, Southern Altai is not fully mutually intelligible with the Northern varieties. Written Altai is based on Southern Altai, and is rejected by Northern Altai children.
in scheme: Lexvo - ISO 639-3 language codes
notation: atv

Atsugewi
type: Language
type: Concept
ISO 639-3 code: atw
alternative label: Atsugewi language
definition: Atsugewi is an extinct Palaihnihan language of northeastern California spoken by the Hat Creek and Dixie Valley people. In 1962, there were four speakers out of an ethnic group of 200, all elderly.
in scheme: Lexvo - ISO 639-3 language codes
notation: atw
preferred label: Atsugé @fr
preferred label: Idioma atsugewi @es

Arutani
type: Language
type: Concept
ISO 639-3 code: atx
alternative label: Arutani language
definition: Arutani (Orotani, Urutani, also known as Awake, Auake, Auaqué, Aoaqui, Oewaku, ethnonym Uruak) is a nearly extinct language spoken by only 17 individuals in Roraima, Brazil and two others in the Karum River area of Bolivar State, Venezuela. It is one of the most poorly attested extant languages in South America, and may be a language isolate. Ethnic Arutani also speak Ninam.
in scheme: Lexvo - ISO 639-3 language codes
notation: atx
preferred label: Idioma arutani @es

Merwari
type: Language
type: Concept
ISO 639-3 code: wry
in scheme: Lexvo - ISO 639-3 language codes
notation: wry

Aneityum
type: Language
type: Concept
ISO 639-3 code: aty
alternative label: Aneityum language
definition: Anejom̃ or Aneityum (also spelled Anejom, and formerly Aneiteum, Aneityumese) is an Oceanic language spoken by 600 people on Aneityum Island, Vanuatu.
in scheme: Lexvo - ISO 639-3 language codes
notation: aty
preferred label: Anejom @fr

Arta
type: Language
type: Concept
ISO 639-3 code: atz
in scheme: Lexvo - ISO 639-3 language codes
notation: atz

Asumboa
type: Language
type: Concept
ISO 639-3 code: aua
in scheme: Lexvo - ISO 639-3 language codes
notation: aua

Alugu
type: Language
type: Concept
ISO 639-3 code: aub
in scheme: Lexvo - ISO 639-3 language codes
notation: aub

Waorani
type: Language
type: Concept
ISO 639-3 code: auc
alternative label: Huaorani language
definition: The Huaorani (Waorani) language, commonly known as Sabela (also Wao, Huao, Auishiri, Aushiri, Ssabela ; autonym: Wao Terero; pejorative: Auka, Auca) is a language isolate spoken by the Huaorani people, an indigenous group living in the Amazon Rainforest between the Napo and Curaray Rivers. A small number of speakers with so-called uncontacted groups may live in Peru.
in scheme: Lexvo - ISO 639-3 language codes
notation: auc
preferred label: Auca @de
preferred label: Huaorani @fr
preferred label: Idioma huaorani @es

Anuta
type: Language
type: Concept
ISO 639-3 code: aud
alternative label: Anuta language
definition: The Anuta language is a Polynesian Outlier language from the island of Anuta in the Solomon Islands. It is closely related to the Tikopia language of the neighboring island of Tikopia.
in scheme: Lexvo - ISO 639-3 language codes
notation: aud
preferred label: Anutische Sprache @de
preferred label: Língua anuta @pt

ǂKxʼauǁʼein
type: Language
type: Concept
ISO 639-3 code: aue
alternative label: =/Kx'au//'ein
definition: ǂKxʼauǁʼein is a southeastern variety of the !Kung dialect continuum, spoken in Botswana (Grootelaagte, Kanagas, and Ghanzi villages in Ghanzi District, and on the commercial farms) and in Namibia (Gobabis district (Ovamboland) and Ekoka) by about 7,000 people. In Botswana, most speakers are bilingual in Naro or Tswana.
in scheme: Lexvo - ISO 639-3 language codes
notation: aue
preferred label: Lingua ǂkx'auǁ'ein @it

Waray
type: Language
type: Concept
ISO 639-3 code: wrz
alternative label: Waray (Australia)
alternative label: Waray language
definition: Waray is an Australian language spoken in the Adelaide River area of the Northern Territory.
in scheme: Lexvo - ISO 639-3 language codes
notation: wrz

Aguna
type: Language
type: Concept
ISO 639-3 code: aug
in scheme: Lexvo - ISO 639-3 language codes
notation: aug

Aushi
type: Language
type: Concept
ISO 639-3 code: auh
in scheme: Lexvo - ISO 639-3 language codes
notation: auh

Anuki
type: Language
type: Concept
ISO 639-3 code: aui
alternative label: Anuki language
definition: The Anuki language is an Austronesian language spoken by the Gabobora people along Cape Vogel in the Milne Bay Province of Papua New Guinea.
in scheme: Lexvo - ISO 639-3 language codes
notation: aui

Awjilah
type: Language
type: Concept
ISO 639-3 code: auj
alternative label: Awjila language
definition: Awjila (also known as Aujilah, Augila, Aoudjila) is a Berber language spoken in Cyrenaica, Libya, in the Awjila oasis. UNESCO considers Awjilah to be seriously endangered as the youngest speakers have reached or passed middle age.
in scheme: Lexvo - ISO 639-3 language codes
notation: auj

Heyo
type: Language
type: Concept
ISO 639-3 code: auk
alternative label: Heyo language
definition: Heyo Arinua (Arinwa, Arima) is a Torricelli language of Papua New Guinea. It is also known as Lolopani and Ruruhip; this last it shares with Yahang.
in scheme: Lexvo - ISO 639-3 language codes
notation: auk

Aulua
type: Language
type: Concept
ISO 639-3 code: aul
alternative label: Aulua language
definition: Aulua or Aulua Bay is an Oceanic language spoken in east Malekula, Vanuatu.
in scheme: Lexvo - ISO 639-3 language codes
notation: aul

Asu
type: Language
type: Concept
ISO 639-3 code: aum
alternative label: Asu (Nigeria)
alternative label: Asu language
definition: Asu is a language spoken in the Niger State in Western Nigeria.
in scheme: Lexvo - ISO 639-3 language codes
notation: aum

Molmo One
type: Language
type: Concept
ISO 639-3 code: aun
alternative label: One, Molmo
in scheme: Lexvo - ISO 639-3 language codes
notation: aun

Auyokawa
type: Language
type: Concept
ISO 639-3 code: auo
alternative label: Auyokawa language
definition: Auyokawa is an extinct Afro-Asiatic language formerly spoken in Jigawa State, Nigeria.
in scheme: Lexvo - ISO 639-3 language codes
notation: auo

Makayam
type: Language
type: Concept
ISO 639-3 code: aup
alternative label: Makayam language
definition: Tirio Makayam (Makaeyam) Aturu (Adulu, Atura) is Papuan language of Papua New Guinea.
in scheme: Lexvo - ISO 639-3 language codes
notation: aup

Anus
type: Language
type: Concept
ISO 639-3 code: auq
alternative label: Anus language
alternative label: Korur
alternative label: Korur language
definition: The A or Korur language, Anus or Korurnus, is an Austronesian language spoken on an island in Jayapura Bay east of the Tor River in Papua province of Indonesia (in Western New Guinea).
in scheme: Lexvo - ISO 639-3 language codes
notation: auq

Aruek
type: Language
type: Concept
ISO 639-3 code: aur
in scheme: Lexvo - ISO 639-3 language codes
notation: aur

Warembori
type: Language
type: Concept
ISO 639-3 code: wsa
alternative label: Warembori language
definition: Warembori (native name Waremboivoro) is a moribund language spoken by about 600 people in river mouths on the north coast of Papua, Indonesia.
in scheme: Lexvo - ISO 639-3 language codes
notation: wsa

Austral
type: Language
type: Concept
ISO 639-3 code: aut
alternative label: Austral language
definition: Austral (Reo Tuha’a pae) is a Polynesian language spoken by about 8000 people on the Austral Islands of French Polynesia. It is being supplanted by Tahitian.
in scheme: Lexvo - ISO 639-3 language codes
notation: aut
preferred label: Langues australes @fr

Auye
type: Language
type: Concept
ISO 639-3 code: auu
in scheme: Lexvo - ISO 639-3 language codes
notation: auu

Awyi
type: Language
type: Concept
ISO 639-3 code: auw
in scheme: Lexvo - ISO 639-3 language codes
notation: auw

Aurá
type: Language
type: Concept
ISO 639-3 code: aux
alternative label: Aurá language
definition: Aurá is an extinct Tupi language last spoken by two individuals in Maranhão, Brazil. It is considered an endangered language. Both speakers lived with the Guajá, but originally came from Pará.
in scheme: Lexvo - ISO 639-3 language codes
notation: aux

Awiyaana
type: Language
type: Concept
ISO 639-3 code: auy
in scheme: Lexvo - ISO 639-3 language codes
notation: auy

Uzbeki Arabic
type: Language
type: Concept
ISO 639-3 code: auz
alternative label: Arabic, Uzbeki
definition: Uzbeki Arabic (also known as Jugari, Kashkadarya Arabic) is a variety of Arabic spoken by a few hundred people in the Bukhara province of Uzbekistan. Few members of the ethnic group now speak Arabic. There is no diglossia with Standard Arabic. It is a variety of Central Asian Arabic.
in scheme: Lexvo - ISO 639-3 language codes
notation: auz

Avaric
type: Language
type: Concept
ISO 639-1 code: av
ISO 639-2 Bibliographical code: ava
ISO 639-2 Terminological code: ava
ISO 639-3 code: ava
alternative label: Avar @fr
alternative label: Avar language
alternative label: Awarische Sprache @de
alternative label: Idioma ávaro @es
alternative label: Lingua avara @it
alternative label: Língua avar @pt
definition: The modern Avar language (self-designation магӀарул мацӀ maharul macʼ "language of the mountains" or Авар мацI awar macʼ "Avar language") belongs to the Avar–Andic group of the Northeast Caucasian language family.
in scheme: Lexvo - ISO 639-3 language codes
notation: ava
preferred label: Awarisch @de
preferred label: avar @es
preferred label: avaric @pt
preferred label: avaro @it

Avau
type: Language
type: Concept
ISO 639-3 code: avb
in scheme: Lexvo - ISO 639-3 language codes
notation: avb

Alviri-Vidari
type: Language
type: Concept
ISO 639-3 code: avd
alternative label: Alviri-Vidari language
definition: Alviri-Vidari is an Iranian language spoken in Iran, near Saveh in the Markazi Province. It is classified as one of the Northwestern Iranian languages. Its ISO 639-3 code is avd.
in scheme: Lexvo - ISO 639-3 language codes
notation: avd

Avestan
type: Language
type: Concept
ISO 639-1 code: ae
ISO 639-2 Bibliographical code: ave
ISO 639-2 Terminological code: ave
ISO 639-3 code: ave
alternative label: Avestan language
alternative label: Avestique @fr
alternative label: Avestische Sprache @de
alternative label: Idioma avéstico @es
alternative label: Lingua avestica @it
alternative label: Língua avéstica @pt
definition: Avestan is an East Iranian language known only from its use as the language of Zoroastrian scripture, i.e. the Avesta, from which it derives its name. Its area of composition comprised – at least – Bactria (Gandahara, Vedic: Gandhāra), Arachosia (Quetta), Drangiana (Ribat), and Gedrosia (Balochistan) have been regarded as a likely archaeological reflection of early East Iranian culture as described in the Avesta. Its status as a sacred language has ensured its continuing use for new compositions long after the language had ceased to be a living language.
in scheme: Lexvo - ISO 639-3 language codes
notation: ave
preferred label: Avestisch @de
preferred label: avestan @it
preferred label: avestique @fr
preferred label: avéstico @es

Avikam
type: Language
type: Concept
ISO 639-3 code: avi
alternative label: Avikam language
definition: Avikam is one of the Lagoon languages of Ivory Coast, spoken in Grand Lahou Département, Avikam Canton, South Department. It is a Kwa language, closely related to Alladian, but other than that its position is unclear.
in scheme: Lexvo - ISO 639-3 language codes
notation: avi

Wusi
type: Language
type: Concept
ISO 639-3 code: wsi
in scheme: Lexvo - ISO 639-3 language codes
notation: wsi

Kotava
type: Language
type: Concept
ISO 639-3 code: avk
in scheme: Lexvo - ISO 639-3 language codes
notation: avk

Bedawi Arabic
type: Language
type: Concept
ISO 639-3 code: avl
alternative label: Arabic, Eastern Egyptian Bedawi
alternative label: Eastern Egyptian Bedawi Arabic
definition: Bedawi Arabic (also known as Eastern Egyptian Bedawi Arabic [ISO 639-3], Bedawi, Levantine Bedawi Arabic) is a variety of Arabic spoken by Bedouins mostly in eastern Egypt, and also in Jordan, Israel, the West Bank, the Gaza Strip and Syria. Dialects include Eastern Egyptian Bedawi Arabic, South Levantine Bedawi Arabic, and North Levantine Bedawi Arabic.
in scheme: Lexvo - ISO 639-3 language codes
notation: avl
preferred label: Árabe bedawi @es

Angkamuthi
type: Language
type: Concept
ISO 639-3 code: avm
in scheme: Lexvo - ISO 639-3 language codes
notation: avm

Avatime
type: Language
type: Concept
ISO 639-3 code: avn
alternative label: Avatime language
definition: Avatime, also known as Afatime, Sideme, or Sia, is a Kwa language of the Avatime (self designation: Kedone (m.sg.)) people of eastern Ghana. The Avatime live primarily in the seven towns and villages of Amedzofe, Vane, Gbadzeme, Dzokpe, Biakpe, Dzogbefeme, and Fume.
in scheme: Lexvo - ISO 639-3 language codes
notation: avn

Agavotaguerra
type: Language
type: Concept
ISO 639-3 code: avo
in scheme: Lexvo - ISO 639-3 language codes
notation: avo

Aushiri
type: Language
type: Concept
ISO 639-3 code: avs
alternative label: Aushiri language
definition: Aushiri (Auxira) is an extinct Zaparoan language formerly spoken in Peru. It was spoken in the area of the tributaries to the right bank of the Napo River, in the Escuelacocha region.
in scheme: Lexvo - ISO 639-3 language codes
notation: avs

Au
type: Language
type: Concept
ISO 639-3 code: avt
alternative label: Au language
definition: Au is a Torricelli language of Papua New Guinea.
in scheme: Lexvo - ISO 639-3 language codes
notation: avt

Waskia
type: Language
type: Concept
ISO 639-3 code: wsk
alternative label: Waskia language
definition: Waskia (Vaskia, Woskia) is a Papuan language of Papua New Guinea. It is spoken on half of Karkar Island, and a small part of the shore on the mainland, by 20,000 people; language use is vigorous. The Waskia share their island with speakers of Takia, and Oceanic language which has been restructured under the influence of Waskia, which is the inter-community language.
in scheme: Lexvo - ISO 639-3 language codes
notation: wsk

Avokaya
type: Language
type: Concept
ISO 639-3 code: avu
alternative label: Avokaya language
definition: Avokaya (also spelled Abukeia, Avukaya, or, in Arabic script, ) is a Central Sudanic language spoken in southern South Sudan and parts of the Democratic Republic of Congo. Avokaya speakers occupy a contiguous area along both sides of the international boundary, with Maridi in South Sudan and Faradje in Congo as the main centres of the language. In 2002, the number of Avokaya speakers in South Sudan was estimated to be 40,000, replacing the inaccurate 1982 estimate of 15,000. However, the 1989 estimate of 25,000 speakers in the Congo still stands.
in scheme: Lexvo - ISO 639-3 language codes
notation: avu

Avá-Canoeiro
type: Language
type: Concept
ISO 639-3 code: avv
in scheme: Lexvo - ISO 639-3 language codes
notation: avv

Awadhi
type: Language
type: Concept
ISO 639-2 Bibliographical code: awa
ISO 639-2 Terminological code: awa
ISO 639-3 code: awa
alternative label: Awadhi language
alternative label: Lingua awadhi @it
preferred label: awadhi @it
definition: Awadhi (Devanagari: अवधी) is an Indo-Aryan language, part of the Hindi-Urdu continuum. It is spoken chiefly in the Awadh (Oudh) region of Uttar Pradesh, although its speakers are also found in Bihar, Madhya Pradesh, Delhi and Nepal. Furthermore, the Fiji Hindi dialect spoken by Indo-Fijians is considered a variant of Awadhi, although it has Bhojpuri influence. Awadhi in slightly different forms (influenced by Brij Bhasha, Bundeli and Bagheli) is also spoken in the Vatsa country (Lower Doab) south of Awadh region which includes Kanpur and Allahabad. It is also spoken in most of the Caribbean countries where the people of Uttar Pradesh were taken as indentured workers by the British India government. According to 2001 census, it ranks 29th in the List of languages by number of native speakers in World.
in scheme: Lexvo - ISO 639-3 language codes
notation: awa
preferred label: avadhi @es

Awa
type: Language
type: Concept
ISO 639-3 code: awb
alternative label: Awa (Papua New Guinea)
in scheme: Lexvo - ISO 639-3 language codes
notation: awb

Cicipu
type: Language
type: Concept
ISO 639-3 code: awc
alternative label: cipu language
definition: Cipu (Cicipu), or Western Acipa, is a Benue–Congo language spoken by about 20,000 people in northwest Nigeria. The people call themselves Acipu.
in scheme: Lexvo - ISO 639-3 language codes
notation: awc
preferred label: Cipu @de

Awetí
type: Language
type: Concept
ISO 639-3 code: awe
alternative label: Awetï language
definition: The Aweti language of Brazil is one of the Tupian languages.
in scheme: Lexvo - ISO 639-3 language codes
notation: awe

Anguthimri
type: Language
type: Concept
ISO 639-3 code: awg
in scheme: Lexvo - ISO 639-3 language codes
notation: awg

Awbono
type: Language
type: Concept
ISO 639-3 code: awh
alternative label: Awbono language
definition: Awbono is a recently described language spoken by a hundred monolingual people in the southeast of Papua province, Indonesia. The language is related to neighboring Bayono, with which it shares half its vocabulary, but is otherwise unclassified.
in scheme: Lexvo - ISO 639-3 language codes
notation: awh

Aekyom
type: Language
type: Concept
ISO 639-3 code: awi
alternative label: Awin language
definition: Aekyowm (Akium), also known as Awin (Aiwin) is a Papuan language of Papua New Guinea.
in scheme: Lexvo - ISO 639-3 language codes
notation: awi

Awabakal
type: Language
type: Concept
ISO 639-3 code: awk
alternative label: Awabakal language
definition: Awabakal (also Awabagal) is an Australian Aboriginal language that was spoken around Lake Macquarie and Newcastle in New South Wales. The name is derived from Awaba, which was the native name of the lake.
in scheme: Lexvo - ISO 639-3 language codes
notation: awk

Arawum
type: Language
type: Concept
ISO 639-3 code: awm
in scheme: Lexvo - ISO 639-3 language codes
notation: awm

Owenia
type: Language
type: Concept
ISO 639-3 code: wsr
in scheme: Lexvo - ISO 639-3 language codes
notation: wsr

Awngi
type: Language
type: Concept
ISO 639-3 code: awn
alternative label: Awngi language
definition: The Awngi language, in older publications also called Awiya (an inappropriate ethnonym), is a Central Cushitic language spoken by the Awi people, living in Central Gojjam in northwestern Ethiopia. The language is classified as Southern Central Cushitic or Southern Agaw in the literature, and as such belongs to the Cushitic branch of the Afro-Asiatic language family.
in scheme: Lexvo - ISO 639-3 language codes
notation: awn
preferred label: Língua awngi @pt

Awak
type: Language
type: Concept
ISO 639-3 code: awo
in scheme: Lexvo - ISO 639-3 language codes
notation: awo

Awera
type: Language
type: Concept
ISO 639-3 code: awr
alternative label: Awera language
definition: Awera is a Lakes Plain language of Irian Jaya, Indonesia. It's spoken on the east side of Geelvink Bay, in a single village which has a majority of Ansus speakers.
in scheme: Lexvo - ISO 639-3 language codes
notation: awr

South Awyu
type: Language
type: Concept
ISO 639-3 code: aws
alternative label: Awyu, South
in scheme: Lexvo - ISO 639-3 language codes
notation: aws

Araweté
type: Language
type: Concept
ISO 639-3 code: awt
in scheme: Lexvo - ISO 639-3 language codes
notation: awt

Central Awyu
type: Language
type: Concept
ISO 639-3 code: awu
alternative label: Awyu, Central
in scheme: Lexvo - ISO 639-3 language codes
notation: awu

Copainalá Zoque
type: Language
type: Concept
ISO 639-3 code: zoc
alternative label: Zoque, Copainalá
in scheme: Lexvo - ISO 639-3 language codes
notation: zoc

Jair Awyu
type: Language
type: Concept
ISO 639-3 code: awv
alternative label: Awyu, Jair
in scheme: Lexvo - ISO 639-3 language codes
notation: awv

Wasa
type: Language
type: Concept
ISO 639-3 code: wss
in scheme: Lexvo - ISO 639-3 language codes
notation: wss

Awun
type: Language
type: Concept
ISO 639-3 code: aww
in scheme: Lexvo - ISO 639-3 language codes
notation: aww

Awara
type: Language
type: Concept
ISO 639-3 code: awx
in scheme: Lexvo - ISO 639-3 language codes
notation: awx

Edera Awyu
type: Language
type: Concept
ISO 639-3 code: awy
alternative label: Awyu, Edera
in scheme: Lexvo - ISO 639-3 language codes
notation: awy

Abipon
type: Language
type: Concept
ISO 639-3 code: axb
alternative label: Abipón language
definition: The Abipón language was a native American language of the Mataco–Guaycuru family that was at one time spoken in Argentina by the Abipón people. Its last speaker is thought to have died in the 19th century.
in scheme: Lexvo - ISO 639-3 language codes
notation: axb
preferred label: Abipón @fr

Ayerrerenge
type: Language
type: Concept
ISO 639-3 code: axe
in scheme: Lexvo - ISO 639-3 language codes
notation: axe

Mato Grosso Arára
type: Language
type: Concept
ISO 639-3 code: axg
alternative label: Arára, Mato Grosso
alternative label: Mato Grosso Arára language
definition: Mato Grosso Arára (also disambiguated as Arara do Beiradão or Arara do Rio Branco, and also known as Koaiá ~ Koayá) is an extinct unclassified language of Brazil. The ethnic population numbers about 150.
in scheme: Lexvo - ISO 639-3 language codes
notation: axg
preferred label: Idioma arára @es

Yaka
type: Language
type: Concept
ISO 639-3 code: axk
alternative label: Aka language
alternative label: Yaka (Central African Republic)
definition: Aka, also known as Yaka or Beka, is a Bantu language spoken in the Central African Republic and Republic of Congo, along the Ubangi River dividing the two countries.
in scheme: Lexvo - ISO 639-3 language codes
notation: axk

Wasu
type: Language
type: Concept
ISO 639-3 code: wsu
alternative label: Wasu language
definition: Wasu (Waçu, Wassú) is an extinct unclassified language of Brazil. The ethnic population is about 1,500.
in scheme: Lexvo - ISO 639-3 language codes
notation: wsu

Lower Southern Aranda
type: Language
type: Concept
alternative label: Aranda, Lower Southern
in scheme: Lexvo - ISO 639-3 language codes

Middle Armenian
type: Language
type: Concept
ISO 639-3 code: axm
alternative label: Armenian, Middle
definition: Middle Armenian , also called Cilician Armenian, corresponds to the second period in written Armenian with which numerous books were published between the 12th and 18th centuries. It comes after Grabar (Old Armenian) and before Ashkharhabar (Modern Armenian).
in scheme: Lexvo - ISO 639-3 language codes
notation: axm

Xârâgurè
type: Language
type: Concept
ISO 639-3 code: axx
alternative label: Xaragure
in scheme: Lexvo - ISO 639-3 language codes
notation: axx

Awar
type: Language
type: Concept
ISO 639-3 code: aya
in scheme: Lexvo - ISO 639-3 language codes
notation: aya

Ayizo Gbe
type: Language
type: Concept
ISO 639-3 code: ayb
alternative label: Gbe, Ayizo
in scheme: Lexvo - ISO 639-3 language codes
notation: ayb

Southern Aymara
type: Language
type: Concept
ISO 639-3 code: ayc
alternative label: Aymara, Southern
alternative label: Southern Aymara language
definition: Southern Aymara is a language spoken in Perú between Lake Titicaca and the Pacific Ocean.
in scheme: Lexvo - ISO 639-3 language codes
notation: ayc

Ayabadhu
type: Language
type: Concept
ISO 639-3 code: ayd
in scheme: Lexvo - ISO 639-3 language codes
notation: ayd

Ayere
type: Language
type: Concept
ISO 639-3 code: aye
alternative label: Ayere language
definition: Ayere is a divergent Volta–Niger language of Nigeria, closely related only to Ahaan.
in scheme: Lexvo - ISO 639-3 language codes
notation: aye

Ginyanga
type: Language
type: Concept
ISO 639-3 code: ayg
in scheme: Lexvo - ISO 639-3 language codes
notation: ayg

Hadrami Arabic
type: Language
type: Concept
ISO 639-3 code: ayh
alternative label: Arabic, Hadrami
alternative label: Hadhrami Arabic
definition: Hadhrami Arabic (also known as Hadrami Arabic [ISO-639-3]) is a variety of Arabic spoken by the Hadhrami people living in the . It is also spoken by many Hadhrami emigrants who migrated from to East Africa (Kenya, Somalia and Tanzania), South-east Asia (Indonesia, Malaysia, Brunei and Singapore) and, recently, to the other Gulf countries. Below is a brief account of the different linguistic levels of the dialect.
in scheme: Lexvo - ISO 639-3 language codes
notation: ayh

Leyigha
type: Language
type: Concept
ISO 639-3 code: ayi
in scheme: Lexvo - ISO 639-3 language codes
notation: ayi

Wotapuri-Katarqalai
type: Language
type: Concept
ISO 639-3 code: wsv
in scheme: Lexvo - ISO 639-3 language codes
notation: wsv

Akuku
type: Language
type: Concept
ISO 639-3 code: ayk
in scheme: Lexvo - ISO 639-3 language codes
notation: ayk

Libyan Arabic
type: Language
type: Concept
ISO 639-3 code: ayl
alternative label: Arabic, Libyan
definition: Libyan Arabic (Lībi ليبي; also known as Sulaimitian Arabic) is a collective term for the closely related varieties of Arabic spoken in Libya. It can be divided into two major dialect areas; the eastern centred in Benghazi and Bayda, and the western centred in Tripoli and Misrata. The eastern variety extends beyond the borders to the east into western Egypt.
in scheme: Lexvo - ISO 639-3 language codes
notation: ayl
preferred label: Libysch-Arabisch @de
preferred label: Árabe libio @es
preferred label: Árabe líbio @pt

Aymara
type: Language
type: Concept
ISO 639-1 code: ay
ISO 639-2 Bibliographical code: aym
ISO 639-2 Terminological code: aym
ISO 639-3 code: aym
alternative label: Aymara language
alternative label: Idioma aimara @es
alternative label: Lingua aymara @it
alternative label: Língua aimará @pt
definition: Aymara (Aymar aru) is an Aymaran language spoken by the Aymara people of the Andes. It is one of only a handful of Native American languages with over three million speakers. Aymara, along with Quechua and Spanish, is an official language of Peru and Bolivia. It is also spoken to a much lesser extent in Chile and in Northwest Argentina.
in scheme: Lexvo - ISO 639-3 language codes
notation: aym
preferred label: aimara @es
preferred label: aymara @fr

Sanaani Arabic
type: Language
type: Concept
ISO 639-3 code: ayn
alternative label: Arabic, Sanaani
definition: Sanaani Arabic (also known as North Yemeni Arabic) is an Afro-Asiatic language spoken in north Yemen. It is a variety of Yemeni Arabic.
in scheme: Lexvo - ISO 639-3 language codes
notation: ayn

Ayoreo
type: Language
type: Concept
ISO 639-3 code: ayo
alternative label: Ayoreo language
definition: Ayoreo is a Zamucoan language spoken in both Paraguay and Bolivia. It is also known as Morotoco , Moro, Ayoweo, Ayoré, and Pyeta Yovai. However, the name "Ayoreo" is more common in Bolivia, and "Morotoco" in Paraguay. It is spoken by Ayoreo, an indigenous ethnic group traditionally living on a combined hunter-gatherer and farming lifestyle.
in scheme: Lexvo - ISO 639-3 language codes
notation: ayo

North Mesopotamian Arabic
type: Language
type: Concept
ISO 639-3 code: ayp
alternative label: Arabic, North Mesopotamian
definition: North Mesopotamian Arabic (also known as Maslawi meaning of Mosul) is a variety of Arabic spoken north of the Hamrin Mountains in Iraq, in western Iran, northern Syria, and in southeastern Turkey (in the eastern Mediterranean Region, Southeastern Anatolia Region, and southern Eastern Anatolia Region). Like Iraqi Arabic and Syrian Arabic, it shows some signs of an Aramaic substrate.
in scheme: Lexvo - ISO 639-3 language codes
notation: ayp

Ayi
type: Language
type: Concept
ISO 639-3 code: ayq
alternative label: Ayi (Papua New Guinea)
alternative label: Ayi language
definition: Ayi is a language spoken by approximately 400 people in the southeast of Sandaun Province, Papua-New Guinea.
in scheme: Lexvo - ISO 639-3 language codes
notation: ayq

Watiwa
type: Language
type: Concept
ISO 639-3 code: wtf
alternative label: Dumpu language
definition: With approximately 510 speakers living in six villages in Papua New Guinea, Dumpu is a little-known Trans–New Guinea language. It is also known as Watifa or Watiwa. Surviving mostly as a secret language with which to talk amongst themselves when outsiders are present, the majority of the speakers use Tok Pisin in daily life. Due to its increasingly rare use, it is estimated that this language will be extinct in a few decades.
in scheme: Lexvo - ISO 639-3 language codes
notation: wtf
preferred label: Dumpu @de

Central Aymara
type: Language
type: Concept
ISO 639-3 code: ayr
alternative label: Aymara, Central
definition: Central Aymara (ISO 639-3: ayr) is a branch of the Aymara language spoken by more than 2,227,642 across Southern South America, including 1,785,000 in Bolivians in the high plane altiplano region west of the eastern Andes and more recently some in the Yungas and lowland regions due to internal migration. In Perú, 441,743 speak it in the Lake Titicaca area, especially around Pune. Furthermore there are 899 speakers in the far northern mountainous regions of Chile and quite a few speakers in Argentina, these are mostly sugar mill immigrant workers from Bolivia.
in scheme: Lexvo - ISO 639-3 language codes
notation: ayr

Sorsogon Ayta
type: Language
type: Concept
ISO 639-3 code: ays
alternative label: Ayta, Sorsogon
in scheme: Lexvo - ISO 639-3 language codes
notation: ays

Magbukun Ayta
type: Language
type: Concept
ISO 639-3 code: ayt
alternative label: Ayta, Magbukun
alternative label: Mariveleño language
definition: Mariveleño or Bataan is a Sambalic language. It has around 500 speakers (Wurm 2000) and is spoken within an Aeta community in Mariveles in the Philippines.
in scheme: Lexvo - ISO 639-3 language codes
notation: ayt
preferred label: Idioma mariveleño @es

Ayu
type: Language
type: Concept
ISO 639-3 code: ayu
alternative label: Ayu language
definition: Ayu is a minor and endangered Plateau language of Nigeria. Its subsequent classification is uncertain, but it may be one of the Ninzic languages (Blench 2008). It is not being passed on to many children.
in scheme: Lexvo - ISO 639-3 language codes
notation: ayu

Tayabas Ayta
type: Language
type: Concept
ISO 639-3 code: ayy
alternative label: Ayta, Tayabas
in scheme: Lexvo - ISO 639-3 language codes
notation: ayy

Mai Brat
type: Language
type: Concept
ISO 639-3 code: ayz
alternative label: Ayamaru language
definition: The Ayamaru language, or Mai Brat, is spoken by the Ayamaru people in the many villages around the Ayamaru Lakes on the Bird's Head Peninsula of West Papua. It is only distantly related to other languages, sharing 10% of its vocabulary with its nearest neighbors (apart from the very similar Karon Dori), though it may be part of the West Papuan family.
in scheme: Lexvo - ISO 639-3 language codes
notation: ayz

Azha
type: Language
type: Concept
ISO 639-3 code: aza
alternative label: Azha language
definition: Azha is one of the Loloish languages spoken by the Phula people of China.
in scheme: Lexvo - ISO 639-3 language codes
notation: aza

South Azerbaijani
type: Language
type: Concept
ISO 639-3 code: azb
alternative label: Azerbaijani, South
alternative label: South Azerbaijani language
definition: South Azerbaijani (also known as South Azeri) is a variety of the Azerbaijani language spoken in northwestern Iran and neighboring regions of Iraq and Turkey. Other communities exist in Afghanistan and Syria. Dialects include Aynallu, Karapapakh, Tabriz, Afshari, Shahsavani, Moqaddam, Baharlu, Nafar, Qaragozlu, Pichagchi, Bayat, Qajar. An Arabic script is used to write South Azerbaijani. South Azerbaijani is influenced by the Persian language. While there is a fair degree of mutual intelligibility between South Azerbaijani and North Azerbaijani, there are also morphological and phonological differences between the two varieties, so much so that Ethnologue considers them to be distinct languages and they have separate ISO 639-3 codes.
in scheme: Lexvo - ISO 639-3 language codes
notation: azb

Eastern Durango Nahuatl
type: Language
type: Concept
ISO 639-3 code: azd
alternative label: Nahuatl, Eastern Durango
in scheme: Lexvo - ISO 639-3 language codes
notation: azd

Azeri
type: Language
type: Concept
ISO 639-1 code: az
ISO 639-2 Bibliographical code: aze
ISO 639-2 Terminological code: aze
ISO 639-3 code: aze
alternative label: Aserbaidschanische Sprache @de
alternative label: Azerbaijani
alternative label: Azerbaijani language
alternative label: Azéri @fr
alternative label: Idioma azerí @es
alternative label: Lingua azera @it
alternative label: Língua azeri @pt
alternative label: azerbaigiano @it
alternative label: azerbaijano @pt
definition: Azerbaijani or Azeri or Azerbaijani Turkish (Azərbaycanca, Azərbaycan türkcəsi, Azərbaycan dili) is a language belonging to the Turkic language family, spoken in southwestern Asia by the Azerbaijani people, primarily in Azerbaijan and northwestern Iran. Azerbaijani is member of the Oghuz branch of the Turkic languages and is closely related to Turkish, Qashqai and Turkmen.
in scheme: Lexvo - ISO 639-3 language codes
notation: aze
preferred label: Aserbaidschanisch @de
preferred label: azeri @pt
preferred label: azero @it
preferred label: azerí @es
preferred label: azéri @fr

San Pedro Amuzgos Amuzgo
type: Language
type: Concept
ISO 639-3 code: azg
alternative label: Amuzgo, San Pedro Amuzgos
in scheme: Lexvo - ISO 639-3 language codes
notation: azg

North Azerbaijani
type: Language
type: Concept
ISO 639-3 code: azj
alternative label: Azerbaijani, North
alternative label: North Azerbaijani language
definition: North Azerbaijani (also known as North Azeri) is a variety of the Azerbaijani language spoken in Azerbaijan and neighboring regions of the Caucasus. Expatriate communities exist in Estonia, Georgia, Kazakhstan, Kyrgyzstan, Russia, Turkmenistan, and Uzbekistan. There are reported to be some North Azerbaijani speakers remaining in Armenia. Dialects include Quba, Derbend, Baku, Shamakhi, Salyan, Lenkaran, Qazakh, Airym, Borcala, Terekeme, Qyzylbash, Nukha, Zaqatala, Qabala, Yerevan, Nakhchivan, Ordubad, Ganja, Shusha, Karapapak. Dialect differences are slight.
in scheme: Lexvo - ISO 639-3 language codes
notation: azj

Wathawurrung
type: Language
type: Concept
in scheme: Lexvo - ISO 639-3 language codes

Ipalapa Amuzgo
type: Language
type: Concept
ISO 639-3 code: azm
alternative label: Amuzgo, Ipalapa
in scheme: Lexvo - ISO 639-3 language codes
notation: azm

Western Durango Nahuatl
type: Language
type: Concept
ISO 639-3 code: azn
alternative label: Nahuatl, Western Durango
in scheme: Lexvo - ISO 639-3 language codes
notation: azn

Awing
type: Language
type: Concept
ISO 639-3 code: azo
in scheme: Lexvo - ISO 639-3 language codes
notation: azo

Faire Atta
type: Language
type: Concept
ISO 639-3 code: azt
alternative label: Atta, Faire
in scheme: Lexvo - ISO 639-3 language codes
notation: azt

Highland Puebla Nahuatl
type: Language
type: Concept
ISO 639-3 code: azz
alternative label: Nahuatl, Highland Puebla
definition: Highland Puebla Nahuatl is one of the indigenous Nahuatl language variants, spoken by ethnic Nahua people in northwestern Puebla state in Mexico. Also known as: Náhuat de la Sierra de Puebla, Sierra Puebla Náhuatl, Sierra Aztec, Zacapoaxtla Náhuat, and Mejicano de Zacapoaxtla. The language is characterized by being nontonal, having affixes and having long words.
in scheme: Lexvo - ISO 639-3 language codes
notation: azz

Berta
type: Language
type: Concept
ISO 639-3 code: wti
alternative label: Berta language
definition: Berta, Wetawit, is spoken by the Berta (or Bertha) in Sudan and Ethiopia. It is a language isolate which has been also included as branch of the proposed Nilo-Saharan language family. It has the typical word order subject–verb–object. It is a tonal language. It has significantly influenced some of the Eastern Jebel languages. The Arabic name "Beni-Shangul" (as in the Ethiopian province of Benishangul-Gumuz) derives from a Berta expression (with bele "rock/stone" misanalyzed as Arabic beni "sons"). Berta has several dialects (some quite divergent) including: Bake, Dabuso, Gebeto, Mayu, and Shuru. Fadashi and Undu are divergent enough to be considered separate languages, in which case the dialect name Gebeto may be used for the rest of Berta.
in scheme: Lexvo - ISO 639-3 language codes
notation: wti
preferred label: Idioma berta @es

Babatana
type: Language
type: Concept
ISO 639-3 code: baa
in scheme: Lexvo - ISO 639-3 language codes
notation: baa

Bainouk-Gunyuño
type: Language
type: Concept
ISO 639-3 code: bab
in scheme: Lexvo - ISO 639-3 language codes
notation: bab

Badui
type: Language
type: Concept
ISO 639-3 code: bac
in scheme: Lexvo - ISO 639-3 language codes
notation: bac

Baré
type: Language
type: Concept
ISO 639-3 code: bae
alternative label: Baré language
definition: Baré (Barawana) is an Arawakan language, probably extinct, of Venezuela and Brazil. Aikhenvald (1999) reports "just a few old speakers left" of Baré proper, and that the Guinau variety was extinct. Ethnologue (2009) reports "no known speakers". Kaufman (1994) considers Baré proper, Guinau, and extinct Marawá to be distinct languages; Aikhenvald, dialects of a single languages. (Marawá is not the same language as Marawán.)
in scheme: Lexvo - ISO 639-3 language codes
notation: bae

Nubaca
type: Language
type: Concept
ISO 639-3 code: baf
in scheme: Lexvo - ISO 639-3 language codes
notation: baf

Tuki
type: Language
type: Concept
ISO 639-3 code: bag
alternative label: Ki language
definition: The Ki language, Tuki (Baki, Oki), is a Southern Bantoid language of Cameroon.
in scheme: Lexvo - ISO 639-3 language codes
notation: bag

Bahamian Creole
type: Language
type: Concept
ISO 639-3 code: bah
alternative label: Bahamas Creole English
alternative label: Creole English, Bahamas
definition: Bahamian is an English-based creole language spoken by approximately 400,000 people in the Bahamas and the Turks and Caicos Islands.
in scheme: Lexvo - ISO 639-3 language codes
notation: bah

Barakai
type: Language
type: Concept
ISO 639-3 code: baj
alternative label: Barakai language
definition: Barakai is one of the Aru languages, spoken by inhabitants of the Aru Islands.
in scheme: Lexvo - ISO 639-3 language codes
notation: baj

Bashkir
type: Language
type: Concept
ISO 639-1 code: ba
ISO 639-2 Bibliographical code: bak
ISO 639-2 Terminological code: bak
ISO 639-3 code: bak
alternative label: Baschkirische Sprache @de
alternative label: Bashkir language
alternative label: Idioma bashkir @es
alternative label: Lingua baschira @it
alternative label: Língua bashkir @pt
alternative label: bachkir @fr
definition: The Bashkir language (башҡорт теле başqort tele, pronounced ) is a Turkic language, and is the language of the Bashkirs. It is co-official with Russian in the Republic of Bashkortostan.
in scheme: Lexvo - ISO 639-3 language codes
notation: bak
preferred label: Bachkir @fr
preferred label: Baschkirisch @de
preferred label: baschiro @it
preferred label: bashkir @es

Baluchi
type: Language
type: Concept
ISO 639-2 Bibliographical code: bal
ISO 639-2 Terminological code: bal
ISO 639-3 code: bal
alternative label: Balochi language
alternative label: Baloutche @fr
alternative label: Belutschische Sprache @de
alternative label: Idioma baluchi @es
alternative label: Lingua baluchi @it
alternative label: Língua balúchi @pt
definition: Balochi is a Northwestern Iranian language. It is the principal language of the Baloch of Balochistan, Pakistan, eastern Iran and southern Afghanistan. It is also spoken as a second language by some Brahui. It is designated as one of nine official languages of Pakistan.
in scheme: Lexvo - ISO 639-3 language codes
notation: bal
preferred label: Belutschisch @de
preferred label: baloutchi @fr
preferred label: baluchi @es
preferred label: balúchi @pt
preferred label: beluci @it

Bambara
type: Language
type: Concept
ISO 639-1 code: bm
ISO 639-2 Bibliographical code: bam
ISO 639-2 Terminological code: bam
ISO 639-3 code: bam
alternative label: Bambara language
alternative label: Bambara-Sprache @de
alternative label: Idioma bambara @es
alternative label: Lingua bambara @it
alternative label: Língua bambara @pt
preferred label: bambara @es
definition: Bambara, more correctly known as Bamanankan (ߓߡߊߣߊ߲ߞߊ߲), its designation in the language itself (literally Bamana(n) sound), is a language spoken in Mali by as many as six million people (including second language users). The Bambara language is the mother tongue of the Bambara ethnic group, numbering about 4,000,000 people, but serves also as a lingua franca in Mali (it is estimated that about 80% of the population speaks it as a first or second language). It is an Subject–object–verb language and has two tones.
in scheme: Lexvo - ISO 639-3 language codes
notation: bam

Balinese
type: Language
type: Concept
ISO 639-2 Bibliographical code: ban
ISO 639-2 Terminological code: ban
ISO 639-3 code: ban
alternative label: Balinais @fr
alternative label: Balinese language
alternative label: Balinesische Sprache @de
alternative label: Lingua balinese @it
alternative label: Língua balinesa @pt
definition: Balinese or simply Bali is a Malayo-Polynesian language spoken by 3.3 million people on the Indonesian island of Bali, as well as northern Nusa Penida, western Lombok and eastern Java. Most Balinese speakers also know Indonesian.
in scheme: Lexvo - ISO 639-3 language codes
notation: ban
preferred label: Balinesisch @de
preferred label: balinais @fr
preferred label: balinese @it
preferred label: balinés @es
preferred label: balinês @pt

Waimaha
type: Language
type: Concept
ISO 639-3 code: bao
in scheme: Lexvo - ISO 639-3 language codes
notation: bao

Bantawa
type: Language
type: Concept
ISO 639-3 code: bap
alternative label: Bantawa language
definition: The Bantawa language is an endangered language group. It is a Tibeto-Burman language, Eastern Kiranti languages family, spoken in the eastern Himalayan hills of eastern Nepal by Rai ethnic groups. Bantawa speaking Population estimates vary between 20,000-60,000, though 35,000 speakers may be a more accurate count. It is experiencing Nepali language shift.
in scheme: Lexvo - ISO 639-3 language codes
notation: bap
preferred label: Língua bantawa @pt

Watakataui
type: Language
type: Concept
ISO 639-3 code: wtk
in scheme: Lexvo - ISO 639-3 language codes
notation: wtk

Bavarian
type: Language
type: Concept
ISO 639-3 code: bar
in scheme: Lexvo - ISO 639-3 language codes
notation: bar

Basa
type: Language
type: Concept
ISO 639-2 Bibliographical code: bas
ISO 639-2 Terminological code: bas
ISO 639-3 code: bas
alternative label: Basa (Cameroon)
alternative label: Basaa
alternative label: Basaa language
alternative label: Basaa-Sprache @de
preferred label: Bassa @de
alternative label: Idioma basaa @es
alternative label: bassa @fr
definition: Basaa (also spelled Bassa, Basa, Bissa) is a Bantu language spoken in Cameroon. It is spoken by about 230,000 people in Centre and Littoral provinces.
in scheme: Lexvo - ISO 639-3 language codes
notation: bas
preferred label: basa @es

Bada
type: Language
type: Concept
ISO 639-3 code: bau
alternative label: Bada (Nigeria)
in scheme: Lexvo - ISO 639-3 language codes
notation: bau

Vengo
type: Language
type: Concept
ISO 639-3 code: bav
alternative label: Vengo language
definition: Vengo (Vəŋo), or Babungo, is the Grassfields Bantu language of the Vengo people from the village of Babungo in the Cameroonian Grassfields. The spelling Bamungo is also often found.
in scheme: Lexvo - ISO 639-3 language codes
notation: bav
preferred label: Babungo @de

Bambili-Bambui
type: Language
type: Concept
ISO 639-3 code: baw
in scheme: Lexvo - ISO 639-3 language codes
notation: baw

Bamum
type: Language
type: Concept
ISO 639-3 code: bax
alternative label: Bamum language
preferred label: Bamun
alternative label: Idioma bamum @es
alternative label: Língua bamum @pt
definition: Bamum (Shüpamom "Bamum language"), or in its French spelling Bamoun, is one of the Benue–Congo languages of Cameroon, with approximately a quarter million speakers. The language is well-known for its original script developed by King Njoya and his palace circle around 1895. Cameroonian musicians Claude Ndam and Gerryland are native speakers of the language and use it in their music.
in scheme: Lexvo - ISO 639-3 language codes
notation: bax
preferred label: bamoun @fr
preferred label: bamun @es

Batuley
type: Language
type: Concept
ISO 639-3 code: bay
in scheme: Lexvo - ISO 639-3 language codes
notation: bay

Mewati
type: Language
type: Concept
ISO 639-3 code: wtm
alternative label: Mewati language
definition: Mewati is an Indo-Aryan language spoken by about five million speakers in the Alwar, Bharatpur and Dholpur districts of Rajasthan, Mewat districts of Haryana, as well as parts of southern Pakistan (Sindh) and in Punjab. It contributed profoundly to Rajasthani literature in medieval periods.
in scheme: Lexvo - ISO 639-3 language codes
notation: wtm

Baatonum
type: Language
type: Concept
ISO 639-3 code: bba
alternative label: Bariba language
definition: Bariba, also known as Baatonum (also Baatombu, Baatonu, Barba, Barganchi, Bargawa, Bargu, Baruba, Berba, Bogung, and Burgu) is the language of the Bariba people of Benin and Nigeria and had been the language of the state of Borgu. It is not closely related to other languages.
in scheme: Lexvo - ISO 639-3 language codes
notation: bba
preferred label: Bariba @de

Barai
type: Language
type: Concept
ISO 639-3 code: bbb
in scheme: Lexvo - ISO 639-3 language codes
notation: bbb

Batak Toba
type: Language
type: Concept
ISO 639-3 code: bbc
alternative label: Toba Batak language
definition: The Batak Toba language is an Austronesian language spoken in North Sumatra province in Indonesia. It is part of a group of languages called "Batak".
in scheme: Lexvo - ISO 639-3 language codes
notation: bbc
preferred label: Batak toba @fr

Bau
type: Language
type: Concept
ISO 639-3 code: bbd
in scheme: Lexvo - ISO 639-3 language codes
notation: bbd

Bangba
type: Language
type: Concept
ISO 639-3 code: bbe
alternative label: Bangba language
definition: Bangba (Abangba) is a minor Ubangian language of DRC Congo. It is not close enough to other Eastern Ngbaka languages for mutual intelligibility.
in scheme: Lexvo - ISO 639-3 language codes
notation: bbe

Baibai
type: Language
type: Concept
ISO 639-3 code: bbf
alternative label: Baibai language
definition: Baibai is one of two Fas languages of Papua New Guinea. It is the eponymous language of the spurious Baibai family, which was posited when the Fas language was mistakenly swapped for the Kwomtari language Biaka in published data. It actually has little in common with Kwomtari, but is 40% cognate with Fas. (See Fas languages for details.)
in scheme: Lexvo - ISO 639-3 language codes
notation: bbf

Barama
type: Language
type: Concept
ISO 639-3 code: bbg
in scheme: Lexvo - ISO 639-3 language codes
notation: bbg

Bugan
type: Language
type: Concept
ISO 639-3 code: bbh
alternative label: Bugan language
definition: Bugan, Bogan, Pakan, or Buzhui (布甘语, 布干语, or 布赘语) is an Austro-Asiatic language. The existence of the Bugan language was not known by the rest of world until recently. There are about 3000 speakers, mostly in some villages in southern Guangnan (广南) and northern Xichou (西畴), Yunnan Province, China. Bugan is an analytic language, and word order and auxiliary words have important functions in the grammar.
in scheme: Lexvo - ISO 639-3 language codes
notation: bbh
preferred label: Pakan @fr

Barombi
type: Language
type: Concept
ISO 639-3 code: bbi
alternative label: rombi language
definition: Lombi is a language spoken in the Meme department of the Southwest Province of southwestern Cameroon by the Barombi (Barumbi, Balombi) people. It has a lexical similarity of 86% with Bankon, which is spoken in the nearby Moungo department of Littoral Province.
in scheme: Lexvo - ISO 639-3 language codes
notation: bbi

Ghomala
type: Language
type: Concept
ISO 639-3 code: bbj
alternative label: Ghomala' language
alternative label: Ghomala’ @fr
alternative label: Ghomálá'
definition: Ghɔmálá’, or Bamileke-Banjun (Bamiléké-Bandjoun), is a major Grassfields language of Cameroon.
in scheme: Lexvo - ISO 639-3 language codes
notation: bbj
preferred label: Ghomala' @de
preferred label: ghomala @es

Chimalapa Zoque
type: Language
type: Concept
ISO 639-3 code: zoh
alternative label: Zoque, Chimalapa
definition: Chimalapa Zoque is a Zoquean language of Santa María Chimalapa and San Miguel Chimalapa villages in Oaxaca, Mexico.
in scheme: Lexvo - ISO 639-3 language codes
notation: zoh

Babanki
type: Language
type: Concept
ISO 639-3 code: bbk
in scheme: Lexvo - ISO 639-3 language codes
notation: bbk

Wotu
type: Language
type: Concept
ISO 639-3 code: wtw
in scheme: Lexvo - ISO 639-3 language codes
notation: wtw

Bats
type: Language
type: Concept
ISO 639-3 code: bbl
alternative label: Bats language
definition: Bats (also Batsi, Batsbi, Batsb, Batsaw, Tsova-Tush) is the language of the Bats people, a Caucasian minority group, and is part of the Nakh family of Caucasian languages. It had 2,500 to 3,000 speakers in 1975.
in scheme: Lexvo - ISO 639-3 language codes
notation: bbl
preferred label: Batsische Sprache @de
preferred label: Lingua bats @it

Babango
type: Language
type: Concept
ISO 639-3 code: bbm
in scheme: Lexvo - ISO 639-3 language codes
notation: bbm

Uneapa
type: Language
type: Concept
ISO 639-3 code: bbn
alternative label: Uneapa language
definition: Uneapa (sometimes called "Bali") is an Oceanic language spoken by about 10,000 people on Bali Island, West New Britain Province, Papua New Guinea.
in scheme: Lexvo - ISO 639-3 language codes
notation: bbn

Konabéré
type: Language
type: Concept
ISO 639-3 code: bbo
alternative label: Bobo Madaré, Northern
alternative label: Northern Bobo Madaré
in scheme: Lexvo - ISO 639-3 language codes
notation: bbo

West Central Banda
type: Language
type: Concept
ISO 639-3 code: bbp
alternative label: Banda, West Central
alternative label: West Banda language
definition: West Banda is a minor Banda language, spoken by 10,000 or so people.. Dialects: Dakpa, Gbaga-Nord (Gbaga-2), Gbi, Vita, Wojo (Hodjo).
in scheme: Lexvo - ISO 639-3 language codes
notation: bbp

Bamali
type: Language
type: Concept
ISO 639-3 code: bbq
in scheme: Lexvo - ISO 639-3 language codes
notation: bbq

Girawa
type: Language
type: Concept
ISO 639-3 code: bbr
alternative label: Girawa language
definition: Girawa, also known as Bagasin (Begasin, Begesin), is a Papuan language of Papua New Guinea.
in scheme: Lexvo - ISO 639-3 language codes
notation: bbr

Wikngenchera
type: Language
type: Concept
ISO 639-3 code: wua
in scheme: Lexvo - ISO 639-3 language codes
notation: wua

Bakpinka
type: Language
type: Concept
ISO 639-3 code: bbs
in scheme: Lexvo - ISO 639-3 language codes
notation: bbs

Mburku
type: Language
type: Concept
ISO 639-3 code: bbt
alternative label: Mburku language
definition: Mburku is an Afro-Asiatic language spoken in Bauchi State, Nigeria.
in scheme: Lexvo - ISO 639-3 language codes
notation: bbt

Kulung
type: Language
type: Concept
ISO 639-3 code: bbu
alternative label: Kulung (Nigeria)
alternative label: Kulung language
definition: Kulung is one of the Bantoid Jarawan languages of Nigeria. The number of speakers is not known; a figure of 15,000 was published in 1973.
in scheme: Lexvo - ISO 639-3 language codes
notation: bbu

Karnai
type: Language
type: Concept
ISO 639-3 code: bbv
alternative label: Karnai language
definition: Karnai is an Austronesian language spoken by about 915 individuals in small villages near Wasu, Morobe Province, on Umboi Island, and near Saidor in Madang Province, Papua New Guinea.
in scheme: Lexvo - ISO 639-3 language codes
notation: bbv

Baba
type: Language
type: Concept
ISO 639-3 code: bbw
in scheme: Lexvo - ISO 639-3 language codes
notation: bbw

Bubia
type: Language
type: Concept
ISO 639-3 code: bbx
in scheme: Lexvo - ISO 639-3 language codes
notation: bbx

Befang
type: Language
type: Concept
ISO 639-3 code: bby
alternative label: Menchum language
definition: Menchum, or Befang, is a divergent Bantoid language of Cameroon. It may be a Grassfields language or closer to Tivoid.
in scheme: Lexvo - ISO 639-3 language codes
notation: bby

Wunambal
type: Language
type: Concept
ISO 639-3 code: wub
in scheme: Lexvo - ISO 639-3 language codes
notation: wub

Babalia Creole Arabic
type: Language
type: Concept
ISO 639-3 code: bbz
alternative label: Creole Arabic, Babalia
in scheme: Lexvo - ISO 639-3 language codes
notation: bbz

Central Bai
type: Language
type: Concept
ISO 639-3 code: bca
alternative label: Bai, Central
in scheme: Lexvo - ISO 639-3 language codes
notation: bca

Bainouk-Samik
type: Language
type: Concept
ISO 639-3 code: bcb
in scheme: Lexvo - ISO 639-3 language codes
notation: bcb

Southern Balochi
type: Language
type: Concept
ISO 639-3 code: bcc
alternative label: Balochi, Southern
in scheme: Lexvo - ISO 639-3 language codes
notation: bcc

North Babar
type: Language
type: Concept
ISO 639-3 code: bcd
alternative label: Babar, North
in scheme: Lexvo - ISO 639-3 language codes
notation: bcd

Bamenyam
type: Language
type: Concept
ISO 639-3 code: bce
in scheme: Lexvo - ISO 639-3 language codes
notation: bce

Bamu
type: Language
type: Concept
ISO 639-3 code: bcf
in scheme: Lexvo - ISO 639-3 language codes
notation: bcf

Wudu
type: Language
type: Concept
ISO 639-3 code: wud
in scheme: Lexvo - ISO 639-3 language codes
notation: wud

Baga Binari
type: Language
type: Concept
ISO 639-3 code: bcg
in scheme: Lexvo - ISO 639-3 language codes
notation: bcg

Bariai
type: Language
type: Concept
ISO 639-3 code: bch
in scheme: Lexvo - ISO 639-3 language codes
notation: bch

Baoulé
type: Language
type: Concept
ISO 639-3 code: bci
alternative label: Baoulé language
definition: Baoulé is a Central Tano language spoken in Ivory Coast.
in scheme: Lexvo - ISO 639-3 language codes
notation: bci
preferred label: Baule @de
preferred label: Língua baoulé @pt

Bardi
type: Language
type: Concept
ISO 639-3 code: bcj
alternative label: Bardi language
definition: Bardi (also Baardi, Baard) is a moribund Australian Aboriginal language. There are approximately 20 speakers out of an ethnic population of 380.
in scheme: Lexvo - ISO 639-3 language codes
notation: bcj

Bunaba
type: Language
type: Concept
ISO 639-3 code: bck
alternative label: Bunuba language
definition: Bunuba (Bunaba, Punuba, Punapa) is an Australian Aboriginal language spoken by some 160 older adults, most of whom live in or near Fitzroy Crossing in Western Australia.
in scheme: Lexvo - ISO 639-3 language codes
notation: bck

Central Bikol
type: Language
type: Concept
ISO 639-3 code: bcl
alternative label: Bikol, Central
alternative label: Central Bikolano language
definition: Central Bicolano (also known as Bikol Central), is one of the individual languages of the Bikol languages. It belongs to Coastal Bikol. It is spoken in Bicol Region of the Philippines (Region V).
in scheme: Lexvo - ISO 639-3 language codes
notation: bcl
preferred label: Bicolano central @fr

Bannoni
type: Language
type: Concept
ISO 639-3 code: bcm
in scheme: Lexvo - ISO 639-3 language codes
notation: bcm

Wutunhua
type: Language
type: Concept
ISO 639-3 code: wuh
alternative label: Wutun language
definition: Wutun language (, Wǔtún huà), is a Chinese–Tibetan–Mongolian mixed language. It is spoken by about 2,000 people, most of whom are classified as Monguor (Tu) by the Chinese government, living in two villages (Upper and Lower Wutun) in Tongren County, in the eastern part of the Qinghai province in western People's Republic of China.
in scheme: Lexvo - ISO 639-3 language codes
notation: wuh

Bali
type: Language
type: Concept
ISO 639-3 code: bcn
alternative label: Bali (Nigeria)
alternative label: Bali language
definition: Bali (also known as Bibaali, Maya, Abaali, Ibaale, or Ibaali) is a Niger–Congo language spoken by 100,000 people in Demsa, Adamawa, Nigeria.
in scheme: Lexvo - ISO 639-3 language codes
notation: bcn

Kaluli
type: Language
type: Concept
ISO 639-3 code: bco
alternative label: Kaluli language
definition: Kaluli, or Bosavi, is a Papuan language of Papua New Guinea. Named dialects are Ologo, Kaluli, Walulu, Kugenesi, but differences are not significant.
in scheme: Lexvo - ISO 639-3 language codes
notation: bco

Bali
type: Language
type: Concept
ISO 639-3 code: bcp
alternative label: Bali (Democratic Republic of Congo)
alternative label: Bali language
definition: Bali (Kibali, Libaali) is a Bantu language of the Democratic Republic of the Congo. It is not close to other Bantu languages.
in scheme: Lexvo - ISO 639-3 language codes
notation: bcp

Bench
type: Language
type: Concept
ISO 639-3 code: bcq
alternative label: Bench language
definition: Bench (also called Gimira, considered a derogatory term) is a Northern Omotic language of the "Gimojan" subgroup, spoken by about 174,000 people (as of 1998) in the Bench Maji Zone of the Southern Nations, Nationalities, and Peoples Region, in southern Ethiopia, around the towns of Mizan Teferi and Shewa Gimira. It has three mutually intelligible dialects: Bench proper, She, and Mer. In unusual variance from most of the other languages in Africa, Bench has retroflex consonant phonemes. The language is also noteworthy in that it has six phonemic tones, one of only a handful of languages in the world that have this many.
in scheme: Lexvo - ISO 639-3 language codes
notation: bcq
preferred label: Gimira @fr
preferred label: Língua bench @pt

Babine
type: Language
type: Concept
ISO 639-3 code: bcr
alternative label: Babine-Witsuwit'en language
definition: Babine–Witsuwiten or Nadot’en-Wets’uwet’en is an Athabaskan language spoken in the Central Interior of British Columbia. Its closest relative is Carrier. Because of this linguistic relationship together with political and cultural ties, Babine–Witsuwiten is often referred to as Northern Carrier or Western Carrier. Specialist opinion is, however, that it should be considered a separate, though related, language (Kari 1975, Story 1984, Kari and Hargus 1989).
in scheme: Lexvo - ISO 639-3 language codes
notation: bcr

Kohumono
type: Language
type: Concept
ISO 639-3 code: bcs
alternative label: Humono language
definition: The Humono language, Kohumono (Bahumono, Ohumono), is a Upper Cross River language of Nigeria.
in scheme: Lexvo - ISO 639-3 language codes
notation: bcs

Bendi
type: Language
type: Concept
ISO 639-3 code: bct
in scheme: Lexvo - ISO 639-3 language codes
notation: bct

Awad Bing
type: Language
type: Concept
ISO 639-3 code: bcu
alternative label: Awad Bing language
definition: Awad Bing is an Austronesian language spoken by about 1,100 people in seven villages near Astrolabe Bay, Madang Province, Papua New Guinea. Almost all speakers also use Tok Pisin as a second language. Awad Bing is also spoken by a few Ngaing for trading purposes.
in scheme: Lexvo - ISO 639-3 language codes
notation: bcu
preferred label: Awad bing @fr

Shoo-Minda-Nye
type: Language
type: Concept
ISO 639-3 code: bcv
in scheme: Lexvo - ISO 639-3 language codes
notation: bcv

Bana
type: Language
type: Concept
ISO 639-3 code: bcw
alternative label: Bana language
definition: Bana is an Afro-Asiatic language spoken in northern Cameroon. Dialects include Gamboura and Gili.
in scheme: Lexvo - ISO 639-3 language codes
notation: bcw

Bacama
type: Language
type: Concept
ISO 639-3 code: bcy
alternative label: Bacama language
definition: Bacama is an Afro-Asiatic language spoken in Nigeria in Adamawa State in the Numan and Guyuk LGAs, and in Kaduna State northeast of Kaduna town. Dialects are Mulyen, Opalo, and Wa-Duku. Bacama is used as a trade language. It is often considered the same languages as Bata.
in scheme: Lexvo - ISO 639-3 language codes
notation: bcy

Silimo
type: Language
type: Concept
ISO 639-3 code: wul
in scheme: Lexvo - ISO 639-3 language codes
notation: wul

Bainouk-Gunyaamolo
type: Language
type: Concept
ISO 639-3 code: bcz
in scheme: Lexvo - ISO 639-3 language codes
notation: bcz

Bayot
type: Language
type: Concept
ISO 639-3 code: bda
alternative label: Bayot language
definition: Bayot (Baiot, Baiote, Bayotte) is a language of southern Senegal, southwest of Ziguinchor in a group of villages near Nyassia, in northwestern Guinea-Bissau, along the Senegalese border, and in The Gambia.
in scheme: Lexvo - ISO 639-3 language codes
notation: bda
preferred label: Bayotte @fr

Basap
type: Language
type: Concept
ISO 639-3 code: bdb
in scheme: Lexvo - ISO 639-3 language codes
notation: bdb

Emberá-Baudó
type: Language
type: Concept
ISO 639-3 code: bdc
alternative label: Baudo language
definition: Baudó Emberá Baudó is an Embera language of Colombia. It is partially intelligible with both Northen Embera and Eperara, and it's not clear which branch of Embera it belongs to.
in scheme: Lexvo - ISO 639-3 language codes
notation: bdc
preferred label: Emberá chamí @fr

Bunama
type: Language
type: Concept
ISO 639-3 code: bdd
in scheme: Lexvo - ISO 639-3 language codes
notation: bdd

Bade
type: Language
type: Concept
ISO 639-3 code: bde
alternative label: Bade language
definition: Bade (also spelled Bede or Bedde) is a West Chadic language spoken by the Bade people in Yobe State and Jigawa State, Nigeria. Their traditional ruler is the Emir of Bade. There are three major dialects of Bade, Western Bade, Gashua Bade (spoken in Gashua), and Southern Bade. Speakers are shifting to Hausa.
in scheme: Lexvo - ISO 639-3 language codes
notation: bde

Biage
type: Language
type: Concept
ISO 639-3 code: bdf
in scheme: Lexvo - ISO 639-3 language codes
notation: bdf

Wumbvu
type: Language
type: Concept
ISO 639-3 code: wum
in scheme: Lexvo - ISO 639-3 language codes
notation: wum

Bonggi
type: Language
type: Concept
ISO 639-3 code: bdg
in scheme: Lexvo - ISO 639-3 language codes
notation: bdg

Baka
type: Language
type: Concept
ISO 639-3 code: bdh
alternative label: Baka (Sudan)
alternative label: Baka language
definition: Baka (Tara Baka) is a Central Sudanic language of South Sudan, with a couple thousand speakers in the DRC.
in scheme: Lexvo - ISO 639-3 language codes
notation: bdh

Burun
type: Language
type: Concept
ISO 639-3 code: bdi
alternative label: Burun language
definition: Burun is a Luo language of Sudan. It forms a dialect continuum with Mabaan.
in scheme: Lexvo - ISO 639-3 language codes
notation: bdi

Bai
type: Language
type: Concept
ISO 639-3 code: bdj
alternative label: Bai language
definition: Bai (Belanda, Biri, BGamba, Gumba, Mbegumba, Mvegumba) is a Ubangian language of South Sudan.
in scheme: Lexvo - ISO 639-3 language codes
notation: bdj

Budukh
type: Language
type: Concept
ISO 639-3 code: bdk
alternative label: Budukh language
definition: Budukh or Budugh is a Samur language of the Northeast Caucasian language family spoken in parts of the Quba Rayon of Azerbaijan. It was reportedly spoken by approximately 1,000 Budukhs in 1990, but Authier (2010) reports at most 200 speakers.
in scheme: Lexvo - ISO 639-3 language codes
notation: bdk
preferred label: Buduchische Sprache @de

Indonesian Bajau
type: Language
type: Concept
ISO 639-3 code: bdl
alternative label: Bajau, Indonesian
in scheme: Lexvo - ISO 639-3 language codes
notation: bdl

Buduma
type: Language
type: Concept
ISO 639-3 code: bdm
alternative label: Buduma language
definition: Buduma (also known as Boudouma, Yidena, Yedima, Yedina, Yidana) is an Afro-Asiatic language spoken in western Chad and neighboring Cameroon and Nigeria.
in scheme: Lexvo - ISO 639-3 language codes
notation: bdm

Bungu
type: Language
type: Concept
ISO 639-3 code: wun
alternative label: Bungu language
definition: Bungu (Kibungu, Wungu) is a Bantu language of Tanzania.
in scheme: Lexvo - ISO 639-3 language codes
notation: wun

Baldemu
type: Language
type: Concept
ISO 639-3 code: bdn
alternative label: Baldemu language
definition: Baldemu is a nearly extinct Afro-Asiatic language spoken in northern Cameroon. Speakers have been shifting to Fulfulde.
in scheme: Lexvo - ISO 639-3 language codes
notation: bdn

Morom
type: Language
type: Concept
ISO 639-3 code: bdo
in scheme: Lexvo - ISO 639-3 language codes
notation: bdo

Bende
type: Language
type: Concept
ISO 639-3 code: bdp
in scheme: Lexvo - ISO 639-3 language codes
notation: bdp

Bahnar
type: Language
type: Concept
ISO 639-3 code: bdq
alternative label: Bahnar language
definition: The Bahnar language is a Central Bahnaric language. It has nine vowel qualities and phonemic vowel length.
in scheme: Lexvo - ISO 639-3 language codes
notation: bdq

West Coast Bajau
type: Language
type: Concept
ISO 639-3 code: bdr
alternative label: Bajau, West Coast
in scheme: Lexvo - ISO 639-3 language codes
notation: bdr

Burunge
type: Language
type: Concept
ISO 639-3 code: bds
alternative label: Burunge language
definition: Burunge is an Afro-Asiatic language spoken in Tanzania in the Dodoma Region.
in scheme: Lexvo - ISO 639-3 language codes
notation: bds

Bokoto
type: Language
type: Concept
ISO 639-3 code: bdt
in scheme: Lexvo - ISO 639-3 language codes
notation: bdt

Oroko
type: Language
type: Concept
ISO 639-3 code: bdu
alternative label: Oroko language
definition: Oroko, or Bakundu-Balue, is a poorly known Bantu language spoken in Cameroon.
in scheme: Lexvo - ISO 639-3 language codes
notation: bdu

Bodo Parja
type: Language
type: Concept
ISO 639-3 code: bdv
in scheme: Lexvo - ISO 639-3 language codes
notation: bdv

Baham
type: Language
type: Concept
ISO 639-3 code: bdw
alternative label: Baham language
definition: Baham is a Papuan language spoken on the Bomberai Peninsula.
in scheme: Lexvo - ISO 639-3 language codes
notation: bdw

Budong-Budong
type: Language
type: Concept
ISO 639-3 code: bdx
in scheme: Lexvo - ISO 639-3 language codes
notation: bdx

Wurrugu
type: Language
type: Concept
ISO 639-3 code: wur
alternative label: Wurrugu language
definition: Notes on the consonant inventory
in scheme: Lexvo - ISO 639-3 language codes
notation: wur

Bandjalang
type: Language
type: Concept
ISO 639-3 code: bdy
alternative label: Bandjalang language
definition: Bundjalung is an Australian Indigenous language of North-Eastern New South Wales.
in scheme: Lexvo - ISO 639-3 language codes
notation: bdy

Badeshi
type: Language
type: Concept
ISO 639-3 code: bdz
in scheme: Lexvo - ISO 639-3 language codes
notation: bdz

Beaver
type: Language
type: Concept
ISO 639-3 code: bea
alternative label: Danezaa language
definition: Danezaa (ᑕᓀᖚ Dane-zaa, Dunneza), also known as Tsattine or traditionally as Beaver, is an Athabascan language of western Canada. About half of the Danezaa people speak the language.
in scheme: Lexvo - ISO 639-3 language codes
notation: bea
preferred label: Langue Danezaa @fr

Bebele
type: Language
type: Concept
ISO 639-3 code: beb
in scheme: Lexvo - ISO 639-3 language codes
notation: beb

Iceve-Maci
type: Language
type: Concept
ISO 639-3 code: bec
in scheme: Lexvo - ISO 639-3 language codes
notation: bec

Bedoanas
type: Language
type: Concept
ISO 639-3 code: bed
in scheme: Lexvo - ISO 639-3 language codes
notation: bed

Byangsi
type: Language
type: Concept
ISO 639-3 code: bee
alternative label: Byangsi language
definition: Byangsi (Rangkas) was a West Himalayish language of India and Nepal.
in scheme: Lexvo - ISO 639-3 language codes
notation: bee

Benabena
type: Language
type: Concept
ISO 639-3 code: bef
alternative label: Benabena language
definition: Benabena (Bena) is a Papuan language spoken in the Goroka District of Eastern Highlands Province, Papua New Guinea.
in scheme: Lexvo - ISO 639-3 language codes
notation: bef

Belait
type: Language
type: Concept
ISO 639-3 code: beg
in scheme: Lexvo - ISO 639-3 language codes
notation: beg

Biali
type: Language
type: Concept
ISO 639-3 code: beh
alternative label: Berba language
definition: Biali Berba is a Gur language of Benin. There are also a thousand or so speakers in Burkina, where they are believed to have originated.
in scheme: Lexvo - ISO 639-3 language codes
notation: beh

Bekati'
type: Language
type: Concept
ISO 639-3 code: bei
alternative label: Bakati’ language
definition: Bekati’ (Bekatiq, Bakati) is a Dayak language of Borneo.
in scheme: Lexvo - ISO 639-3 language codes
notation: bei

Wutung
type: Language
type: Concept
ISO 639-3 code: wut
alternative label: Wutung language
definition: Wutung (Udung) is a Skou language of Papua New Guinea which is spoken in the villages of Wutung and Sangke. The two varieties are sometimes considered separate languages.
in scheme: Lexvo - ISO 639-3 language codes
notation: wut

Beja
type: Language
type: Concept
ISO 639-2 Bibliographical code: bej
ISO 639-2 Terminological code: bej
ISO 639-3 code: bej
alternative label: Bedauye @de
alternative label: Bedawiyet
alternative label: Beja language
alternative label: Idioma beya @es
alternative label: Lingua begia @it
alternative label: Língua beja @pt
alternative label: bedja @fr
definition: Beja (also called Bedawi, Bedauye, To Bedawie) or North Cushitic is an Afro-Asiatic language of the southern coast of the Red Sea, spoken by about two million nomads, the Beja, in parts of Egypt, Sudan, and Eritrea.
in scheme: Lexvo - ISO 639-3 language codes
notation: bej
preferred label: Bedscha @de
preferred label: begia @it
preferred label: beja @es

Bebeli
type: Language
type: Concept
ISO 639-3 code: bek
in scheme: Lexvo - ISO 639-3 language codes
notation: bek

Belarusian
type: Language
type: Concept
ISO 639-1 code: be
ISO 639-2 Bibliographical code: bel
ISO 639-2 Terminological code: bel
ISO 639-3 code: bel
alternative label: Belarusian language
alternative label: Idioma bielorruso @es
alternative label: Lingua bielorussa @it
alternative label: Língua bielorrussa @pt
alternative label: Weissrussisch @de
alternative label: Weißrussische Sprache @de
alternative label: biélorusse @fr
definition: The Belarusian language (беларуская мова, BGN/PCGN: byelaruskaya mova, Scientific: belaruskaja mova, łac.: biełaruskaja mova), sometimes referred to as White Russian or White Ruthenian, is the language of the Belarusian people. It is an official language of Belarus, along with Russian, and is spoken abroad, chiefly in Russia, Ukraine, and Poland. Prior to Belarus gaining its independence from the Soviet Union in 1992, the language was known in English as Byelorussian or Belorussian, transliterating the Russian name, , or alternatively as White Russian or White Ruthenian. Following independence, it was also called Belarusian.
in scheme: Lexvo - ISO 639-3 language codes
notation: bel
preferred label: Biélorusse @fr
preferred label: Weißrussisch @de
preferred label: bielo-russo @pt
preferred label: bielorruso @es
preferred label: bielorusso @it

Bemba
type: Language
type: Concept
ISO 639-2 Bibliographical code: bem
ISO 639-2 Terminological code: bem
ISO 639-3 code: bem
alternative label: Bemba (Zambia)
alternative label: Bemba language
alternative label: Bemba-Sprache @de
alternative label: Idioma bemba @es
alternative label: Lingua bemba @it
alternative label: Língua bemba @pt
definition: The Bemba language, ChiBemba (also spelled Cibemba, Ichibemba, Icibemba and Chiwemba), is a major Bantu language spoken primarily in north-eastern Zambia by the Bemba people and as a lingua franca by about 18 related ethnic groups, including the Bisa people of Mpika and Lake Bangweulu, and to a lesser extent in Katanga in the Democratic Republic of the Congo, Tanzania, and Botswana. Including all its dialects, Bemba is the most spoken indigenous language in Zambia.
in scheme: Lexvo - ISO 639-3 language codes
notation: bem
preferred label: bemba @es
preferred label: wemba @it

Bengali
type: Language
type: Concept
ISO 639-1 code: bn
ISO 639-2 Bibliographical code: ben
ISO 639-2 Terminological code: ben
ISO 639-3 code: ben
alternative label: Bengali language
alternative label: Bengalische Sprache @de
alternative label: Idioma bengalí @es
alternative label: Lingua bengalese @it
alternative label: Língua bengali @pt
preferred label: bengali @pt
definition: Bengali (বাংলা Bangla ) is an eastern Indo-Aryan language. It is native to the region of eastern South Asia known as Bengal, which comprises present day Bangladesh, the Indian state of West Bengal (recently proposed to change it to new English name Paschimbanga ) , and parts of the Indian states of Tripura and Assam. It is written with the Bengali script. With nearly 300 million total speakers, ) in the world.
in scheme: Lexvo - ISO 639-3 language codes
notation: ben
preferred label: Bengalisch @de
preferred label: bengalese @it
preferred label: bengalí @es

Beami
type: Language
type: Concept
ISO 639-3 code: beo
alternative label: Beami language
definition: Beami (Bedamini, Bedamuni, Mougulu) is a Papuan language of Papua New Guinea. Komofio is a dialect.
in scheme: Lexvo - ISO 639-3 language codes
notation: beo

Besoa
type: Language
type: Concept
ISO 639-3 code: bep
in scheme: Lexvo - ISO 639-3 language codes
notation: bep

Beembe
type: Language
type: Concept
ISO 639-3 code: beq
alternative label: Bembe (Kibembe) language
definition: Bembe (Kibembe) is a minor Bantu language of Congo. It is closely related to Kikongo. Pangwa (not the Pangwa of Tanzania) may be a dialect.
in scheme: Lexvo - ISO 639-3 language codes
notation: beq

Besme
type: Language
type: Concept
ISO 639-3 code: bes
in scheme: Lexvo - ISO 639-3 language codes
notation: bes

Guiberoua Béte
type: Language
type: Concept
ISO 639-3 code: bet
alternative label: Béte, Guiberoua
in scheme: Lexvo - ISO 639-3 language codes
notation: bet

Blagar
type: Language
type: Concept
ISO 639-3 code: beu
in scheme: Lexvo - ISO 639-3 language codes
notation: beu

Wu Chinese
type: Language
type: Concept
ISO 639-3 code: wuu
alternative label: Chinese, Wu
definition: Wu (, ) is a grouping of linguistically similar and historically related varieties of spoken Chinese also known as a dialect family. Chinese varieties classified as Wu are primarily spoken in Zhejiang province, the municipality of Shanghai, and southern Jiangsu province.
in scheme: Lexvo - ISO 639-3 language codes
notation: wuu
preferred label: Chino wu @es
preferred label: Lingua wu @it
preferred label: Língua wu @pt
preferred label: Wu @de

Daloa Bété
type: Language
type: Concept
ISO 639-3 code: bev
alternative label: Bété, Daloa
in scheme: Lexvo - ISO 639-3 language codes
notation: bev

Betawi
type: Language
type: Concept
ISO 639-3 code: bew
alternative label: Betawi language
definition: The Betawi language is the spoken language of the Betawi people in Jakarta, Indonesia. It is the native language of about 2,700,000 people (1993). It is a Malay-based creole, and closely related to Malay language. Betawi vocabulary have large amount of Hokkien Chinese, Arabic, and Dutch loanwords. The first person pronoun gue (I or me) and second person pronoun lu (you) also with numerical such as cepek (a hundred), gopek (five hundred), and seceng (a thousand) clearly demonstrate Hokkien dialect, while the words ente (you) and ane (me) clearly derived from Arabic.
in scheme: Lexvo - ISO 639-3 language codes
notation: bew

Jur Modo
type: Language
type: Concept
ISO 639-3 code: bex
alternative label: Jur Modo language
definition: Jur Modo, also known as Jur or Modo, is a Central Sudanic language spoken by the Jur Modo people of South Sudan. Dialects are Lori, Modo (Jur Modo, Modo Lali), Wira, Wetu. It is a tonal language.
in scheme: Lexvo - ISO 639-3 language codes
notation: bex
preferred label: Modo @fr

Beli
type: Language
type: Concept
ISO 639-3 code: bey
alternative label: Beli (Papua New Guinea)
alternative label: Beli language
definition: Beli is a Torricelli language of Papua New Guinea. It is also known as Akuwagel, Makarim, Mukili.
in scheme: Lexvo - ISO 639-3 language codes
notation: bey

Bena
type: Language
type: Concept
ISO 639-3 code: bez
preferred label: Bena (Tanzania)
alternative label: Bena language
definition: Bena is a Bantu language spoken by the Bena people of the Iringa region of Tanzania.
in scheme: Lexvo - ISO 639-3 language codes
notation: bez
preferred label: bena @es
preferred label: béna @fr

Bari
type: Language
type: Concept
ISO 639-3 code: bfa
alternative label: Kuku dialect
definition: This article is about the language for the ethnic group see Kuku people. The Kuku language, also called Kutuk na Kuku (Kuku language) belongs to the Bari language group, of the Southeastern Nilotic branch of the Nilotic language family of the Southern Sudan and Northern Uganda. There is no standardized writing system for Kuku; it is sometimes written using the alphabet of a related language such as Bari or Kakwa, with the addition of characters to represent sounds that are not present in the other language. For example, the Bari alphabet can be adjusted for use in Kuku by adding the digraphs gb and kp to represent the voiced and voiceless labiovelar stops, respectively.
in scheme: Lexvo - ISO 639-3 language codes
notation: bfa
preferred label: Kuku @fr

Pauri Bareli
type: Language
type: Concept
ISO 639-3 code: bfb
alternative label: Bareli, Pauri
alternative label: Pauri Bareli language
definition: Pauri Bareli is a Bhil language of India. It is close to two other languages called Bareli, Rathwi (not Rathwi Bhilali) and Palya, as well as to Kalto, but is not mutually intelligible with them.
in scheme: Lexvo - ISO 639-3 language codes
notation: bfb

Northern Bai
type: Language
type: Concept
ISO 639-3 code: bfc
alternative label: Bai, Northern
in scheme: Lexvo - ISO 639-3 language codes
notation: bfc

Bafut
type: Language
type: Concept
ISO 639-3 code: bfd
preferred label: bafut @es
alternative label: fut language
definition: The Bafut language, Fut, is an Eastern Grassfields language of the Niger–Congo languages, and related to Bamum. Oral tradition traces dynastic origins to the Ndobo or Tikari areas. It is spoken by people of Bafut Subdivision, Tuba, in the division of Mezam and in the division of Metchum in Northwest Province, Cameroon.
in scheme: Lexvo - ISO 639-3 language codes
notation: bfd

Tena
type: Language
type: Concept
ISO 639-3 code: bfe
alternative label: Betaf
in scheme: Lexvo - ISO 639-3 language codes
notation: bfe

Bofi
type: Language
type: Concept
ISO 639-3 code: bff
alternative label: Bofi language
definition: Bofi (Boffi) is a Ubangian language spoken in Boda and Bimbo subprefectures in southwestern Central African Republic. Those speakers in Bimbo are mostly Bambenga pygmies. Although they no longer live in the forest, their area was forested in 1950.
in scheme: Lexvo - ISO 639-3 language codes
notation: bff

Busang Kayan
type: Language
type: Concept
ISO 639-3 code: bfg
alternative label: Kayan, Busang
in scheme: Lexvo - ISO 639-3 language codes
notation: bfg

Blafe
type: Language
type: Concept
ISO 639-3 code: bfh
in scheme: Lexvo - ISO 639-3 language codes
notation: bfh

British Sign Language
type: Language
type: Concept
ISO 639-3 code: bfi
definition: British Sign Language (BSL) is the sign language used in the United Kingdom (UK), and is the first or preferred language of some deaf people in the UK; there are 125,000 deaf adults in the UK who use BSL plus an estimated 20,000 children. The language makes use of space and involves movement of the hands, body, face and head. Many thousands of people who are not deaf also use BSL, as hearing relatives of deaf people, sign language interpreters or as a result of other contact with the British deaf community.
in scheme: Lexvo - ISO 639-3 language codes
notation: bfi
preferred label: Langue des signes britannique @fr
preferred label: Língua de sinais britânica @pt

Bafanji
type: Language
type: Concept
ISO 639-3 code: bfj
alternative label: Bafanji language
definition: The Bafanji language, Chuufi (Nchufie), is spoken in the Northwest Region of Cameroon. There are approximately 17,000 speakers. The language has a rich system of tonal morphology, including reduplication involving adjectives.
in scheme: Lexvo - ISO 639-3 language codes
notation: bfj

Ban Khor Sign Language
type: Language
type: Concept
ISO 639-3 code: bfk
definition: Ban Khor Sign Language (BKSL) is a sign language used by about 1,000 people of a rice-farming community in the villages of Ban Khor and Plaa Pag in a remote area of Isan (northeastern Thailand). Ban Khor proper and Plaa Pag are dialects, with some 80% of signs in common. It developed about 60–80 years ago due to a high number of deaf people. Preliminary observation has tentatively suggested it may be a language isolate, independent of the other indigenous sign languages of Thailand such as Old Bangkok Sign Language and the national Thai Sign Language. Two other reported village sign languages of the BKSL area, Huay Hai Sign Language and Na Sai Sign Language, have not been compared with BKSL, and it is not known if they are distinct languages.
in scheme: Lexvo - ISO 639-3 language codes
notation: bfk
preferred label: Língua de sinais de Ban Khor @pt

Zou
type: Language
type: Concept
ISO 639-3 code: zom
alternative label: Zou language
definition: Zou (also known as Zome, Zom, or Zomi) is a language originating in Burma. It is spoken by the Zou people in Burma and India, as well as by the Zomi people in Zogam.
in scheme: Lexvo - ISO 639-3 language codes
notation: zom

Banda-Ndélé
type: Language
type: Concept
ISO 639-3 code: bfl
in scheme: Lexvo - ISO 639-3 language codes
notation: bfl

Wuvulu-Aua
type: Language
type: Concept
ISO 639-3 code: wuv
alternative label: Wuvulu-Aua language
definition: The Wuvulu-Aua language is one of three Western Admiralty Islands languages, the other two being Seimat and the extinct Kaniet. The language is spoken on Wuvulu and Aua Islands by approximately 1500 people in the Manus Province of Papua New Guinea.
in scheme: Lexvo - ISO 639-3 language codes
notation: wuv
preferred label: Wuvulu-aua @fr

Mmen
type: Language
type: Concept
ISO 639-3 code: bfm
in scheme: Lexvo - ISO 639-3 language codes
notation: bfm

Bunak
type: Language
type: Concept
ISO 639-3 code: bfn
alternative label: Bunak language
definition: The Bunak language (also known as Bunaq, Buna', Bunake) is the language of the Bunak people of the mountainous region of central Timor, split between the political boundary between West Timor, Indonesia, particularly in Lamaknen District and East Timor. It is one of the few on Timor which is not an Austronesian language, but rather a Papuan language like groups on New Guinea. It is usually put in the proposed language group Trans–New Guinea. The language is surrounded by Malayo-Polynesian languages, like the Atoni and the Tetum.
in scheme: Lexvo - ISO 639-3 language codes
notation: bfn
preferred label: Búnaque @pt

Malba Birifor
type: Language
type: Concept
ISO 639-3 code: bfo
alternative label: Birifor, Malba
in scheme: Lexvo - ISO 639-3 language codes
notation: bfo

Beba
type: Language
type: Concept
ISO 639-3 code: bfp
in scheme: Lexvo - ISO 639-3 language codes
notation: bfp

Badaga
type: Language
type: Concept
ISO 639-3 code: bfq
alternative label: Badaga language
definition: The Badaga language (Badaga: படக பாஷை ,, ) is a southern Dravidian language (Tamil–Kannada branch) spoken by approximately 400,000 people (the Badagas) in the Nilgiri Hills in Southern India. It is known for its retroflex vowels. The word Badaga refers to the Badaga language as well as the Badaga community/tribe. The Badagas were the Kannada speaking people from Mysore in Karnataka state, India.
in scheme: Lexvo - ISO 639-3 language codes
notation: bfq

Bazigar
type: Language
type: Concept
ISO 639-3 code: bfr
in scheme: Lexvo - ISO 639-3 language codes
notation: bfr

Southern Bai
type: Language
type: Concept
ISO 639-3 code: bfs
alternative label: Bai, Southern
in scheme: Lexvo - ISO 639-3 language codes
notation: bfs

Balti
type: Language
type: Concept
ISO 639-3 code: bft
alternative label: Balti dialect
alternative label: Balti language
definition: ' Balti (; ) is a language spoken in Baltistan, in Gilgit-Baltistan of Pakistan and adjoining parts of Ladakh. Baltistan, before 1948, was part of Ladakh province. The Balti language is a dialect of the Ladakhi language, a form of Tibetan. It is mutually intelligible with Ladakhi proper and Burig. Many of the written consonants that are silent in Standard Tibetan are pronounced in the Balti language.
in scheme: Lexvo - ISO 639-3 language codes
notation: bft
preferred label: Idioma balti @es
preferred label: Lingua balti @it
preferred label: Língua balti @pt

Gahri
type: Language
type: Concept
ISO 639-3 code: bfu
alternative label: Gahri language
definition: Gahri, also known as Ghara, Lahuli of Bunan, Boonan, Punan, Poonan, Erankad, Keylong Boli or Bunan is a Tibeto-Burman language (Sino-Tibetan stock) spoken in the Indian state of Himachal Pradesh. The language is spoken in the Gahr Valley along the Bhaga River from its confluence with the Chandra River and upstream about , including villages such as Biling, Kardang, Kyelang, Guskyar, Yurnad, Gumrang, Barbog, Paspara, Pyukar and. The number of people speaking the language is only approximately 4,000 in India, according to 1998 data from Ethnologue.
in scheme: Lexvo - ISO 639-3 language codes
notation: bfu

Bondo
type: Language
type: Concept
ISO 639-3 code: bfw
alternative label: Bonda language
definition: The Bonda language, also known as Bondo or Remo, is a language spoken by the Bonda people of India.
in scheme: Lexvo - ISO 639-3 language codes
notation: bfw

Bantayanon
type: Language
type: Concept
ISO 639-3 code: bfx
in scheme: Lexvo - ISO 639-3 language codes
notation: bfx

Bagheli
type: Language
type: Concept
ISO 639-3 code: bfy
alternative label: Bagheli language
definition: Bagheli (Devanagari: बघेली or बाघेली) is a language of the Baghelkhand region of central India. It is often considered to be a dialect of Hindi language, and is classified such by the Indian Census Report (1991).
in scheme: Lexvo - ISO 639-3 language codes
notation: bfy

Wulna
type: Language
type: Concept
ISO 639-3 code: wux
alternative label: Wulna language
definition: Wulna is a presumably extinct indigenous language of Australia. It had one speaker left in 1981.
in scheme: Lexvo - ISO 639-3 language codes
notation: wux

Mahasu Pahari
type: Language
type: Concept
ISO 639-3 code: bfz
alternative label: Pahari, Mahasu
in scheme: Lexvo - ISO 639-3 language codes
notation: bfz

Gwamhi-Wuri
type: Language
type: Concept
ISO 639-3 code: bga
in scheme: Lexvo - ISO 639-3 language codes
notation: bga

Bobongko
type: Language
type: Concept
ISO 639-3 code: bgb
in scheme: Lexvo - ISO 639-3 language codes
notation: bgb

Haryanvi
type: Language
type: Concept
ISO 639-3 code: bgc
alternative label: Haryanvi language
definition: Haryanvi (Devanagari: हरियाणवी , also हरयाणवी ), also known as Bangru (बांगरू ), is the northernmost dialect of the Hindi language. It is most widely spoken in the North Indian state of Haryana, and also in Delhi. According to linguistic research, Haryanvi is very similar to Braj Bhasha and has 65% lexical similarity with the Bagri language.
in scheme: Lexvo - ISO 639-3 language codes
notation: bgc
preferred label: Hariani @pt

Rathwi Bareli
type: Language
type: Concept
ISO 639-3 code: bgd
alternative label: Bareli, Rathwi
in scheme: Lexvo - ISO 639-3 language codes
notation: bgd

Bauria
type: Language
type: Concept
ISO 639-3 code: bge
in scheme: Lexvo - ISO 639-3 language codes
notation: bge

Bangandu
type: Language
type: Concept
ISO 639-3 code: bgf
alternative label: Bangandu language
definition: Bangandu is a Ubangian language of Cameroon and Congo. Its placement in the Ubangian family is unclear: Ethnologue lists it in with the Gbaya languages, but says that it might be related to Ngombe (CAR), which is itself uncertain, being listed as Ngbaka but possibly intelligible with Southwest Gbaya.
in scheme: Lexvo - ISO 639-3 language codes
notation: bgf

Bugun
type: Language
type: Concept
ISO 639-3 code: bgg
alternative label: Khowa language
definition: Khowa, or Bugun, is a small Tibeto-Burman language spoken in India.
in scheme: Lexvo - ISO 639-3 language codes
notation: bgg

Giangan
type: Language
type: Concept
ISO 639-3 code: bgi
in scheme: Lexvo - ISO 639-3 language codes
notation: bgi

Bangolan
type: Language
type: Concept
ISO 639-3 code: bgj
in scheme: Lexvo - ISO 639-3 language codes
notation: bgj

Bit
type: Language
type: Concept
ISO 639-3 code: bgk
alternative label: Bit language
alternative label: Buxinhua
definition: Bit is a language spoken by around 1,500 people in northern Laos, concentrated in the provinces of Louang Namtha and Phongsali. There are thought to be about another 500 speakers over the border in Yunnan Province, China. It has been classified as Khmuic, Palaungic, and as Mangic.
in scheme: Lexvo - ISO 639-3 language codes
notation: bgk

Wauyai
type: Language
type: Concept
ISO 639-3 code: wuy
in scheme: Lexvo - ISO 639-3 language codes
notation: wuy

Bo
type: Language
type: Concept
ISO 639-3 code: bgl
alternative label: Bo (Laos)
in scheme: Lexvo - ISO 639-3 language codes
notation: bgl

Baga Mboteni
type: Language
type: Concept
ISO 639-3 code: bgm
alternative label: Baga Mboteni language
definition: Baga Mboteni is a nearly extinct Senegambian language of Guinea.
in scheme: Lexvo - ISO 639-3 language codes
notation: bgm

Western Balochi
type: Language
type: Concept
ISO 639-3 code: bgn
alternative label: Balochi, Western
in scheme: Lexvo - ISO 639-3 language codes
notation: bgn

Baga Koga
type: Language
type: Concept
ISO 639-3 code: bgo
in scheme: Lexvo - ISO 639-3 language codes
notation: bgo

Eastern Balochi
type: Language
type: Concept
ISO 639-3 code: bgp
alternative label: Balochi, Eastern
in scheme: Lexvo - ISO 639-3 language codes
notation: bgp

Bagri
type: Language
type: Concept
ISO 639-3 code: bgq
alternative label: Bagri language
definition: Bagri (बागड़ी) is a dialect of Rajasthani language of the Indo-Aryan family. It is spoken by about five million speakers in Hanumangarh and Sriganganagar districts of Rajasthan, Sirsa and Hissar districts of Haryana, Firozepur and Muktsar districts of Punjab of India and Bahawalpur and Bahawalnagar areas of Punjab of Pakistan. Bagri is a typical Indo-Aryan language having SOV word order. The most prominent phonological feature of Bagri is the presence of three lexical tones: high, level, and low. The Bagri language has a very high 65% lexical similarity with Haryanvi.
in scheme: Lexvo - ISO 639-3 language codes
notation: bgq

Bawm Chin
type: Language
type: Concept
ISO 639-3 code: bgr
alternative label: Chin, Bawm
in scheme: Lexvo - ISO 639-3 language codes
notation: bgr

Waama
type: Language
type: Concept
ISO 639-3 code: wwa
alternative label: Waama language
definition: Waama, or Yoabu, is a Gur language of Benin.
in scheme: Lexvo - ISO 639-3 language codes
notation: wwa

Tagabawa
type: Language
type: Concept
ISO 639-3 code: bgs
in scheme: Lexvo - ISO 639-3 language codes
notation: bgs

Bughotu
type: Language
type: Concept
ISO 639-3 code: bgt
in scheme: Lexvo - ISO 639-3 language codes
notation: bgt

Mbongno
type: Language
type: Concept
ISO 639-3 code: bgu
alternative label: Kamkam language
definition: Mbongno (Bungnu), also known as Kamkam, is a Mambiloid language of Nigeria, with an unknown number of speakers in Cameroon.
in scheme: Lexvo - ISO 639-3 language codes
notation: bgu

Warkay-Bipim
type: Language
type: Concept
ISO 639-3 code: bgv
in scheme: Lexvo - ISO 639-3 language codes
notation: bgv

Bhatri
type: Language
type: Concept
ISO 639-3 code: bgw
in scheme: Lexvo - ISO 639-3 language codes
notation: bgw

Balkan Gagauz Turkish
type: Language
type: Concept
ISO 639-3 code: bgx
alternative label: Balkan Gagauz Turkish language
alternative label: Turkish, Balkan Gagauz
definition: Balkan Gagauz Turkish (also known as Balkan Turkic) is a Turkic language spoken in European Turkey, Greece, and in the Kumanovo and Bitola areas of the Republic of Macedonia. Dialects include Gajal, Gerlovo Turk, Karamanli, Kyzylbash, Surguch, Tozluk Turk, Yuruk, and Macedonian Gagauz. This is a different language from Gagauz and Turkish.
in scheme: Lexvo - ISO 639-3 language codes
notation: bgx

Benggoi
type: Language
type: Concept
ISO 639-3 code: bgy
in scheme: Lexvo - ISO 639-3 language codes
notation: bgy

Banggai
type: Language
type: Concept
ISO 639-3 code: bgz
alternative label: Banggai language
definition: The Banggai language is the main language spoken by the inhabitants of the Banggai Archipelago off the island of Sulawesi.
in scheme: Lexvo - ISO 639-3 language codes
notation: bgz

Bharia
type: Language
type: Concept
ISO 639-3 code: bha
in scheme: Lexvo - ISO 639-3 language codes
notation: bha

Bhili
type: Language
type: Concept
ISO 639-3 code: bhb
in scheme: Lexvo - ISO 639-3 language codes
notation: bhb

Biga
type: Language
type: Concept
ISO 639-3 code: bhc
in scheme: Lexvo - ISO 639-3 language codes
notation: bhc

Wakabunga
type: Language
type: Concept
ISO 639-3 code: wwb
in scheme: Lexvo - ISO 639-3 language codes
notation: wwb

Bhadrawahi
type: Language
type: Concept
ISO 639-3 code: bhd
in scheme: Lexvo - ISO 639-3 language codes
notation: bhd

Bhaya
type: Language
type: Concept
ISO 639-3 code: bhe
in scheme: Lexvo - ISO 639-3 language codes
notation: bhe

Odiai
type: Language
type: Concept
ISO 639-3 code: bhf
alternative label: Busa language
definition: The Busa language, also known as Odiai (Uriai), is a language isolate in northwestern Papua New Guinea. There were 244 speakers at the time of the 2000 census.
in scheme: Lexvo - ISO 639-3 language codes
notation: bhf

Binandere
type: Language
type: Concept
ISO 639-3 code: bhg
in scheme: Lexvo - ISO 639-3 language codes
notation: bhg

Bukharic
type: Language
type: Concept
ISO 639-3 code: bhh
alternative label: Bukhori language
definition: Bukhori ( – boxārī, Tajik and Bukhori Cyrillic: – buxorī; Bukhori Hebrew script: בוכארי – buxori; also known as Bukhari, Bukharic, Bukharan, Bukharian, Judeo-Tajik, Local Jewish Language, Samarkand Jewish Dialect of Tajik) is a unique dialect of the Persian language spoken in Central Asia by the Bukharian Jews. Hence, a more descriptive name for the language might be Judæo-Persian or Judæo-Tajik.
in scheme: Lexvo - ISO 639-3 language codes
notation: bhh
preferred label: Idioma bújaro @es
preferred label: Língua bujara @pt

Bhilali
type: Language
type: Concept
ISO 639-3 code: bhi
in scheme: Lexvo - ISO 639-3 language codes
notation: bhi

Bahing
type: Language
type: Concept
ISO 639-3 code: bhj
alternative label: Bahing language
definition: Bahing (also known as Rumdali) is a language spoken by 2,765 people (2001 census) of the Bahing ethnic group in the Okhaldhunga district of Nepal. It belongs to the family of Kiranti languages, a subgroup of Tibeto-Burman.
in scheme: Lexvo - ISO 639-3 language codes
notation: bhj

Dorig
type: Language
type: Concept
ISO 639-3 code: wwo
alternative label: Dorig language
alternative label: Wetamut
definition: Dorig (sometimes called Wetamut) is an Oceanic language spoken on Gaua island in Vanuatu.
in scheme: Lexvo - ISO 639-3 language codes
notation: wwo

Albay Bikolano language
type: Language
type: Concept
definition: Albay Bicolano, Buhi-Oasnon-Daraga Bikol or simply Albayanon is one of the three languages that compose Inland Bikol. It is spoken in Buhi, Camarines Sur, western coast of Albay and northwestern Sorsogon. Its dialects include Buhi-non, Libon, Oasnon, Daragueño. It is one of the 13 major languages and the largest unrecognized regional language in the Philippines.
in scheme: Lexvo - ISO 639-3 language codes

Bimin
type: Language
type: Concept
ISO 639-3 code: bhl
in scheme: Lexvo - ISO 639-3 language codes
notation: bhl

Bathari
type: Language
type: Concept
ISO 639-3 code: bhm
alternative label: Bathari language
definition: Bathari (also known as Bautahari, Botahari, Bathara) is an endangered Semitic language spoken in a small area of Yemen and Oman.
in scheme: Lexvo - ISO 639-3 language codes
notation: bhm

Bohtan Neo-Aramaic
type: Language
type: Concept
ISO 639-3 code: bhn
alternative label: Neo-Aramaic, Bohtan
definition: Bohtan Neo-Aramaic is a modern Eastern Neo-Aramaic language. Originally, Bohtan Neo-Aramaic was spoken on the Plain of Bohtan in Şırnak Province of southeastern Turkey, but it is now spoken mostly around the village of Gardabani, near Rustavi in Georgia.
in scheme: Lexvo - ISO 639-3 language codes
notation: bhn

Bhojpuri
type: Language
type: Concept
ISO 639-2 Bibliographical code: bho
ISO 639-2 Terminological code: bho
ISO 639-3 code: bho
alternative label: Bhodjpouri @fr
alternative label: Bhodschpuri @de
alternative label: Bhojpuri language
alternative label: Idioma bopurí @es
alternative label: Lingua bhojpuri @it
alternative label: Língua bhojpuri @pt
definition: Bhojpuri is a language spoken in parts of north-central and eastern India. It is spoken in the western part of state of Bihar, the northwestern part of Jharkhand, and the Purvanchal region of Uttar Pradesh (UP), as well as adjoining parts of the Nepal Terai. Bhojpuri is also spoken in Guyana, Suriname, Fiji, Trinidad and Tobago and Mauritius. The variant of Bhojpuri of the Surinamese Hindustanis is also referred to as Sarnami Hindustani, Sarnami Hindi or just Sarnami and has experienced considerable Creole and Dutch lexical influence. More Indians in Suriname know Bhojpuri compared to Guyana and Trinidad where the language is largely forgotten.
in scheme: Lexvo - ISO 639-3 language codes
notation: bho
preferred label: bhojpuri @es

Bima
type: Language
type: Concept
ISO 639-3 code: bhp
alternative label: Bima language
definition: The Bima language, or Bimanese, is the language of the eastern half of Sumbawa Island, Indonesia, which it shares with the Sumbawa language. Bima territory includes the Sanggar Peninsula, where the extinct Papuan language Tambora was once spoken. It is closely related to the languages of Sumba Island to the southeast. There are over half a million Bima speakers.
in scheme: Lexvo - ISO 639-3 language codes
notation: bhp

Tukang Besi South
type: Language
type: Concept
ISO 639-3 code: bhq
in scheme: Lexvo - ISO 639-3 language codes
notation: bhq

Bara Malagasy
type: Language
type: Concept
ISO 639-3 code: bhr
alternative label: Malagasy, Bara
in scheme: Lexvo - ISO 639-3 language codes
notation: bhr

Buwal
type: Language
type: Concept
ISO 639-3 code: bhs
alternative label: Buwal language
definition: Buwal (also known as Ma Buwal, Bual, Gadala) is an Afro-Asiatic language spoken in Cameroon in Far North Province in and around Gadala.
in scheme: Lexvo - ISO 639-3 language codes
notation: bhs

Bhattiyali
type: Language
type: Concept
ISO 639-3 code: bht
in scheme: Lexvo - ISO 639-3 language codes
notation: bht

Bhunjia
type: Language
type: Concept
ISO 639-3 code: bhu
in scheme: Lexvo - ISO 639-3 language codes
notation: bhu

Bahau
type: Language
type: Concept
ISO 639-3 code: bhv
in scheme: Lexvo - ISO 639-3 language codes
notation: bhv

Biak
type: Language
type: Concept
ISO 639-3 code: bhw
alternative label: Biak language
definition: Biak (referred to locally as wós Vyak ‘Biak Language’ or wós kovedi ‘Our Language’ and Bahasa Biak in Indonesian. Also known as: Biak-Numfor, Noefoor, Mafoor, Mefoor, Nufoor, Mafoorsch, Myfoorsch and Noefoorsch) is an Austronesian language which has been classified as one of 41 languages of the South Halmahera-West New Guinea subgroup of Eastern Malayo-Polynesian Languages. It is spoken in Biak and Numfor and numerous small islands in this archipelago in the province of Papua, Indonesia by about 30,000 people.
in scheme: Lexvo - ISO 639-3 language codes
notation: bhw

Warrwa
type: Language
type: Concept
ISO 639-3 code: wwr
alternative label: Warrwa language
definition: The Warrwa language are an extinct Australian Aboriginal language which was formerly spoken in Western Australia. It was also known as Warrawai or Warwa.
in scheme: Lexvo - ISO 639-3 language codes
notation: wwr

Bhalay
type: Language
type: Concept
ISO 639-3 code: bhx
in scheme: Lexvo - ISO 639-3 language codes
notation: bhx

Bhele
type: Language
type: Concept
ISO 639-3 code: bhy
alternative label: Bhele language
definition: Bhele (Ebhele), or Piri (Kipiri), is a Bantu language of the Democratic Republic of the Congo.
in scheme: Lexvo - ISO 639-3 language codes
notation: bhy

Bada
type: Language
type: Concept
ISO 639-3 code: bhz
alternative label: Bada (Indonesia)
in scheme: Lexvo - ISO 639-3 language codes
notation: bhz

Badimaya
type: Language
type: Concept
ISO 639-3 code: bia
alternative label: Badimaya language
definition: Badimaya is an Australian Aboriginal language. It is a member of the Kartu subgroup of the Southwest branch of the Pama–Nyungan family.
in scheme: Lexvo - ISO 639-3 language codes
notation: bia

Bisa
type: Language
type: Concept
ISO 639-3 code: bib
preferred label: Bissa
alternative label: Bissa language
definition: Bissa (Bisa) is a Mande language spoken by the Bissa people of Burkina Faso, Ghana, and (marginally) Togo. Dialects are Barka, Lebir, Lere.
in scheme: Lexvo - ISO 639-3 language codes
notation: bib

Bikaru
type: Language
type: Concept
ISO 639-3 code: bic
in scheme: Lexvo - ISO 639-3 language codes
notation: bic

Bidiyo
type: Language
type: Concept
ISO 639-3 code: bid
alternative label: Bidiyo language
definition: Bidiyo (also known as Bidyo, Bidio, Bidio, Bidiyo, Bidiyo-Waana, Bidiya) is an Afro-Asiatic language spoken in south central Chad.
in scheme: Lexvo - ISO 639-3 language codes
notation: bid

Bepour
type: Language
type: Concept
ISO 639-3 code: bie
in scheme: Lexvo - ISO 639-3 language codes
notation: bie

Biafada
type: Language
type: Concept
ISO 639-3 code: bif
alternative label: Biafada language
definition: Biafada is a Senegambian language of Guinea-Bissau.
in scheme: Lexvo - ISO 639-3 language codes
notation: bif

Biangai
type: Language
type: Concept
ISO 639-3 code: big
in scheme: Lexvo - ISO 639-3 language codes
notation: big

Kwanka language
type: Language
type: Concept
ISO 639-3 code: bij
alternative label: Vaghat-Ya-Bijim-Legeri
definition: Kwanka is a dialect cluster of Plateau languages in Nigeria. Kwanka is an alternate name of the principal dialect, Vaghat; the others are Ya (Boi), Bijim, and Legeri.
in scheme: Lexvo - ISO 639-3 language codes
notation: bij
preferred label: Kwanka @de

Wawa
type: Language
type: Concept
ISO 639-3 code: www
alternative label: Wawa language
definition: Wawa is a Mambiloid language spoken in a small region of Cameroon and in an adjoining bit of Nigeria. It is spoken by about 3000 people in three main dialects.
in scheme: Lexvo - ISO 639-3 language codes
notation: www

Bikol
type: Language
type: Concept
ISO 639-2 Bibliographical code: bik
ISO 639-2 Terminological code: bik
ISO 639-3 code: bik
in scheme: Lexvo - ISO 639-3 language codes
notation: bik
preferred label: Bikol-Sprache @de
preferred label: bicol @es
preferred label: bikol @fr

Bile
type: Language
type: Concept
ISO 639-3 code: bil
alternative label: Bile language
definition: ’Bile is one of the Bantoid Jarawan languages of Nigeria.
in scheme: Lexvo - ISO 639-3 language codes
notation: bil

Bimoba
type: Language
type: Concept
ISO 639-3 code: bim
in scheme: Lexvo - ISO 639-3 language codes
notation: bim

Edo
type: Language
type: Concept
ISO 639-2 Bibliographical code: bin
ISO 639-2 Terminological code: bin
ISO 639-3 code: bin
alternative label: Bini
alternative label: Bini-Sprache @de
alternative label: Edo language
alternative label: Idioma edo @es
alternative label: Lingua edo @it
alternative label: Língua edo @pt
preferred label: bini @es
definition: Edo (with full diacritics, ; also called Bini (Benin)) is a Volta–Niger language spoken primarily in Edo State, Nigeria. It was and remains the primary language of the Edo people of Igodomigodo. The Igodomigodo kingdom was renamed Edo by Oba Eweka, after which the Edos refer to themselves as Oviedo child of Edo. The Edo capital was Ubinu, known as Benin City to the Portuguese who first heard about it from the coastal Itsekhiri, who pronounced it this way; from this the kingdom came to be known as the Benin Empire in the West.
in scheme: Lexvo - ISO 639-3 language codes
notation: bin
preferred label: Édo @fr

Nai
type: Language
type: Concept
ISO 639-3 code: bio
alternative label: Nai language
definition: Nai or Biaka is a language of Papua New Guinea. It is spoken in Amanab District, Sandaun Province, in three villages: Konabasi, Biaka, and Amini.
in scheme: Lexvo - ISO 639-3 language codes
notation: bio

Bila
type: Language
type: Concept
ISO 639-3 code: bip
in scheme: Lexvo - ISO 639-3 language codes
notation: bip

Bipi
type: Language
type: Concept
ISO 639-3 code: biq
alternative label: Bipi language
definition: The Bipi language is the westernmost West Manus language. It is spoken by approximately 1200 people on the Bipi and Sisi Islands off the west coast of Manus Island, Manus Province of Papua New Guinea. It has SVO word order.
in scheme: Lexvo - ISO 639-3 language codes
notation: biq

Bisorio
type: Language
type: Concept
ISO 639-3 code: bir
in scheme: Lexvo - ISO 639-3 language codes
notation: bir

Bislama
type: Language
type: Concept
ISO 639-1 code: bi
ISO 639-2 Bibliographical code: bis
ISO 639-2 Terminological code: bis
ISO 639-3 code: bis
alternative label: Bichelamar @fr
alternative label: Lingua bislama @it
alternative label: Língua bislamá @pt
alternative label: bichelamar @fr
preferred label: bislama @it
definition: Bislama is a creole language, one of the official languages of Vanuatu. It is the first language of many of the "Urban ni-Vanuatu" (those who live in Port Vila and Luganville), and the second language of much of the rest of the country's residents. "Yumi, Yumi, Yumi", the Vanuatu national anthem, is in Bislama.
in scheme: Lexvo - ISO 639-3 language codes
notation: bis
preferred label: bichlamar @fr
preferred label: bislamá @pt

Berinomo
type: Language
type: Concept
ISO 639-3 code: bit
in scheme: Lexvo - ISO 639-3 language codes
notation: bit

Biete
type: Language
type: Concept
ISO 639-3 code: biu
alternative label: Biete language
definition: Biete (Bete, Biate) is a Kukish language of India.
in scheme: Lexvo - ISO 639-3 language codes
notation: biu

Southern Birifor
type: Language
type: Concept
ISO 639-3 code: biv
alternative label: Birifor, Southern
in scheme: Lexvo - ISO 639-3 language codes
notation: biv

Waxianghua
type: Language
type: Concept
ISO 639-3 code: wxa
alternative label: Waxiang dialect
definition: Waxianghua (瓦鄉話 / 瓦乡话) is considered a mixed language of Chinese and Miao in the northwestern part of Hunan province in China. Differences from Southwestern Mandarin and Xiang are many, and syntactic reversal phenomenal are frequent.
in scheme: Lexvo - ISO 639-3 language codes
notation: wxa

Kol
type: Language
type: Concept
ISO 639-3 code: biw
alternative label: Kol (Cameroon)
alternative label: Kol language
definition: Kol is a Niger–Congo language of the Bantu family. According to the , it is spoken in the East Province of Cameroon, in the vicinity of Messaména. Alternate names for Kol language include Bikele-Bikay, Bikele-Bikeng, Bekol.
in scheme: Lexvo - ISO 639-3 language codes
notation: biw

Bijori
type: Language
type: Concept
ISO 639-3 code: bix
alternative label: Birjia language
definition: The Birjia language, Bijori, is a Munda language of India.
in scheme: Lexvo - ISO 639-3 language codes
notation: bix

Birhor
type: Language
type: Concept
ISO 639-3 code: biy
alternative label: Birhor language
definition: The Birhor language is a Munda language spoken by the Birhor people in Orissa, West Bengal, and Maharashtra states in India.
in scheme: Lexvo - ISO 639-3 language codes
notation: biy

Baloi
type: Language
type: Concept
ISO 639-3 code: biz
alternative label: Loi language
definition: Loi is a Bantu language closely related to Lingala. It is often called Baloi, which is not actually the name of the language but the endonym for the Loi people.
in scheme: Lexvo - ISO 639-3 language codes
notation: biz

Budza
type: Language
type: Concept
ISO 639-3 code: bja
alternative label: Budza language
definition: Budza or Buja (Embudja, Limbudza) is a Bantu language of the Democratic Republic of Congo.
in scheme: Lexvo - ISO 639-3 language codes
notation: bja

Banggarla
type: Language
type: Concept
ISO 639-3 code: bjb
in scheme: Lexvo - ISO 639-3 language codes
notation: bjb

Bariji
type: Language
type: Concept
ISO 639-3 code: bjc
in scheme: Lexvo - ISO 639-3 language codes
notation: bjc

Biao-Jiao Mien
type: Language
type: Concept
ISO 639-3 code: bje
alternative label: Biao Min language
alternative label: Mien, Biao-Jiao
definition: Biao Min, or Biao-Jiao Mien, is a Hmong–Mien language of China. The two varieties, Biao Min and Jiaogong Mian, are evidently not mutually intelligible.
in scheme: Lexvo - ISO 639-3 language codes
notation: bje

Barzani Jewish Neo-Aramaic
type: Language
type: Concept
ISO 639-3 code: bjf
alternative label: Neo-Aramaic, Barzani Jewish
definition: Barzani Jewish Neo-Aramaic is a modern Jewish Aramaic language, often called Neo-Aramaic or Judeo-Aramaic. It was originally spoken in three villages near Aqrah in Iraq. The native name of the language is Lishanid Janan, which means our language, and is similar to names used by other Jewish Neo-Aramaic dialects (Lishan Didan, Lishanid Noshan).
in scheme: Lexvo - ISO 639-3 language codes
notation: bjf

Bidyogo
type: Language
type: Concept
ISO 639-3 code: bjg
alternative label: Bijago language
definition: Bijago, or Bidyogo, is the language of the Bissagos Archipelago of Guinea-Bissau. There are some difficulties of grammar and intelligibility between dialects, with the Kamona dialect of Caravela and Carache Islands being unintelligible to the others.
in scheme: Lexvo - ISO 639-3 language codes
notation: bjg

Bahinemo
type: Language
type: Concept
ISO 639-3 code: bjh
in scheme: Lexvo - ISO 639-3 language codes
notation: bjh

Burji
type: Language
type: Concept
ISO 639-3 code: bji
alternative label: Burji language
definition: Burji language (alternate names: Bembala, Bambala, Daashi) is an Afro-Asiatic language spoken by the Burji people who reside in Ethiopia south of Lake Chamo. There are over 46,000 speakers in Ethiopia, and a further 10,400 speakers in Kenya. Burji belongs to the Highland East Cushitic group of the Cushitic branch of the Afro-Asiatic family.
in scheme: Lexvo - ISO 639-3 language codes
notation: bji

Wardandi
type: Language
type: Concept
in scheme: Lexvo - ISO 639-3 language codes

Kanauji
type: Language
type: Concept
ISO 639-3 code: bjj
alternative label: Kannauji
definition: Kannauji language (Devanagari: क़न्नौजी) (also spelled Kanauji (क़नौजी or क़न‍उजी), Kanauji language) is an Indo-Aryan language spoken in parts of the Indian state of Uttar Pradesh. Kannauji is closely related to Hindi, and some consider it to be a dialect of Hindi, while others consider it a separate Western Hindi language.
in scheme: Lexvo - ISO 639-3 language codes
notation: bjj

Barok
type: Language
type: Concept
ISO 639-3 code: bjk
in scheme: Lexvo - ISO 639-3 language codes
notation: bjk

Bulu
type: Language
type: Concept
ISO 639-3 code: bjl
alternative label: Bulu (Papua New Guinea)
in scheme: Lexvo - ISO 639-3 language codes
notation: bjl

Bajelani
type: Language
type: Concept
ISO 639-3 code: bjm
in scheme: Lexvo - ISO 639-3 language codes
notation: bjm

Banjar
type: Language
type: Concept
ISO 639-3 code: bjn
alternative label: Banjar language
definition: Banjar language is the native language used by the Banjarese people of South Kalimantan, Indonesia. As many Banjarese are travelling merchants, they brought their language wherever they went all over Indonesia, even all over the world.
in scheme: Lexvo - ISO 639-3 language codes
notation: bjn
preferred label: Banjaresische Sprache @de

Wyandot
type: Language
type: Concept
ISO 639-3 code: wya
alternative label: Wyandot language
definition: Wyandot is the Iroquoian language traditionally spoken by the people known variously as Wyandot, Wyandotte, Wendat, or Huron. It was last spoken primarily in Oklahoma and Quebec. Linguists have traditionally considered Wyandot as a dialect or modern form of Wendat.
in scheme: Lexvo - ISO 639-3 language codes
notation: wya

Mid-Southern Banda
type: Language
type: Concept
ISO 639-3 code: bjo
alternative label: Banda, Mid-Southern
in scheme: Lexvo - ISO 639-3 language codes
notation: bjo

Fanamaket
type: Language
type: Concept
in scheme: Lexvo - ISO 639-3 language codes

Binumarien
type: Language
type: Concept
ISO 639-3 code: bjr
in scheme: Lexvo - ISO 639-3 language codes
notation: bjr

Bajan
type: Language
type: Concept
ISO 639-3 code: bjs
alternative label: Bajan Creole
definition: Bajan is an English-based creole language spoken on the Caribbean island of Barbados. Bajan, like many other English-based Caribbean creole languages, consists of a West African substrate and an English superstrate. Bajan is similar but distinguishable from the creoles of neighbouring Caribbean islands, as many of the other Caribbean creoles are theorized to have Hiberno-English or Scottish English as their superstrate variety, for example Jamaican Patois.
in scheme: Lexvo - ISO 639-3 language codes
notation: bjs

Balanta-Ganja
type: Language
type: Concept
ISO 639-3 code: bjt
in scheme: Lexvo - ISO 639-3 language codes
notation: bjt

Busuu
type: Language
type: Concept
ISO 639-3 code: bju
alternative label: Busuu language
definition: Busuu is an unclassified Southern Bantoid language of Cameroon. R Breton noted in 1986 that there were just 8 speakers left, while as of 2005 there are 3 living speakers of the language.
in scheme: Lexvo - ISO 639-3 language codes
notation: bju

Bedjond
type: Language
type: Concept
ISO 639-3 code: bjv
in scheme: Lexvo - ISO 639-3 language codes
notation: bjv

Bakwé
type: Language
type: Concept
ISO 639-3 code: bjw
alternative label: Bakwé language
definition: Bakwé is a Kru language of Ivory Coast.
in scheme: Lexvo - ISO 639-3 language codes
notation: bjw

Banao Itneg
type: Language
type: Concept
ISO 639-3 code: bjx
alternative label: Itneg, Banao
in scheme: Lexvo - ISO 639-3 language codes
notation: bjx

Bayali
type: Language
type: Concept
ISO 639-3 code: bjy
in scheme: Lexvo - ISO 639-3 language codes
notation: bjy

Baruga
type: Language
type: Concept
ISO 639-3 code: bjz
in scheme: Lexvo - ISO 639-3 language codes
notation: bjz

Kyak
type: Language
type: Concept
ISO 639-3 code: bka
alternative label: Bambuka language
definition: Kyak (Nyakyak), Bambuka, is an Adamawa language of Nigeria.
in scheme: Lexvo - ISO 639-3 language codes
notation: bka

Ngiyambaa language
type: Language
type: Concept
ISO 639-3 code: wyb
alternative label: Wangaaybuwan-Ngiyambaa
definition: The Ngiyambaa language is a Pama–Nyungan language of the Wiradhuric subgroup. It was the traditional language of the Wangaaybuwan and Wayilwan peoples of New South Wales, Australia, but is now moribund; according to Donaldson by the 1970s there were only about ten people fluent in Wangaaybuwan, whilst there were only a couple of Wayilwan speakers left.
in scheme: Lexvo - ISO 639-3 language codes
notation: wyb

Baka
type: Language
type: Concept
ISO 639-3 code: bkc
alternative label: Baka (Cameroon)
in scheme: Lexvo - ISO 639-3 language codes
notation: bkc

Binukid
type: Language
type: Concept
ISO 639-3 code: bkd
alternative label: Talaandig
in scheme: Lexvo - ISO 639-3 language codes
notation: bkd

Beeke
type: Language
type: Concept
ISO 639-3 code: bkf
alternative label: Beeke language
definition: Beeke is a Bantu language of uncertain affiliation. Guthrie assigned to the Nyali cluster. However, Ethnologue suggests that it may be a divergent form of Bali. It is 65% cognate with Bali, but 38% with the Nyali language Ndaka.
in scheme: Lexvo - ISO 639-3 language codes
notation: bkf

Buraka
type: Language
type: Concept
ISO 639-3 code: bkg
in scheme: Lexvo - ISO 639-3 language codes
notation: bkg

Bakoko
type: Language
type: Concept
ISO 639-3 code: bkh
alternative label: Kogo language
definition: Kogo, or Bakoko, Basoo, is a Bantu language of Cameroon.
in scheme: Lexvo - ISO 639-3 language codes
notation: bkh

Baki
type: Language
type: Concept
ISO 639-3 code: bki
in scheme: Lexvo - ISO 639-3 language codes
notation: bki

Pande
type: Language
type: Concept
ISO 639-3 code: bkj
in scheme: Lexvo - ISO 639-3 language codes
notation: bkj

Brokskat
type: Language
type: Concept
ISO 639-3 code: bkk
in scheme: Lexvo - ISO 639-3 language codes
notation: bkk

Berik
type: Language
type: Concept
ISO 639-3 code: bkl
alternative label: Berik language
definition: Berik is a Papuan language spoken in eastern Papua. Speakers are located in four village groups on the Tor river towards the northern coast of Indonesian-controlled Irian Jaya. In 1994 it was estimated to have around 1200 speakers. It is regarded as one of the Tor–Kwerba languages. Illustrating this, in the phrase Kitobana (meaning "[he] gives three large objects to a male in the sunlight"), affixes indicating time of day, object number, object size, and gender of recipient are added to the verb.
in scheme: Lexvo - ISO 639-3 language codes
notation: bkl

Kom
type: Language
type: Concept
ISO 639-3 code: bkm
alternative label: Kom (Cameroon)
alternative label: Kom language
preferred label: kom @es
definition: The Kom language, Itaŋikom, is the language spoken by the Kom people of Cameroon. Schultz 1997a and Schutz 1997b (available online) contain a comprehensive description of the language's grammar.
in scheme: Lexvo - ISO 639-3 language codes
notation: bkm

Asunción Mixtepec Zapotec
type: Language
type: Concept
ISO 639-3 code: zoo
alternative label: Zapotec, Asunción Mixtepec
in scheme: Lexvo - ISO 639-3 language codes
notation: zoo

Bukitan
type: Language
type: Concept
ISO 639-3 code: bkn
in scheme: Lexvo - ISO 639-3 language codes
notation: bkn

Woiwurrung
type: Language
type: Concept
in scheme: Lexvo - ISO 639-3 language codes

Kwa'
type: Language
type: Concept
ISO 639-3 code: bko
in scheme: Lexvo - ISO 639-3 language codes
notation: bko

Boko
type: Language
type: Concept
ISO 639-3 code: bkp
alternative label: Boko (Democratic Republic of Congo)
in scheme: Lexvo - ISO 639-3 language codes
notation: bkp

Bakairí
type: Language
type: Concept
ISO 639-3 code: bkq
alternative label: Bakairi language
definition: Bakairí (Bacairí) is a Cariban language of Brazil.
in scheme: Lexvo - ISO 639-3 language codes
notation: bkq

Bakumpai
type: Language
type: Concept
ISO 639-3 code: bkr
alternative label: Bakumpai language
definition: Bakumpai is an Austronesian language bellonging to West Barito languages. It is spoken by about 100 000 Bakumpai people (subgroup of Dayak people) living in the central Kalimantan, Indonesia.
in scheme: Lexvo - ISO 639-3 language codes
notation: bkr

Northern Sorsoganon
type: Language
type: Concept
ISO 639-3 code: bks
alternative label: Sorsoganon, Northern
in scheme: Lexvo - ISO 639-3 language codes
notation: bks

Wymysorys
type: Language
type: Concept
ISO 639-3 code: wym
alternative label: Vilamovian language
definition: Vilamovian or Wilamowicean (Wymysiöeryś) is a West Germanic language spoken in the small town of Wilamowice (Wymysoj in Vilamovian) near Bielsko-Biała, on the border between Silesia and Lesser Poland in the historical region of Galicia. At present, there are about 70 native users of Vilamovian, the majority of them elderly people; Vilamovian is therefore a moribund language.
in scheme: Lexvo - ISO 639-3 language codes
notation: wym
preferred label: Lingua vilamoviana @it
preferred label: Wilamowicien @fr
preferred label: Wilmesaurisch @de

Boloki
type: Language
type: Concept
ISO 639-3 code: bkt
in scheme: Lexvo - ISO 639-3 language codes
notation: bkt

Buhid
type: Language
type: Concept
ISO 639-3 code: bku
alternative label: Buhid language
definition: The Buhid language is a language spoken by Mangyans in the province of Mindoro in the Philippines. It is divided into eastern and western dialects.
in scheme: Lexvo - ISO 639-3 language codes
notation: bku
preferred label: Buid @de

Bekwarra
type: Language
type: Concept
ISO 639-3 code: bkv
alternative label: Bekwarra language
definition: Bekwarra is a Bendi (Benue–Congo) language of Nigeria.
in scheme: Lexvo - ISO 639-3 language codes
notation: bkv

Bekwel
type: Language
type: Concept
ISO 639-3 code: bkw
in scheme: Lexvo - ISO 639-3 language codes
notation: bkw

Baikeno
type: Language
type: Concept
ISO 639-3 code: bkx
in scheme: Lexvo - ISO 639-3 language codes
notation: bkx

Bokyi
type: Language
type: Concept
ISO 639-3 code: bky
alternative label: Boki language
definition: Boki (Bokyi, Okii) is a regionally important Bendi (Benue–Congo) language of Nigeria, with a few thousand speakers in Cameroon.
in scheme: Lexvo - ISO 639-3 language codes
notation: bky

Bungku
type: Language
type: Concept
ISO 639-3 code: bkz
in scheme: Lexvo - ISO 639-3 language codes
notation: bkz

Siksika
type: Language
type: Concept
ISO 639-2 Bibliographical code: bla
ISO 639-2 Terminological code: bla
ISO 639-3 code: bla
alternative label: Blackfoot language
alternative label: Idioma siksiká @es
alternative label: Pied-noir @fr
alternative label: blackfoot @fr
definition: Blackfoot, also known as Siksika (so called in ISO 639-3), Pikanii, and Blackfeet, is the Algonquian language spoken by the Blackfoot tribes of Native Americans, who currently live in the northwestern plains of North America. There are four dialects of Blackfoot, three of which are spoken in Alberta, Canada and one of which is spoken in the United States: Siksiká (Blackfoot), to the southeast of Calgary, AB; Kainai (Blood), spoken in Alberta between Cardston and Lethbridge; Aapátohsipikani (Northern Piegan), to the west of Fort MacLeod; and Aamsskáápipikani (Southern Piegan), in northwestern Montana.
in scheme: Lexvo - ISO 639-3 language codes
notation: bla
preferred label: Blackfoot-Sprache @de
preferred label: siksika @es

Bilua
type: Language
type: Concept
ISO 639-3 code: blb
alternative label: Bilua language
definition: Bilua is the most populous Papuan language spoken in the Solomon Islands. It is a Central Solomons language spoken by about 9000 people on the island of Vella Lavella.
in scheme: Lexvo - ISO 639-3 language codes
notation: blb

Bella Coola
type: Language
type: Concept
ISO 639-3 code: blc
alternative label: Nuxálk language
definition: Nuxálk (also Bella Coola) is a Salishan language spoken in the vicinity of the Canadian town Bella Coola, British Columbia by approximately 20-30 elders. Until recently, the language was called Bella Coola, but the native designation Nuxálk is now preferred.
in scheme: Lexvo - ISO 639-3 language codes
notation: blc

Bolango
type: Language
type: Concept
ISO 639-3 code: bld
alternative label: Bolango language
definition: Bolango is a Philippine language spoken in North-eastern Sulawesi Indonesia. In 1981 it was spoken by some 20.000 people, 5000 in Bolango and 15.000 in Atingolla.
in scheme: Lexvo - ISO 639-3 language codes
notation: bld

Balanta-Kentohe
type: Language
type: Concept
ISO 639-3 code: ble
in scheme: Lexvo - ISO 639-3 language codes
notation: ble

Buol
type: Language
type: Concept
ISO 639-3 code: blf
alternative label: Buol language
definition: Buol (Bual, Bwo’ol, Bwool, Dia) is a Philippine language spoken in North-eastern Sulawesi, Indonesia.
in scheme: Lexvo - ISO 639-3 language codes
notation: blf

Balau
type: Language
type: Concept
ISO 639-3 code: blg
in scheme: Lexvo - ISO 639-3 language codes
notation: blg

Kuwaa
type: Language
type: Concept
ISO 639-3 code: blh
alternative label: Kuwaa language
definition: The Kuwaa language, also known as Belle, Belleh, Kowaao, and Kwaa, is a Kru language of the Niger–Congo language family. It is spoken in northwestern Liberia, primarily in Lofa County. The speech of the Lubaisu and Gbade, the two Kuwaa clans, is differentiated only by minor variations in pronunciation.
in scheme: Lexvo - ISO 639-3 language codes
notation: blh

Wayoró
type: Language
type: Concept
ISO 639-3 code: wyr
in scheme: Lexvo - ISO 639-3 language codes
notation: wyr

Bolia
type: Language
type: Concept
ISO 639-3 code: bli
in scheme: Lexvo - ISO 639-3 language codes
notation: bli

Bolongan
type: Language
type: Concept
ISO 639-3 code: blj
in scheme: Lexvo - ISO 639-3 language codes
notation: blj

Pa'O
type: Language
type: Concept
ISO 639-3 code: blk
alternative label: Karen, Pa'o
alternative label: Pa'O language
alternative label: Pa'o Karen
definition: PaO is a Karen language spoken by half a million PaO people in Burma.
in scheme: Lexvo - ISO 639-3 language codes
notation: blk

Biloxi
type: Language
type: Concept
ISO 639-3 code: bll
alternative label: Biloxi language
definition: Biloxi is an extinct Siouan language which was at one time spoken in Mississippi, Louisiana. and southeast Texas.
in scheme: Lexvo - ISO 639-3 language codes
notation: bll

Beli
type: Language
type: Concept
ISO 639-3 code: blm
alternative label: Beli (Sudan)
alternative label: Beli language
definition: ’Beli, or Jur Beli, is a Central Sudanic language spoken by the Beli and Sopi people of South Sudan.
in scheme: Lexvo - ISO 639-3 language codes
notation: blm

Southern Catanduanes Bikol
type: Language
type: Concept
ISO 639-3 code: bln
alternative label: Bikol, Southern Catanduanes
in scheme: Lexvo - ISO 639-3 language codes
notation: bln

Anii
type: Language
type: Concept
ISO 639-3 code: blo
alternative label: Basila language
definition: The Anii or Basila language (also Baseca, Ouinji-Ouinji ~ Winji-Winji) is spoken in central eastern Ghana and central western Togo. It is part of the geographic group of Ghana Togo Mountain languages (traditionally called the Togorestsprachen or Togo Remnant languages) of the Kwa branch of Niger–Congo.
in scheme: Lexvo - ISO 639-3 language codes
notation: blo

Western Fijian
type: Language
type: Concept
ISO 639-3 code: wyy
alternative label: Fijian, Western
alternative label: Western Fijian language
definition: Western Fijian is an Oceanic language spoken in Fiji by about 57,000 people.
in scheme: Lexvo - ISO 639-3 language codes
notation: wyy
preferred label: Fidjien occidental @fr

Blablanga
type: Language
type: Concept
ISO 639-3 code: blp
in scheme: Lexvo - ISO 639-3 language codes
notation: blp

Baluan-Pam
type: Language
type: Concept
ISO 639-3 code: blq
in scheme: Lexvo - ISO 639-3 language codes
notation: blq

Blang
type: Language
type: Concept
ISO 639-3 code: blr
alternative label: Blang language
definition: Blang (Pulang) is the language of the Blang people of Burma and China.
in scheme: Lexvo - ISO 639-3 language codes
notation: blr

Balaesang
type: Language
type: Concept
ISO 639-3 code: bls
in scheme: Lexvo - ISO 639-3 language codes
notation: bls

Tai Dam
type: Language
type: Concept
ISO 639-3 code: blt
alternative label: Tai Dam language
definition: Tai Dam, also known as Black Tai is a Tai language spoken by the Tai Dam in Vietnam, Laos, Thailand, and China (mostly in the Jinping Miao, Yao, and Dai Autonomous County). It is called ภาษาไทดำ "Black Tai language" in Thai and Dǎidānyǔ 傣担语 in Chinese.
in scheme: Lexvo - ISO 639-3 language codes
notation: blt

Bolo
type: Language
type: Concept
ISO 639-3 code: blv
in scheme: Lexvo - ISO 639-3 language codes
notation: blv

Balangao
type: Language
type: Concept
ISO 639-3 code: blw
in scheme: Lexvo - ISO 639-3 language codes
notation: blw

Mag-Indi Ayta
type: Language
type: Concept
ISO 639-3 code: blx
alternative label: Ayta, Mag-Indi
alternative label: Mag-indi language
definition: Mag-indi or Baloga is a Sambalic language. It has around 5,000 speakers (SIL 1998) and is spoken within Aeta communities in San Marcelino, Zambales, and in the Pampango municipalities of Floridablanca and Porac.
in scheme: Lexvo - ISO 639-3 language codes
notation: blx

Notre
type: Language
type: Concept
ISO 639-3 code: bly
in scheme: Lexvo - ISO 639-3 language codes
notation: bly

Balantak
type: Language
type: Concept
ISO 639-3 code: blz
in scheme: Lexvo - ISO 639-3 language codes
notation: blz

Lame
type: Language
type: Concept
ISO 639-3 code: bma
in scheme: Lexvo - ISO 639-3 language codes
notation: bma

Bembe
type: Language
type: Concept
ISO 639-3 code: bmb
alternative label: Bembe (Ibembe) language
definition: Bembe (Ibembe) is a Bantu language of the Democratic Republic of the Congo. According to Ethnologue, it forms a dialect continuum with the Lega language through Mwenga Lega. It has no connection with the minor Bembe (Kibembe) language of the Republic of Congo.
in scheme: Lexvo - ISO 639-3 language codes
notation: bmb

Biem
type: Language
type: Concept
ISO 639-3 code: bmc
in scheme: Lexvo - ISO 639-3 language codes
notation: bmc

Andalusian Arabic
type: Language
type: Concept
ISO 639-3 code: xaa
alternative label: Arabic, Andalusian
definition: Andalusian Arabic (also known as Andalusi Arabic, Spanish Arabic, or Moorish Arabic) was a variety of the Arabic language spoken in Al-Andalus, the regions of the Iberian Peninsula (modern Spain and Portugal) under Muslim rule. It became an extinct language in Iberia after the expulsion of the Moriscos, which took place over a century after the Reconquista by Christian Spain. Andalusi Arabic is still used in Andalusi music and has significantly influenced the dialects of such towns as Fez, Rabat, Nedroma, Tlemcen, Blida, Cherchell, Tangiers, Tetouan, etc., to which many Andalusians and Moriscos fled. It also exerted some influence on Mozarabic, Spanish (particularly Andalusian), Catalan, Portuguese, and the Moroccan Arabic dialect.
in scheme: Lexvo - ISO 639-3 language codes
notation: xaa
preferred label: Arabe andalou @fr
preferred label: Dialeto árabe andaluz @pt
preferred label: Árabe andalusí @es

Baga Manduri
type: Language
type: Concept
ISO 639-3 code: bmd
alternative label: Manduri, Baga
in scheme: Lexvo - ISO 639-3 language codes
notation: bmd

Limassa
type: Language
type: Concept
ISO 639-3 code: bme
in scheme: Lexvo - ISO 639-3 language codes
notation: bme

Bom
type: Language
type: Concept
ISO 639-3 code: bmf
alternative label: Bom language
definition: The Bom language (alternates: Bome; Bomo) is an endangered language of Sierra Leone. It belongs to the Mel branch of the Niger–Congo language family and is particularly closely related to the Bullom So language. Most speakers are bilingual in Mende, and use of the Bom language is declining among members of the ethnic group.
in scheme: Lexvo - ISO 639-3 language codes
notation: bmf

Bamwe
type: Language
type: Concept
ISO 639-3 code: bmg
in scheme: Lexvo - ISO 639-3 language codes
notation: bmg

Kein
type: Language
type: Concept
ISO 639-3 code: bmh
in scheme: Lexvo - ISO 639-3 language codes
notation: bmh

Bagirmi
type: Language
type: Concept
ISO 639-3 code: bmi
alternative label: Bagirmi language
definition: Bagirmi (or Baguirmi; autonym: ) is the language of the Baguirmi people of Chad, belonging to the Nilo-Saharan family. It is spoken by 44,761 people (as of 1993), mainly in the Chari-Baguirmi Prefecture. It was the language of the kingdom of Baguirmi.
in scheme: Lexvo - ISO 639-3 language codes
notation: bmi

Bote-Majhi
type: Language
type: Concept
ISO 639-3 code: bmj
in scheme: Lexvo - ISO 639-3 language codes
notation: bmj

Ghayavi
type: Language
type: Concept
ISO 639-3 code: bmk
in scheme: Lexvo - ISO 639-3 language codes
notation: bmk

Bomboli
type: Language
type: Concept
ISO 639-3 code: bml
in scheme: Lexvo - ISO 639-3 language codes
notation: bml

Northern Betsimisaraka Malagasy
type: Language
type: Concept
ISO 639-3 code: bmm
alternative label: Malagasy, Northern Betsimisaraka
in scheme: Lexvo - ISO 639-3 language codes
notation: bmm

Bina
type: Language
type: Concept
ISO 639-3 code: bmn
alternative label: Bina (Papua New Guinea)
in scheme: Lexvo - ISO 639-3 language codes
notation: bmn

Bambalang
type: Language
type: Concept
ISO 639-3 code: bmo
in scheme: Lexvo - ISO 639-3 language codes
notation: bmo

Bulgebi
type: Language
type: Concept
ISO 639-3 code: bmp
in scheme: Lexvo - ISO 639-3 language codes
notation: bmp

Bomu
type: Language
type: Concept
ISO 639-3 code: bmq
in scheme: Lexvo - ISO 639-3 language codes
notation: bmq

Sambe
type: Language
type: Concept
ISO 639-3 code: xab
alternative label: Sambe language
definition: Sambe is a nearly extinct Plateau language of Nigeria. Most Sambe have shifted to Ninzo.
in scheme: Lexvo - ISO 639-3 language codes
notation: xab

Muinane
type: Language
type: Concept
ISO 639-3 code: bmr
alternative label: Muinane language
definition: Muinane is an indigenous American language spoken in western South America.
in scheme: Lexvo - ISO 639-3 language codes
notation: bmr

Bilma Kanuri
type: Language
type: Concept
ISO 639-3 code: bms
alternative label: Kanuri, Bilma
in scheme: Lexvo - ISO 639-3 language codes
notation: bms

Biao Mon
type: Language
type: Concept
ISO 639-3 code: bmt
in scheme: Lexvo - ISO 639-3 language codes
notation: bmt

Somba-Siawari
type: Language
type: Concept
ISO 639-3 code: bmu
in scheme: Lexvo - ISO 639-3 language codes
notation: bmu

Bum
type: Language
type: Concept
ISO 639-3 code: bmv
in scheme: Lexvo - ISO 639-3 language codes
notation: bmv

Bomwali
type: Language
type: Concept
ISO 639-3 code: bmw
alternative label: Bomwali language
definition: Bomwali is a Bantu language of Congo and Cameroon.
in scheme: Lexvo - ISO 639-3 language codes
notation: bmw

Baimak
type: Language
type: Concept
ISO 639-3 code: bmx
in scheme: Lexvo - ISO 639-3 language codes
notation: bmx

Bemba
type: Language
type: Concept
ISO 639-3 code: bmy
alternative label: Bemba (Democratic Republic of Congo)
alternative label: Bemba language
definition: The Bemba language of Congo, Kinyabemba, is a Bantu language of uncertain classification.
in scheme: Lexvo - ISO 639-3 language codes
notation: bmy

Baramu
type: Language
type: Concept
ISO 639-3 code: bmz
in scheme: Lexvo - ISO 639-3 language codes
notation: bmz

Bonerate
type: Language
type: Concept
ISO 639-3 code: bna
in scheme: Lexvo - ISO 639-3 language codes
notation: bna

Bookan
type: Language
type: Concept
ISO 639-3 code: bnb
in scheme: Lexvo - ISO 639-3 language codes
notation: bnb

Bontok
type: Language
type: Concept
ISO 639-3 code: bnc
alternative label: Bontoc language
definition: Bontoc (also spelled Bontok) is the native language of the indigenous Bontoc people of the Mountain Province, in the northern part of the Philippines.
in scheme: Lexvo - ISO 639-3 language codes
notation: bnc

Kachari
type: Language
type: Concept
ISO 639-3 code: xac
alternative label: Kachari language
definition: Kachari (or Cachari) is a Tibeto-Burman language spoken by about 59,000 people in Assam, India.
in scheme: Lexvo - ISO 639-3 language codes
notation: xac

Banda
type: Language
type: Concept
ISO 639-3 code: bnd
alternative label: Banda (Indonesia)
alternative label: Banda language
definition: Banda is one of two languages of the Kei Islands, along with Kei itself.
in scheme: Lexvo - ISO 639-3 language codes
notation: bnd

Bintauna
type: Language
type: Concept
ISO 639-3 code: bne
in scheme: Lexvo - ISO 639-3 language codes
notation: bne

Masiwang
type: Language
type: Concept
ISO 639-3 code: bnf
in scheme: Lexvo - ISO 639-3 language codes
notation: bnf

Benga
type: Language
type: Concept
ISO 639-3 code: bng
alternative label: Benga language
definition: Benga is a West Bantu family language spoken by the Benga people of Equatorial Guinea and Gabon. It has a dialectical variation called Bapuku. Benga speakers inhabit a small coastal portion of Rio Muni, the Cape of San Juan, suburban enclaves of Rio Benito and Bata, the islands of Corisco, and both Small Elobey and Great Elobey.
in scheme: Lexvo - ISO 639-3 language codes
notation: bng

Bangi
type: Language
type: Concept
ISO 639-3 code: bni
alternative label: Bangi language
definition: The Bangi language, or Bobangi, is the a relative and partial precursor of the Lingala language spoken in central Africa. Dialects of the language are spoken on both sides of the Ubangi and Congo Rivers, such as Moï, Mpama, Binza, Dzamba.
in scheme: Lexvo - ISO 639-3 language codes
notation: bni
preferred label: Bobangi @fr

Eastern Tawbuid
type: Language
type: Concept
ISO 639-3 code: bnj
alternative label: Tawbuid, Eastern
in scheme: Lexvo - ISO 639-3 language codes
notation: bnj

Bierebo
type: Language
type: Concept
ISO 639-3 code: bnk
in scheme: Lexvo - ISO 639-3 language codes
notation: bnk

Boon
type: Language
type: Concept
ISO 639-3 code: bnl
alternative label: Boon language
definition: Boon or Af-Boon is a nearly extinct East Cushitic language spoken by 59 people (as of 2000) in Jilib District, Middle Jubba Region, Somalia. In recent decades they have shifted to the Maay dialect of Jilib. All speakers are older than 60.
in scheme: Lexvo - ISO 639-3 language codes
notation: bnl

Batanga
type: Language
type: Concept
ISO 639-3 code: bnm
in scheme: Lexvo - ISO 639-3 language codes
notation: bnm

Bunun
type: Language
type: Concept
ISO 639-3 code: bnn
alternative label: Bunun language
definition: The Bunun language is spoken by the Bunun people of Taiwan. It is one of the Formosan languages, a geographic group of Austronesian languages, and is subdivided in five dialects: Isbukun, Takbunuaz, Takivatan, Takibaka and Takituduh. Isbukun, the dominant dialect, is mainly spoken in the south of Taiwan. Takbunuaz and Takivatan are mainly spoken in the center of the country. Takibaka and Takituduh both are northern dialects. A sixth dialect, Takipulan, became extinct in the 1970s.
in scheme: Lexvo - ISO 639-3 language codes
notation: bnn

Bantoanon
type: Language
type: Concept
ISO 639-3 code: bno
alternative label: Asi language
definition: The Asi language is a Visayan language spoken, along with the Romblomanon and Onhan languages, in the province of Romblon, Philippines. The language is also known as Bantoanon, Calatravanhon, Odionganon, Sibalenhon, Simaranhon, and Bisaya.
in scheme: Lexvo - ISO 639-3 language codes
notation: bno
preferred label: Asi @fr

Adai
type: Language
type: Concept
ISO 639-3 code: xad
alternative label: Adai language
definition: Adai (also Adaizan, Adaizi, Adaise, Adahi, Adaes, Adees, Atayos) is an extinct language that was spoken in northwestern Louisiana. It is very poorly documented, being known only from a list of 275 words from 1804, so classification is probably impossible. It was once proposed that there may be a connection between Adai and the nearby Caddoan languages, but this now seems unlikely.
in scheme: Lexvo - ISO 639-3 language codes
notation: xad
preferred label: Adaizan @fr

Bola
type: Language
type: Concept
ISO 639-3 code: bnp
in scheme: Lexvo - ISO 639-3 language codes
notation: bnp

Bantik
type: Language
type: Concept
ISO 639-3 code: bnq
alternative label: Bantik language
definition: Bantik is an endangered is an Austronesian language, perhaps a Philippine language, of North Sulawesi, Indonesia. It is the traditional language of the Bantik people, who are now switching to Manado Malay (the local variety of Indonesian) as their language for everyday communication, though Bantik is still used as a marker of ethnic identity.
in scheme: Lexvo - ISO 639-3 language codes
notation: bnq

Butmas-Tur
type: Language
type: Concept
ISO 639-3 code: bnr
in scheme: Lexvo - ISO 639-3 language codes
notation: bnr

Bundeli
type: Language
type: Concept
ISO 639-3 code: bns
in scheme: Lexvo - ISO 639-3 language codes
notation: bns

Bentong
type: Language
type: Concept
ISO 639-3 code: bnu
in scheme: Lexvo - ISO 639-3 language codes
notation: bnu

Edwas
type: Language
type: Concept
ISO 639-3 code: bnv
alternative label: Beneraf
alternative label: Bonerif
in scheme: Lexvo - ISO 639-3 language codes
notation: bnv

Bisis
type: Language
type: Concept
ISO 639-3 code: bnw
in scheme: Lexvo - ISO 639-3 language codes
notation: bnw

Bangubangu
type: Language
type: Concept
ISO 639-3 code: bnx
alternative label: Bangubangu language
definition: Bangubangu is a Bantu dialect cluster of the Democratic Republic of the Congo.
in scheme: Lexvo - ISO 639-3 language codes
notation: bnx

Bintulu
type: Language
type: Concept
ISO 639-3 code: bny
in scheme: Lexvo - ISO 639-3 language codes
notation: bny

Beezen
type: Language
type: Concept
ISO 639-3 code: bnz
in scheme: Lexvo - ISO 639-3 language codes
notation: bnz

Bora
type: Language
type: Concept
ISO 639-3 code: boa
alternative label: Bora language
definition: Bora is an indigenous American language spoken in western South America. Bora proper has 94% mutual comprehensibility with the Miraña dialect. The majority of its speakers reside in Perú where 2,328 Bora-speakers live in the Northeast Yaguasyacu, Putumayo, and Ampiyacu river areas. Peruvian speakers have a 10 to 30% literacy rate and a 25 to 50% literacy rate in their second language. A dictionary has been developed and the language has its own grammar rules. It is known as Miraña in Brazil but there are no longer any speakers there. There are about 500 speakers in Colombia in the Putumayo area. Bora contains 350 noun classes, the most discovered of any languages thus far.
in scheme: Lexvo - ISO 639-3 language codes
notation: boa
preferred label: Idioma bora @es
preferred label: Língua bora @pt

Aweer
type: Language
type: Concept
ISO 639-3 code: bob
alternative label: Aweer language
definition: Aweer (also known as Aweera, Boni, Bon, Bonta) is a Cushitic language spoken in Kenya. Historically known in the literature by the derogatory term Boni, the Aweer are foragers traditionally subsisting on hunting, gathering, and collecting honey. Their ancestral lands range along the Kenyan coast from the Lamu and Ijara Districts into Southern Somalia's Badaade District.
in scheme: Lexvo - ISO 639-3 language codes
notation: bob

Tibetan
type: Language
type: Concept
ISO 639-1 code: bo
ISO 639-2 Bibliographical code: tib
ISO 639-2 Terminological code: bod
ISO 639-3 code: bod
alternative label: Idioma tibetano @es
alternative label: Lingua tibetana @it
alternative label: Língua tibetana @pt
alternative label: Standard Tibetan
alternative label: Tibetan language
alternative label: Tibetische Sprache @de
alternative label: tibétain @fr
definition: Standard Tibetan (, ; also ) is the most widely used spoken form of the Tibetan languages. It is based on the speech of Lhasa, an Ü-Tsang dialect belonging to the Central Tibetan languages. For this reason, Standard Tibetan is often called Central Tibetan ( ; also written Ükä or Uke or , also written Ü-tsang kä). Tibetan, often implicitly meaning Standard Tibetan, is an official language of the Tibet Autonomous Region of the People's Republic of China. Central Tibetan is one of several branches of the Tibetan languages, the most salient others being Khams, Amdo, and Ladakhi. The standard form of written Tibetan is based on Classical Tibetan and is highly conservative.
in scheme: Lexvo - ISO 639-3 language codes
notation: bod
preferred label: Tibetisch @de
preferred label: Tibétain @fr
preferred label: tibetano @es

Ayapa Zoque
type: Language
type: Concept
ISO 639-3 code: zoq
alternative label: Tabasco Zoque
alternative label: Zoque, Tabasco
definition: Ayapa Zoque, or Ayapanec, is a possibly extinct Zoquean language of Tabasco, Mexico.
in scheme: Lexvo - ISO 639-3 language codes
notation: zoq

Mundabli
type: Language
type: Concept
ISO 639-3 code: boe
alternative label: Mundabli language
definition: Mundabli is a Bantoid language of Cameroon. It is traditionally classified as a Western Beboid language, but that has not been demonstrated to be a valid family.
in scheme: Lexvo - ISO 639-3 language codes
notation: boe

Aequian
type: Language
type: Concept
ISO 639-3 code: xae
alternative label: Aequian language
definition: Aequian is an extinct language presumed spoken by the people the Romans termed Aequi and Aequicoli living in the Alban hills of northeast Latium and the central Apennines east of them during the early and middle Roman Republic; that is, approximately from the 5th to the 3rd century BC, when they were defeated by the armies of Rome and were subsequently Romanized. As the area was heavily colonized by Latin speakers from Rome, most of the inscriptions from there are in Latin. Two undated inscriptions appear to be in a different dialect, termed Aequian by the scholars with the presumption that in fact they represent the language of the entire pre-Roman tribe. Not enough text survives to deduce any more than that it belonged to the Italic branch of the Indo-European language family.
in scheme: Lexvo - ISO 639-3 language codes
notation: xae
preferred label: Idioma ecuo @es

Bolon
type: Language
type: Concept
ISO 639-3 code: bof
in scheme: Lexvo - ISO 639-3 language codes
notation: bof

Bamako Sign Language
type: Language
type: Concept
ISO 639-3 code: bog
in scheme: Lexvo - ISO 639-3 language codes
notation: bog

Boma
type: Language
type: Concept
ISO 639-3 code: boh
alternative label: Boma language
definition: Boma is a Bantu language of the Democratic Republic of Congo.
in scheme: Lexvo - ISO 639-3 language codes
notation: boh

Barbareño
type: Language
type: Concept
ISO 639-3 code: boi
alternative label: Barbareño language
definition: Barbareño is one of the extinct Chumash languages, a group of Native American languages previously spoken along the coastal areas of Southern California from as far north as San Luis Obispo to as far south as Malibu, California. The last first-language speaker of Barbareño was Mary Yee.
in scheme: Lexvo - ISO 639-3 language codes
notation: boi
preferred label: Chumash barbareño @fr

Anjam
type: Language
type: Concept
ISO 639-3 code: boj
alternative label: Anjam language
definition: Anjam or Bom is a Rai Coast language spoken in Madang Province, Papua New Guinea.
in scheme: Lexvo - ISO 639-3 language codes
notation: boj

Bonjo
type: Language
type: Concept
ISO 639-3 code: bok
alternative label: Bonjo language
definition: Bonjo is a minor Ubangian language of the Central African Republic.
in scheme: Lexvo - ISO 639-3 language codes
notation: bok

Bole
type: Language
type: Concept
ISO 639-3 code: bol
alternative label: Bole language
definition: Bole (also known as Bolanchi, Ampika, Borpika, Bolewa, Bolawa) is an Afro-Asiatic language spoken in Nigeria. Dialects include Bara and Fika, spoken in the Fika Emirate.
in scheme: Lexvo - ISO 639-3 language codes
notation: bol

Berom
type: Language
type: Concept
ISO 639-3 code: bom
alternative label: Berom language
definition: Berom (Birom) is a Plateau language of Nigeria. Although locally numerically important, the Berom are shifting to Hausa.
in scheme: Lexvo - ISO 639-3 language codes
notation: bom

Bine
type: Language
type: Concept
ISO 639-3 code: bon
alternative label: Bine language
definition: Bine (Pine), or Oriomo (a name shared with Wipi), is a Papuan language of New Guinea.
in scheme: Lexvo - ISO 639-3 language codes
notation: bon

Tiemacèwè Bozo
type: Language
type: Concept
ISO 639-3 code: boo
alternative label: Bozo, Tiemacèwè
in scheme: Lexvo - ISO 639-3 language codes
notation: boo

Bonkiman
type: Language
type: Concept
ISO 639-3 code: bop
in scheme: Lexvo - ISO 639-3 language codes
notation: bop

Bogaya
type: Language
type: Concept
ISO 639-3 code: boq
alternative label: Pogaya language
definition: Bogaya (Pogaya) is a Papuan language of Papua New Guinea.
in scheme: Lexvo - ISO 639-3 language codes
notation: boq

Aghwan
type: Language
type: Concept
ISO 639-3 code: xag
alternative label: Caucasian Albanian language
definition: Caucasian Albanian, Aghwan or Old Udi, is an extinct member of the Caucasian language family. It was spoken in Caucasian Albania, which stretched from current day south Dagestan to Azerbaijan. Linguists believe it is an early linguistic predecessor to the endangered North Caucasian Udi language.
in scheme: Lexvo - ISO 639-3 language codes
notation: xag
preferred label: Alwanische Sprache @de

Borôro
type: Language
type: Concept
ISO 639-3 code: bor
alternative label: Bororo language
definition: The Bororo language, or Borôro, also known as Boe, is the sole surviving language of a small family believed to be part of the Macro-Gê languages. It is spoken by the Bororo people, hunters and gatherers in the Central Mato Grosso region of Brazil.
in scheme: Lexvo - ISO 639-3 language codes
notation: bor

Bosnian
type: Language
type: Concept
ISO 639-1 code: bs
ISO 639-2 Bibliographical code: bos
ISO 639-2 Terminological code: bos
ISO 639-3 code: bos
alternative label: Bosnian language
alternative label: Bosnische Sprache @de
alternative label: Idioma bosnio @es
alternative label: Lingua bosniaca @it
alternative label: Língua bósnia @pt
alternative label: bosniaque @fr
definition: Bosnian ( , Cyrillic: ) is a form of Serbo-Croatian, a South Slavic language, spoken by Bosniaks. As a standardized form of the Shtokavian dialect, it is one of the three official languages of Bosnia and Herzegovina. The same subdialect of Shtokavian is also the basis of standard Croatian, Serbian, and Montenegrin, so all are mutually intelligible. Up until the dissolution of former SFR Yugoslavia, they were treated as a unitary Serbo-Croatian language, and that term is still used to refer to the common base (vocabulary, grammar and syntax) of what are today officially four national standards. The Bosnian standard uses both Latin and Cyrillic alphabets. The first dictionary in the Bosnian language was printed in the early 17th century, while first dictionary in Serbian was printed in the early 19th century.
in scheme: Lexvo - ISO 639-3 language codes
notation: bos
preferred label: Bosnien @fr
preferred label: Bosnisch @de
preferred label: bosniaco @it
preferred label: bosnio @es
preferred label: bósnio @pt

Bongo
type: Language
type: Concept
ISO 639-3 code: bot
alternative label: Bongo language
definition: Bongo, also spelled Bungu and known as Dor, is a Central Sudanic language spoken in sparsely populated areas of South Sudan. Dialectical differences are slight.
in scheme: Lexvo - ISO 639-3 language codes
notation: bot

Bondei
type: Language
type: Concept
ISO 639-3 code: bou
in scheme: Lexvo - ISO 639-3 language codes
notation: bou

Tuwuli
type: Language
type: Concept
ISO 639-3 code: bov
alternative label: Bowili language
definition: The Bowili (Bowiri) language, Tuwuli (Liwuli, Siwuri, Tuwili, Tora), is spoken in the Volta Region of Ghana. It is considered one of the Ghana–Togo Mountain languages of the Kwa family.
in scheme: Lexvo - ISO 639-3 language codes
notation: bov

Rema
type: Language
type: Concept
ISO 639-3 code: bow
in scheme: Lexvo - ISO 639-3 language codes
notation: bow

Buamu
type: Language
type: Concept
ISO 639-3 code: box
in scheme: Lexvo - ISO 639-3 language codes
notation: box

Bodo
type: Language
type: Concept
ISO 639-3 code: boy
alternative label: Bodo (Central African Republic)
alternative label: Bodo language
definition: Bodo is a possibly extinct Bantu language of the Central African Republic. It may be part of a group of languages called "Lebonya".
in scheme: Lexvo - ISO 639-3 language codes
notation: boy

Tiéyaxo Bozo
type: Language
type: Concept
ISO 639-3 code: boz
alternative label: Bozo, Tiéyaxo
in scheme: Lexvo - ISO 639-3 language codes
notation: boz

Dakaka
type: Language
type: Concept
ISO 639-3 code: bpa
alternative label: Daakaka
in scheme: Lexvo - ISO 639-3 language codes
notation: bpa

Barbacoas
type: Language
type: Concept
ISO 639-3 code: bpb
alternative label: Pasto language
definition: Pasto is a Barbacoan language that was spoken by indigenous people in Ecuador. It is now extinct.
in scheme: Lexvo - ISO 639-3 language codes
notation: bpb
preferred label: Idioma pasto @es
preferred label: Pasto @fr

Banda-Banda
type: Language
type: Concept
ISO 639-3 code: bpd
in scheme: Lexvo - ISO 639-3 language codes
notation: bpd

Kaimbé
type: Language
type: Concept
ISO 639-3 code: xai
alternative label: Kaimbé language
definition: Kaimbé is an extinct unclassified language of eastern Brazil. The ethnic population numbered an estimated 1,100 to 1,400 in 1986. The language is scarcely attested; in 1961 one elder was able to remember a few single words mixed with Kiriri.
in scheme: Lexvo - ISO 639-3 language codes
notation: xai

Bonggo
type: Language
type: Concept
ISO 639-3 code: bpg
in scheme: Lexvo - ISO 639-3 language codes
notation: bpg

Botlikh
type: Language
type: Concept
ISO 639-3 code: bph
alternative label: Botlikh language
definition: Botlikh (also spelled Botlix) is an Andic language of the Northeast Caucasian language family spoken by the Botlikhs in the Buikhe and Ashino villages in southwestern Dagestan, Russia by approximately 5,500 people, according to a survey by Koryakov in 2006.
in scheme: Lexvo - ISO 639-3 language codes
notation: bph
preferred label: Lingua botlikh @it

Bagupi
type: Language
type: Concept
ISO 639-3 code: bpi
in scheme: Lexvo - ISO 639-3 language codes
notation: bpi

Binji
type: Language
type: Concept
ISO 639-3 code: bpj
in scheme: Lexvo - ISO 639-3 language codes
notation: bpj

'Ôrôê
type: Language
type: Concept
ISO 639-3 code: bpk
alternative label: Orowe
in scheme: Lexvo - ISO 639-3 language codes
notation: bpk

Broome Pearling Lugger Pidgin
type: Language
type: Concept
ISO 639-3 code: bpl
definition: Broome Pearling Lugger Pidgin is a pidgin that sprung up in Broome, Western Australia in the early 20th century to facilitate communication between the various groups working in the pearling industry there—Japanese, Malays, Torres Strait Islanders, Koepangers, Hakka Chinese, Filipinos, a small number of Koreans, and local Australian Aborigines, mainly of the Bardi tribe but also Nyulnyul, Jabirrjabirr, Jukun, Yawuru and Karajarri people. Its words come primarily from the Malay language (specifically Kupang Malay), but it also took some words and grammatical features from Japanese, English (through the Pidgin English of the Aborigines), and the local Australian Aboriginal languages.
in scheme: Lexvo - ISO 639-3 language codes
notation: bpl

Biyom
type: Language
type: Concept
ISO 639-3 code: bpm
in scheme: Lexvo - ISO 639-3 language codes
notation: bpm

Dzao Min
type: Language
type: Concept
ISO 639-3 code: bpn
alternative label: Dzao Min language
definition: Dzao Min, or Ba Pai, is a Hmong–Mien language of China.
in scheme: Lexvo - ISO 639-3 language codes
notation: bpn

Anasi
type: Language
type: Concept
ISO 639-3 code: bpo
alternative label: Anasi language
definition: Anasi, also known as Bapu, is a Papuan language of the Indonesian province of Papua.
in scheme: Lexvo - ISO 639-3 language codes
notation: bpo

Kaure
type: Language
type: Concept
ISO 639-3 code: bpp
alternative label: Kaure language
definition: Kaure is a Papuan language of West Papua.
in scheme: Lexvo - ISO 639-3 language codes
notation: bpp

Banda Malay
type: Language
type: Concept
ISO 639-3 code: bpq
alternative label: Malay, Banda
in scheme: Lexvo - ISO 639-3 language codes
notation: bpq

Oirat
type: Language
type: Concept
ISO 639-2 Bibliographical code: xal
ISO 639-2 Terminological code: xal
ISO 639-3 code: xal
alternative label: Idioma calmuco @es
alternative label: Kalmyk
alternative label: Kalmyk Oirat
alternative label: Kalmückische Sprache @de
alternative label: Lingua calmucca @it
alternative label: Língua calmuca @pt
alternative label: kalmouk @fr
definition: The Kalmyk language (Хальмг келн; also known as Kalmuck, Qalmaq, Khal:mag and Western Mongol), or Russian Oirat, is the native speech of the Kalmyk people of the Republic of Kalmykia, a federal subject of the Russian Federation. In Russia, it is the normative form of the Oirat language (based on the Torgut dialect), which belongs to the Mongolic language family. The Oirat people are scattered throughout Eurasia, with substantial groups located in western Mongolia, the northwest region (mainly Xinjiang) of the People’s Republic of China and the northwest coast of the Caspian Sea in the Russian Federation, where they became known as Kalmyks.
in scheme: Lexvo - ISO 639-3 language codes
notation: xal
preferred label: Kalmouk @fr
preferred label: Kalmückisch @de
preferred label: kalmyk @es

Koronadal Blaan
type: Language
type: Concept
ISO 639-3 code: bpr
alternative label: Blaan, Koronadal
in scheme: Lexvo - ISO 639-3 language codes
notation: bpr

Sarangani Blaan
type: Language
type: Concept
ISO 639-3 code: bps
alternative label: Blaan, Sarangani
in scheme: Lexvo - ISO 639-3 language codes
notation: bps

Barrow Point
type: Language
type: Concept
ISO 639-3 code: bpt
alternative label: Barrow Point language
definition: The Barrow Point language is a moribund Australian Aboriginal language. According to Ethnologue, there was one speaker left in 1981.
in scheme: Lexvo - ISO 639-3 language codes
notation: bpt

Bongu
type: Language
type: Concept
ISO 639-3 code: bpu
in scheme: Lexvo - ISO 639-3 language codes
notation: bpu

Bian Marind
type: Language
type: Concept
ISO 639-3 code: bpv
alternative label: Marind, Bian
in scheme: Lexvo - ISO 639-3 language codes
notation: bpv

Bo
type: Language
type: Concept
ISO 639-3 code: bpw
alternative label: Bo (Papua New Guinea)
alternative label: Bo language
definition: Bo (Po, Sorimi) is a possible Left May language of New Guinea, in Sandaun and East Sepik Provinces. Its status as a separate language is uncomfirmed.
in scheme: Lexvo - ISO 639-3 language codes
notation: bpw

Palya Bareli
type: Language
type: Concept
ISO 639-3 code: bpx
alternative label: Bareli, Palya
in scheme: Lexvo - ISO 639-3 language codes
notation: bpx

Bishnupriya
type: Language
type: Concept
ISO 639-3 code: bpy
alternative label: Bishnupriya Manipuri language
definition: The Bishnupriya or Bishnupriya Manipuri (BPM) (বিষ্ণুপ্রিয়া মণিপুরী) is an Indo-Aryan language spoken in parts of the Indian states of Assam, Tripura, Manipur and others, as well as in Bangladesh, Burma, and other countries.
in scheme: Lexvo - ISO 639-3 language codes
notation: bpy
preferred label: Bishnupriya Manipuri @de

Bilba
type: Language
type: Concept
ISO 639-3 code: bpz
in scheme: Lexvo - ISO 639-3 language codes
notation: bpz

Tchumbuli
type: Language
type: Concept
ISO 639-3 code: bqa
in scheme: Lexvo - ISO 639-3 language codes
notation: bqa

Bagusa
type: Language
type: Concept
ISO 639-3 code: bqb
in scheme: Lexvo - ISO 639-3 language codes
notation: bqb

Boo
type: Language
type: Concept
ISO 639-3 code: bqc
preferred label: Boko
alternative label: Boko (Benin)
alternative label: Boko language
definition: Boko, or Boo, is a Mande language of Benin and Nigeria.
in scheme: Lexvo - ISO 639-3 language codes
notation: bqc

Bung
type: Language
type: Concept
ISO 639-3 code: bqd
alternative label: Bung language
definition: The Bung language is a nearly extinct language of Cameroon spoken by 3 people (in 1995) at the village of Boung on the Adamawa Plateau. A wordlist collected for it shows its strongest resemblance to be with the Ndung dialect of Mambiloid language Kwanja, although that may simply be because this has become the villages dominant language. It also has words in common with other Mambiloid languages such as Tep, Somyev, and Vute, while a number of words origins remain unclear (possibly Adamawan). For lack of data, it is not definitively classified.
in scheme: Lexvo - ISO 639-3 language codes
notation: bqd

Baga Kaloum
type: Language
type: Concept
ISO 639-3 code: bqf
in scheme: Lexvo - ISO 639-3 language codes
notation: bqf

Bago-Kusuntu
type: Language
type: Concept
ISO 639-3 code: bqg
in scheme: Lexvo - ISO 639-3 language codes
notation: bqg

Baima
type: Language
type: Concept
ISO 639-3 code: bqh
alternative label: Baima language
definition: Baima is a language spoken by 11,000 people of Tibetan nationality in north central Sichuan Province, China. It has vigorous use amongst adult speakers.
in scheme: Lexvo - ISO 639-3 language codes
notation: bqh
preferred label: Língua baima @pt

Bakhtiari
type: Language
type: Concept
ISO 639-3 code: bqi
alternative label: Bakhtiari dialect
definition: Bakhtiari dialect is a southwestern Iranian dialect, spoken by Bakhtiari people in Chaharmahal-o-Bakhtiari, western Khuzestan and parts of Isfahan and Lorestan provinces. It is closely related to the Boir-Aḥmadī, Kohgīlūya, and Mamasanī dialects in northwestern Fars. These dialects, together with the Lori dialects of Lorestan (e.g. Khorramabadi dialect), are referred to as the “Perside” southern Zagros group, or Lori dialects.
in scheme: Lexvo - ISO 639-3 language codes
notation: bqi
preferred label: Bachtiarische Sprache @de

Bandial
type: Language
type: Concept
ISO 639-3 code: bqj
alternative label: Bandial language
definition: Bandial (Banjaal), or Eegima (Eegimaa), is a Jola language of the Casamance region of Senegal. The three dialects, Affiniam, Bandial proper, and Elun (Hulon, also Kuluunaay, Kujireray) are divergent, on the border between dialects and distinct languages.
in scheme: Lexvo - ISO 639-3 language codes
notation: bqj

Banda-Mbrès
type: Language
type: Concept
ISO 639-3 code: bqk
in scheme: Lexvo - ISO 639-3 language codes
notation: bqk

Bilakura
type: Language
type: Concept
ISO 639-3 code: bql
in scheme: Lexvo - ISO 639-3 language codes
notation: bql

Wumboko
type: Language
type: Concept
ISO 639-3 code: bqm
in scheme: Lexvo - ISO 639-3 language codes
notation: bqm

Bulgarian Sign Language
type: Language
type: Concept
ISO 639-3 code: bqn
in scheme: Lexvo - ISO 639-3 language codes
notation: bqn

Balo
type: Language
type: Concept
ISO 639-3 code: bqo
alternative label: Balo language
definition: Balo is a Grassfields language of Cameroon. Alunfa is distinct, and perhaps should be considered a different language.
in scheme: Lexvo - ISO 639-3 language codes
notation: bqo

Busa
type: Language
type: Concept
ISO 639-3 code: bqp
alternative label: Busa language
definition: Busa is a Mande language of Nigeria. While alternate names for Busa include Bisã, which is similar to the Bissa language of the Bissa people, they are not the same.
in scheme: Lexvo - ISO 639-3 language codes
notation: bqp

Biritai
type: Language
type: Concept
ISO 639-3 code: bqq
in scheme: Lexvo - ISO 639-3 language codes
notation: bqq

Burusu
type: Language
type: Concept
ISO 639-3 code: bqr
in scheme: Lexvo - ISO 639-3 language codes
notation: bqr

Bosngun
type: Language
type: Concept
ISO 639-3 code: bqs
alternative label: Bosmun language
definition: Bosman (Bosmun, Bosngun) is a Ramu language of Papua New Guinea. Like Watam, it shares a number of irregular plural markers with the Lower Sepik languages, supporting the proposal of a Ramu – Lower Sepik language family.
in scheme: Lexvo - ISO 639-3 language codes
notation: bqs

/Xam
type: Language
type: Concept
ISO 639-3 code: xam
in scheme: Lexvo - ISO 639-3 language codes
notation: xam

Bamukumbit
type: Language
type: Concept
ISO 639-3 code: bqt
in scheme: Lexvo - ISO 639-3 language codes
notation: bqt

Boguru
type: Language
type: Concept
ISO 639-3 code: bqu
alternative label: Guru language
definition: Guru, or Boguru, is a poorly documented South Sudanese Bantu language of uncertain affiliation. A number of speakers are refugees in DR Congo.
in scheme: Lexvo - ISO 639-3 language codes
notation: bqu

Koro Wachi
type: Language
type: Concept
ISO 639-3 code: bqv
alternative label: Begbere-Ejar
in scheme: Lexvo - ISO 639-3 language codes
notation: bqv

Buru
type: Language
type: Concept
ISO 639-3 code: bqw
alternative label: Buru (Nigeria)
alternative label: Buru language
definition: :Not to be confused with the Buru language of Indonesia Buru is a Bantoid language of uncertain classification spoken in a single village in Nigeria.
in scheme: Lexvo - ISO 639-3 language codes
notation: bqw

Baangi
type: Language
type: Concept
ISO 639-3 code: bqx
in scheme: Lexvo - ISO 639-3 language codes
notation: bqx

Kata Kolok
type: Language
type: Concept
ISO 639-3 code: bqy
alternative label: Bengkala Sign Language
definition: Kata Kolok (literally "deaf talk"), also known as Benkala Sign Language and Balinese Sign Language, is a sign language of the village of Benkala in northern Bali, Indonesia, that has had an extraordinarily high rate of deafness for several generations. As has happened elsewhere in similar circumstances, deaf and hearing people in the village have developed a sign language for communication.
in scheme: Lexvo - ISO 639-3 language codes
notation: bqy
preferred label: Língua de Sinais Kata Kolok @pt

Bakaka
type: Language
type: Concept
ISO 639-3 code: bqz
in scheme: Lexvo - ISO 639-3 language codes
notation: bqz

Xamtanga
type: Language
type: Concept
ISO 639-3 code: xan
alternative label: Xamtanga language
definition: Xamtanga (also Agawinya, Khamtanga, Simt'anga, Xamir, Xamta) is a Central Cushitic language spoken in Ethiopia by the Xamir people.
in scheme: Lexvo - ISO 639-3 language codes
notation: xan
preferred label: Língua xamtanga @pt

Braj
type: Language
type: Concept
ISO 639-2 Bibliographical code: bra
ISO 639-2 Terminological code: bra
ISO 639-3 code: bra
alternative label: Braj Bhasha
definition: Braj Bhasha (Devanagari: ब्रज भाषा), also called Brij Bhasha (बॄज भाषा), Braj Bhakha (ब्रज भाखा), or Dehaati Zabaan (देहाती ज़बान, country tongue), is a Central Indian language closely related to Hindi. In fact it is usually considered to be a dialect of Hindi, and along with Awadhi was one of the two predominant literary languages of North-Central India before the switch to Khariboli in the 19th century.
in scheme: Lexvo - ISO 639-3 language codes
notation: bra
preferred label: Braj-Bhakha @de
preferred label: braj @es

Lave
type: Language
type: Concept
ISO 639-3 code: brb
in scheme: Lexvo - ISO 639-3 language codes
notation: brb

Berbice Creole Dutch
type: Language
type: Concept
ISO 639-3 code: brc
alternative label: Creole Dutch, Berbice
definition: Berbice Dutch Creole is a now extinct Dutch-based creole language. It had a lexicon partly based on a dialect of the West African language of Ijaw. In contrast to the widely known Negerhollands Dutch creole spoken in the Virgin Islands, Berbice Creole Dutch and its relative Skepi Creole Dutch, were more or less unknown to the outside world until Ian Robertson first reported on the two languages in 1975. Dutch linguist Silvia Kouwenberg subsequently investigated the creole language, publishing its grammar in 1993.
in scheme: Lexvo - ISO 639-3 language codes
notation: brc
preferred label: Berbice-Niederländisch @de

Baraamu
type: Language
type: Concept
ISO 639-3 code: brd
alternative label: Baram language
definition: Baram (Baraamu) is a small Tibeto-Burman language of Nepal. Speakers are shifting to Nepali.
in scheme: Lexvo - ISO 639-3 language codes
notation: brd

Breton
type: Language
type: Concept
ISO 639-1 code: br
ISO 639-2 Bibliographical code: bre
ISO 639-2 Terminological code: bre
ISO 639-3 code: bre
alternative label: Breton language
alternative label: Bretonische Sprache @de
alternative label: Idioma bretón @es
alternative label: Lingua bretone @it
alternative label: Língua bretã @pt
definition: Breton is a Celtic language spoken in Brittany (; ), France. Breton is a Brythonic language, descended from the Celtic British language brought from Great Britain to Armorica by migrating Britons during the Early Middle Ages. Like the other Brythonic languages, Welsh and Cornish, it is classified as an Insular Celtic language. Breton is most closely related to Cornish, as both are thought to have evolved from a Southwestern Brythonic protolanguage. The other regional language of Brittany, Gallo, is a Langue d'oïl derived from Latin and is consequently relatively close to French.
in scheme: Lexvo - ISO 639-3 language codes
notation: bre
preferred label: Bretonisch @de
preferred label: breton @fr
preferred label: bretone @it
preferred label: bretão @pt
preferred label: bretón @es

Bera
type: Language
type: Concept
ISO 639-3 code: brf
alternative label: Bira language
definition: Bera (Bira) is a Bantu language of the Democratic Republic of the Congo. It's close to Amba.
in scheme: Lexvo - ISO 639-3 language codes
notation: brf

Baure
type: Language
type: Concept
ISO 639-3 code: brg
alternative label: Baure language
definition: Baure is a nearly extinct Arawakan language spoken by only 13 of 200 ethnic tribal Baure people of the Beni department of northwest of Magdalena, Bolivia. Some Bible portions have been translated into Baure. Most speakers have been shifting to Spanish.
in scheme: Lexvo - ISO 639-3 language codes
notation: brg
preferred label: Idioma bauré @es

Brahoui
type: Language
type: Concept
ISO 639-3 code: brh
alternative label: Brahui language
definition: Brahui (Urdu: براہوی) or Brahvi (براوی) is a Dravidian language spoken by Brahui people of Pakistan and Afghanistan, and expatriate communities in Qatar, United Arab Emirates, Iraq, and Iran. It is isolated from the nearest Dravidian-speaking neighbour population by a distance of more than .
in scheme: Lexvo - ISO 639-3 language codes
notation: brh
preferred label: Brahui
preferred label: Lingua brahui @it
preferred label: Língua brahui @pt

Mokpwe
type: Language
type: Concept
ISO 639-3 code: bri
in scheme: Lexvo - ISO 639-3 language codes
notation: bri

Bieria
type: Language
type: Concept
ISO 639-3 code: brj
in scheme: Lexvo - ISO 639-3 language codes
notation: brj

Birked
type: Language
type: Concept
ISO 639-3 code: brk
alternative label: Birgid language
definition: Birgid (also known as Birked, Birguid, Birkit, Birqed, Kajjara, Murgi) is an extinct Nubian language that was spoken in western Sudan. Thelwall mentions his last contact to old speakers of Birgid in 1972.
in scheme: Lexvo - ISO 639-3 language codes
notation: brk

Birwa
type: Language
type: Concept
ISO 639-3 code: brl
in scheme: Lexvo - ISO 639-3 language codes
notation: brl

Khao
type: Language
type: Concept
ISO 639-3 code: xao
in scheme: Lexvo - ISO 639-3 language codes
notation: xao

Barambu
type: Language
type: Concept
ISO 639-3 code: brm
alternative label: Barambu language
definition: Barambu is an Ubangian language spoken in the northeast of the Democratic Republic of the Congo.
in scheme: Lexvo - ISO 639-3 language codes
notation: brm

Boruca
type: Language
type: Concept
ISO 639-3 code: brn
alternative label: Borũca language
definition: The Boruca language (also known as Bronka , Bronca or Brúnkajk.) is the native language of the Boruca people of Costa Rica. It is one of the Chibchan languages. It is nearly extinct; it was spoken fluently by only five women in 1986, while 30 to 35 others spoke it nonfluently. The rest of the tribe's 1,000 members speak Spanish. The language is taught as a second language at the local primary school Escuela Doris Z. Stone. One can hear Bronka words and phrases mixed into Spanish conversations but it is extremely rare to hear prolonged exchanges in Bronka.
in scheme: Lexvo - ISO 639-3 language codes
notation: brn

Brokkat
type: Language
type: Concept
ISO 639-3 code: bro
alternative label: Brokkat language
definition: The Brokkat language (Dzongkha: བྲོཀ་ཁ་; Wylie: Brok-kha; also called "Brokskad" and "Jokay") is an endangered Southern Tibetan language spoken by about 300 people in the village of Dhur in Bumthang Valley of Bumthang District in central Bhutan. Brokkat is spoken by descendants of pastoral yakherd communities.
in scheme: Lexvo - ISO 639-3 language codes
notation: bro

Barapasi
type: Language
type: Concept
ISO 639-3 code: brp
alternative label: Baropasi language
definition: The Baropasi or Barapasi language is a member of the East Geelvink Bay languages. It is spoken in part of the Indonesian territory in Papua New Guinea. It has about 1,000 speakers.
in scheme: Lexvo - ISO 639-3 language codes
notation: brp

Breri
type: Language
type: Concept
ISO 639-3 code: brq
alternative label: Breri language
definition: Breri Kuanga is a Ramu language of Papua New Guinea.
in scheme: Lexvo - ISO 639-3 language codes
notation: brq

Birao
type: Language
type: Concept
ISO 639-3 code: brr
in scheme: Lexvo - ISO 639-3 language codes
notation: brr

Baras
type: Language
type: Concept
ISO 639-3 code: brs
in scheme: Lexvo - ISO 639-3 language codes
notation: brs

Apalachee
type: Language
type: Concept
ISO 639-3 code: xap
in scheme: Lexvo - ISO 639-3 language codes
notation: xap

Bitare
type: Language
type: Concept
ISO 639-3 code: brt
alternative label: Bitare language
definition: Bitare is a Tivoid language of the Cameroons.
in scheme: Lexvo - ISO 639-3 language codes
notation: brt

Eastern Bru
type: Language
type: Concept
ISO 639-3 code: bru
alternative label: Bru, Eastern
in scheme: Lexvo - ISO 639-3 language codes
notation: bru

Western Bru
type: Language
type: Concept
ISO 639-3 code: brv
alternative label: Bru, Western
in scheme: Lexvo - ISO 639-3 language codes
notation: brv

Bellari
type: Language
type: Concept
ISO 639-3 code: brw
in scheme: Lexvo - ISO 639-3 language codes
notation: brw

Bodo
type: Language
type: Concept
ISO 639-3 code: brx
alternative label: Bodo (India)
alternative label: Bodo language
alternative label: Idioma bodo @es
alternative label: Lingua bodo @it
alternative label: Língua bodo @pt
preferred label: bodo @es
definition: Bodo (Devnagari:बोडो) (pronounced ) is a language that belongs to the branch of Barish section under Baric division of the Tibeto-Burman languages and spoken by the Bodo people of north-eastern India and Nepal. The language is one of the official languages of the Indian state of Assam, and is one of the 22 scheduled languages that is given a special constitutional status in India.
in scheme: Lexvo - ISO 639-3 language codes
notation: brx

Burui
type: Language
type: Concept
ISO 639-3 code: bry
in scheme: Lexvo - ISO 639-3 language codes
notation: bry

Bilbil
type: Language
type: Concept
ISO 639-3 code: brz
alternative label: Bil Bil language
definition: Bil Bil is an Austronesian language spoken by about 1200 people near Madang town, Madang Province, Papua New Guinea.
in scheme: Lexvo - ISO 639-3 language codes
notation: brz

Aquitanian
type: Language
type: Concept
ISO 639-3 code: xaq
alternative label: Aquitanian language
definition: The Aquitanian language was spoken in ancient Aquitaine (approximately between the Pyrenees and the Garonne, the region later known as Gascony) before the Roman conquest and probably much later, until the Early Middle Ages.
in scheme: Lexvo - ISO 639-3 language codes
notation: xaq
preferred label: Aquitain @fr
preferred label: Euskera arcaico @es

Abinomn
type: Language
type: Concept
ISO 639-3 code: bsa
alternative label: Abinomn language
definition: The Abinomn language is a language isolate initially reported by Mark Donohue from Papua province, Indonesia. It is also known as Avinomen, Baso (deprecated), and Foia. There are about 300 speakers.
in scheme: Lexvo - ISO 639-3 language codes
notation: bsa

Brunei Bisaya
type: Language
type: Concept
ISO 639-3 code: bsb
alternative label: Bisaya, Brunei
in scheme: Lexvo - ISO 639-3 language codes
notation: bsb

Oniyan
type: Language
type: Concept
ISO 639-3 code: bsc
preferred label: Bassari
alternative label: Bassari language
definition: Basari, or Oniyan (Onian, Onëyan, Ayan, Biyan, Wo), is a Senegambian language of Senegal and Guinea spoken by traditional hunter-gatherers.
in scheme: Lexvo - ISO 639-3 language codes
notation: bsc

Wushi
type: Language
type: Concept
ISO 639-3 code: bse
in scheme: Lexvo - ISO 639-3 language codes
notation: bse

Bauchi
type: Language
type: Concept
ISO 639-3 code: bsf
alternative label: Bauchi language
definition: Bauchi (Bauci, Baushi) is a Kainji language spoken in Nigeria.
in scheme: Lexvo - ISO 639-3 language codes
notation: bsf

Bashkardi
type: Language
type: Concept
ISO 639-3 code: bsg
alternative label: Bashkardi language
definition: Bashkardi or Bashagerdi is a northwestern Iranian language spoken in the southeast of Iran in the provinces of Kerman, Sistan and Baluchestan, and Hormozgan.
in scheme: Lexvo - ISO 639-3 language codes
notation: bsg
preferred label: Lingua bashkardi @it

Kati
type: Language
type: Concept
ISO 639-3 code: bsh
alternative label: Kata-vari dialect
definition: Kata-vari is a dialect of the Kamkata-viri language spoken by the Kata in parts of Afghanistan and Pakistan. The most used alternative names are Kati, Kativiri or Bashgali.
in scheme: Lexvo - ISO 639-3 language codes
notation: bsh

Bassossi
type: Language
type: Concept
ISO 639-3 code: bsi
in scheme: Lexvo - ISO 639-3 language codes
notation: bsi

Bangwinji
type: Language
type: Concept
ISO 639-3 code: bsj
in scheme: Lexvo - ISO 639-3 language codes
notation: bsj

Bourouchaski
type: Language
type: Concept
ISO 639-3 code: bsk
alternative label: Burushaski language
definition: The Burushaski or Burushko language ( burū́šaskī), is a language isolate (that is, not known to be related to any other language of the world). It is spoken by some 87,000 (as of 2000) Burusho people in the Hunza, Nagar, Yasin, and Ishkoman valleys, and some parts of the Gilgit valley, in Gilgit–Baltistan in Pakistan and by about 300 Burusho people in Srinagar in Jammu and Kashmir, India. Other names for the language are Brugaski, Kanjut (Kunjoot), Verchikwār, Boorishki, Brushas (Brushias), and Miśa:ski.
in scheme: Lexvo - ISO 639-3 language codes
notation: bsk
preferred label: Burushaski
preferred label: Idioma burushaski @es
preferred label: Lingua burushaski @it

Basa-Gumna
type: Language
type: Concept
ISO 639-3 code: bsl
in scheme: Lexvo - ISO 639-3 language codes
notation: bsl

Busami
type: Language
type: Concept
ISO 639-3 code: bsm
in scheme: Lexvo - ISO 639-3 language codes
notation: bsm

Barasana-Eduria
type: Language
type: Concept
ISO 639-3 code: bsn
alternative label: Barasana language
definition: The Barasana language is an aboriginal amerindian language spoken by a few thousand people in Northern South America. The people, the Barasana and Eduria, are ethnically distinct and consider their dialects to be distinct languages. The Barasana dialect is also known as Southern Barasano, Come Masa, Comematsa, Janera, Paneroa, Yebamasa; Eduria is also known as Edulia, Taibano, Taiwaeno, Taiwano.
in scheme: Lexvo - ISO 639-3 language codes
notation: bsn
preferred label: Barasana @fr

Karami
type: Language
type: Concept
ISO 639-3 code: xar
in scheme: Lexvo - ISO 639-3 language codes
notation: xar

Buso
type: Language
type: Concept
ISO 639-3 code: bso
alternative label: Buso language
definition: Buso (also known as Busso, Dam de Bousso, Bousso) is a nearly extinct Afro-Asiatic language spoken in western Chad.
in scheme: Lexvo - ISO 639-3 language codes
notation: bso

Baga Sitemu
type: Language
type: Concept
ISO 639-3 code: bsp
in scheme: Lexvo - ISO 639-3 language codes
notation: bsp

Bassa
type: Language
type: Concept
ISO 639-3 code: bsq
alternative label: Bassa language
definition: The Bassa language is a Kru language spoken by about 350,000 people in Liberia and 5,000 in Sierra Leone by Bassa people.
in scheme: Lexvo - ISO 639-3 language codes
notation: bsq
preferred label: Idioma bassa @es

Bassa-Kontagora
type: Language
type: Concept
ISO 639-3 code: bsr
in scheme: Lexvo - ISO 639-3 language codes
notation: bsr

Akoose
type: Language
type: Concept
ISO 639-3 code: bss
alternative label: Kose language
definition: The Koose language, also called Akoose, Bakossi, or Nkosi, is a Bantu language spoken by the Koose people (Bakossi, Bekoose) of Cameroon. There are many loan words from English, French and Douala.
in scheme: Lexvo - ISO 639-3 language codes
notation: bss
preferred label: akoose @es

Basketo
type: Language
type: Concept
ISO 639-3 code: bst
alternative label: Basketo language
definition: Basketo (also known as Basketto, Baskatta, Mesketo) is an Afro-Asiatic language spoken in the Basketo special woreda of the Southern Nations, Nationalities, and Peoples Region, which is part of Ethiopia. The speakers refer to the language as "Masketo", while their neighbors refer to it as "Basketo." It has said to consist of two dialects, "Doko" and "Dollo". Besides their mother tongue, some also speak Melo, Oyda, Galila, or Gofa.
in scheme: Lexvo - ISO 639-3 language codes
notation: bst

Bahonsuai
type: Language
type: Concept
ISO 639-3 code: bsu
in scheme: Lexvo - ISO 639-3 language codes
notation: bsu

Kamas
type: Language
type: Concept
ISO 639-3 code: xas
in scheme: Lexvo - ISO 639-3 language codes
notation: xas

Baga Sobané
type: Language
type: Concept
ISO 639-3 code: bsv
in scheme: Lexvo - ISO 639-3 language codes
notation: bsv

Baiso
type: Language
type: Concept
ISO 639-3 code: bsw
alternative label: Baiso language
definition: :For the comune in Italy, see Baiso Baiso (also Alkali, Bayso) is an Afro-Asiatic language spoken in Ethiopia in the region around Lake Abaya.
in scheme: Lexvo - ISO 639-3 language codes
notation: bsw
preferred label: Bayso @de

Yangkam
type: Language
type: Concept
ISO 639-3 code: bsx
alternative label: Busam language
definition: Busam is a Grassfields language of Cameroon.
in scheme: Lexvo - ISO 639-3 language codes
notation: bsx
preferred label: Busam @de

Sabah Bisaya
type: Language
type: Concept
ISO 639-3 code: bsy
alternative label: Bisaya, Sabah
in scheme: Lexvo - ISO 639-3 language codes
notation: bsy

Bata
type: Language
type: Concept
ISO 639-3 code: bta
alternative label: Bata language
definition: Bata is an Afro-Asiatic language spoken in Nigeria in Adamawa State in the Numan, Song, Fufore, and Mubi LGAs, and in Cameroon in North Province along the border with Nigeria. Dialects are Demsa, Garoua, Jirai, Kobotachi, Malabu, Ndeewe, Ribaw, Wadi, and Zumu. It is often considered the same language as Bacama.
in scheme: Lexvo - ISO 639-3 language codes
notation: bta

Beti language
type: Language
type: Concept
definition: Beti is a language, or group of Bantu languages, spoken by the Beti-Pahuin group of people, who inhabit the rain forest regions of Cameroon, Republic of the Congo, Equatorial Guinea, Gabon, and São Tomé and Príncipe.
in scheme: Lexvo - ISO 639-3 language codes
preferred label: Beti @de

Bati
type: Language
type: Concept
ISO 639-3 code: btc
alternative label: Bati (Cameroon)
in scheme: Lexvo - ISO 639-3 language codes
notation: btc

Katawixi
type: Language
type: Concept
ISO 639-3 code: xat
alternative label: Katawixi language
definition: Katawixi is a Katukinian language formerly spoken in Amazonas, Brazil. It is extinct among the known populations of Katawixi people, though an uncontacted group nearby may be Katawixi-speaking.
in scheme: Lexvo - ISO 639-3 language codes
notation: xat
preferred label: Idioma katawixí @es

Batak Dairi
type: Language
type: Concept
ISO 639-3 code: btd
in scheme: Lexvo - ISO 639-3 language codes
notation: btd

Gamo-Ningi
type: Language
type: Concept
ISO 639-3 code: bte
in scheme: Lexvo - ISO 639-3 language codes
notation: bte

Birgit
type: Language
type: Concept
ISO 639-3 code: btf
alternative label: Birgit language
definition: Birgit (also known as Bergit, Birgid, Berguid) is an Afro-Asiatic language spoken in southeastern Chad.
in scheme: Lexvo - ISO 639-3 language codes
notation: btf

Gagnoa Bété
type: Language
type: Concept
ISO 639-3 code: btg
alternative label: Bété, Gagnoa
in scheme: Lexvo - ISO 639-3 language codes
notation: btg

Biatah Bidayuh
type: Language
type: Concept
ISO 639-3 code: bth
alternative label: Biatah language
alternative label: Bidayuh, Biatah
definition: The Biatah language is spoken in the Malaysian state of Sarawak and the Indonesian province of Kalimantan Barat. It belongs to the Malayo-Polynesian branch of the Austronesian language family.
in scheme: Lexvo - ISO 639-3 language codes
notation: bth
preferred label: Biatah bidayuh @fr

Burate
type: Language
type: Concept
ISO 639-3 code: bti
in scheme: Lexvo - ISO 639-3 language codes
notation: bti

Bacanese Malay
type: Language
type: Concept
ISO 639-3 code: btj
alternative label: Malay, Bacanese
in scheme: Lexvo - ISO 639-3 language codes
notation: btj

Bhatola
type: Language
type: Concept
ISO 639-3 code: btl
in scheme: Lexvo - ISO 639-3 language codes
notation: btl

Batak Mandailing
type: Language
type: Concept
ISO 639-3 code: btm
alternative label: Mandailing language
definition: Mandailing or Batak Mandailing is an Austronesian language spoken in Indonesia, the northern island of Sumatra. The language pertains to the Malayo-Polynesian of Austronesian languages. It is written using the Latin script but historically used Batak script.
in scheme: Lexvo - ISO 639-3 language codes
notation: btm
preferred label: Batak mandailing @fr

Ratagnon
type: Language
type: Concept
ISO 639-3 code: btn
alternative label: Ratagnon language
definition: Ratagnon (also transliterated as Latagnon or Datagnon) is a language spoken by the Ratagnon people, an indigenous group from Occidental Mindoro. Its speakers are shifting to Tagalog, and it is nearly extinct.
in scheme: Lexvo - ISO 639-3 language codes
notation: btn

Rinconada Bikol
type: Language
type: Concept
ISO 639-3 code: bto
alternative label: Bikol, Rinconada
alternative label: Rinconada Bikol language
definition: Riŋkonāda or Rinconada Bikol is one of the several languages that compose the Inland Bikol group of the Bikol languages. It belongs to Austronesian language family that also include Māori, Hawaiian, Malagasy, Tagalog, Indonesian and Malay. The closest relatives of this language outside Bicol are Aklanon, Waray and Tagalog to the lesser extent. This is also the language adopted and used by the aboriginal or indigenous population of Agta/Aeta (Negrito) in surrounding and mountainous areas. Riŋkonāda was brought to Negritos by the Austronesian people when they began engaging in commerce and trade with them. The original language of the aboriginal people is unknown but it is believed that they have contributed some of their tribal languages to Riŋkonāda's accent, vocabularies and lexicon. Riŋkonāda is considered by most Bicolanos as one of the most difficult variety of Bikol. The name of the language is derived from the name of the place where it was originated, developed and is largely spoken: Rinconada District (in Camarines Sur province) which is formerly called as "Sumagang".
in scheme: Lexvo - ISO 639-3 language codes
notation: bto

Rayón Zoque
type: Language
type: Concept
ISO 639-3 code: zor
alternative label: Zoque, Rayón
in scheme: Lexvo - ISO 639-3 language codes
notation: zor

Budibud
type: Language
type: Concept
ISO 639-3 code: btp
in scheme: Lexvo - ISO 639-3 language codes
notation: btp

Kauwera
type: Language
type: Concept
ISO 639-3 code: xau
in scheme: Lexvo - ISO 639-3 language codes
notation: xau

Batek
type: Language
type: Concept
ISO 639-3 code: btq
alternative label: Batek language
definition: Batek is an aboriginal Mon–Khmer language of Malaya. The Deq and Nong dialects may be separate languages. The small number of speakers is decreasing.
in scheme: Lexvo - ISO 639-3 language codes
notation: btq

Baetora
type: Language
type: Concept
ISO 639-3 code: btr
in scheme: Lexvo - ISO 639-3 language codes
notation: btr

Batak Simalungun
type: Language
type: Concept
ISO 639-3 code: bts
in scheme: Lexvo - ISO 639-3 language codes
notation: bts

Bete-Bendi
type: Language
type: Concept
ISO 639-3 code: btt
in scheme: Lexvo - ISO 639-3 language codes
notation: btt

Batu
type: Language
type: Concept
ISO 639-3 code: btu
alternative label: Batu language
definition: Batu is a Tivoid language of the Cameroons. Dialects are Amanda-Afi, Angwe, Kamino.
in scheme: Lexvo - ISO 639-3 language codes
notation: btu

Bateri
type: Language
type: Concept
ISO 639-3 code: btv
in scheme: Lexvo - ISO 639-3 language codes
notation: btv

Butuanon
type: Language
type: Concept
ISO 639-3 code: btw
alternative label: Butuanon language
definition: Butuanon is an Austronesian language spoken in Agusan del Norte and Agusan del Sur, with some native speakers in Misamis Oriental and Surigao del Norte. According to an article in the Manila Times, as of 2007 Butuanon is spoken by fewer than 500 youngsters in Butuan itself.
in scheme: Lexvo - ISO 639-3 language codes
notation: btw

Xavánte
type: Language
type: Concept
ISO 639-3 code: xav
alternative label: Xavante language
definition: The Xavante language is a Ge language spoken by the Xavante people in about 170 villages in the area surrounding Eastern Mato Grosso, Brazil. The Xavante language is unusual in its phonology, its object–subject–verb word order, and its use of honorary and endearment terms in its morphology.
in scheme: Lexvo - ISO 639-3 language codes
notation: xav
preferred label: Idioma xavante @es
preferred label: Língua aquém @pt
preferred label: Xavante @de

Batak Karo
type: Language
type: Concept
ISO 639-3 code: btx
alternative label: Batak Karo language
definition: Batak Karo, referred to in Indonesia simply as Bahasa Karo (Karo language), is an Austronesian language that is spoken by the Karo people of Indonesia. It is used by around 600,000 people in North Sumatra. It was historically written using the Batak alphabet which is descended from the Brahmi script of ancient India by way of the Pallava and Old Kawi scripts, but nowadays only a tiny number of Karo can write or understand the script, and instead the Latin script is used.
in scheme: Lexvo - ISO 639-3 language codes
notation: btx
preferred label: Batak karo @fr

Bobot
type: Language
type: Concept
ISO 639-3 code: bty
alternative label: Bobot language
definition: Bobot is a language of the island of Seram, Indonesia.
in scheme: Lexvo - ISO 639-3 language codes
notation: bty

Batak Alas-Kluet
type: Language
type: Concept
ISO 639-3 code: btz
in scheme: Lexvo - ISO 639-3 language codes
notation: btz

Buriat
type: Language
type: Concept
ISO 639-2 Bibliographical code: bua
ISO 639-2 Terminological code: bua
ISO 639-3 code: bua
alternative label: Bouriate @fr
alternative label: Burjatische Sprache @de
alternative label: Buryat language
alternative label: Idioma buriato @es
alternative label: Lingua buriata @it
definition: Buryat (or Buriat; Buryat Cyrillic: буряад хэлэн buryaad khelen) is a Mongolic variety spoken by the Buryats that is either classified as a language or as a major dialect group of Mongolian. The majority of Buryat speakers live in Russia along the northern border of Mongolia where it is an official language in the Buryat Republic, Ust-Orda Buryatia and Aga Buryatia. In the Russian census of 2002, 353,113 people out of an ethnic population of 445,175 could speak Buryat (72.3%). Some other 15,694 can also speak Buryat, mostly ethnic Russians. There are at least 100,000 ethnic Buryats in Mongolia and the People's Republic of China as well. Buriats in Russia have a separate literary standard, written in a Cyrillic alphabet.
in scheme: Lexvo - ISO 639-3 language codes
notation: bua
preferred label: Burjatisch @de
preferred label: bouriate @fr
preferred label: buriat @es

Bua
type: Language
type: Concept
ISO 639-3 code: bub
alternative label: Bua language
definition: The Bua language is spoken by some 7,708 people (as of 1993) north of the Chari River around Korbol and Gabil in Chad. It is the largest member of the small Bua group of languages and is mutually comprehensible with Fanian.
in scheme: Lexvo - ISO 639-3 language codes
notation: bub

Bushi
type: Language
type: Concept
ISO 639-3 code: buc
alternative label: Bushi language
definition: Bushi, Shibushi, or Kibushi is a language spoken in Madagascar and the French-ruled Comorian islands of Mayotte. In 1995, it was spoken by 806,200 people (767,000 in Madagascar and 39,200 in Mayotte).
in scheme: Lexvo - ISO 639-3 language codes
notation: buc
preferred label: Idioma bushi @es
preferred label: Shibushi @fr

Ntcham
type: Language
type: Concept
ISO 639-3 code: bud
in scheme: Lexvo - ISO 639-3 language codes
notation: bud

Beothuk
type: Language
type: Concept
ISO 639-3 code: bue
alternative label: Beothuk language
definition: The Beothuk language ( or ), also called Beothukan, was spoken by the indigenous Beothuk people of Newfoundland. The Beothuk have been extinct since 1829 and there are few written accounts of their language, so little is known about it. There have been claims of links with the neighbouring Algonquian language family but there is not enough evidence to draw strong conclusions. In 2007 DNA studies showed genetic links between the Beothuk and Algonquian-speaking Mi'kmaq.
in scheme: Lexvo - ISO 639-3 language codes
notation: bue
preferred label: Béothuk @fr
preferred label: Idioma beothuk @es

Bushoong
type: Language
type: Concept
ISO 639-3 code: buf
alternative label: Bushong language
definition: Bushong (Bushoong) is a Bantu language of the Kasai region of Democratic Republic of the Congo. It was the language of the Kuba Kingdom.
in scheme: Lexvo - ISO 639-3 language codes
notation: buf

Buginese
type: Language
type: Concept
ISO 639-2 Bibliographical code: bug
ISO 639-2 Terminological code: bug
ISO 639-3 code: bug
alternative label: Bouguinais @fr
alternative label: Buginese language
alternative label: Buginesische Sprache @de
alternative label: Idioma buginés @es
alternative label: Língua buginesa @pt
alternative label: buginese @pt
definition: Buginese (, elsewhere also Bahasa Bugis, Bugis, Bugi, De) is the language spoken by about four million people mainly in the southern part of Sulawesi, Indonesia.
in scheme: Lexvo - ISO 639-3 language codes
notation: bug
preferred label: Buginesisch @de
preferred label: bugi @fr
preferred label: buginés @es
preferred label: buguinês @pt

Younuo Bunu
type: Language
type: Concept
ISO 639-3 code: buh
alternative label: Bunu, Younuo
alternative label: Yuno language
definition: Yuno ( Younuo) is a divergent Hmongic language spoken in Longsheng County (龙胜县), Guangxi, China. Its classification is uncertain.
in scheme: Lexvo - ISO 639-3 language codes
notation: buh

Bongili
type: Language
type: Concept
ISO 639-3 code: bui
in scheme: Lexvo - ISO 639-3 language codes
notation: bui

Basa-Gurmana
type: Language
type: Concept
ISO 639-3 code: buj
in scheme: Lexvo - ISO 639-3 language codes
notation: buj

Bugawac
type: Language
type: Concept
ISO 639-3 code: buk
alternative label: Bukawa language
definition: Bukawa (also known as Bukaua, Kawac, Bugawac, Gawac) is an Austronesian language spoken by about 10,000 people (in 1978) on the coast of the Huon Gulf, Morobe Province, Papua New Guinea. The most common spelling of the name in both community and government usage is Bukawa (Eckermann 2007:1), even though it comes from the Yabem language, which served as a church and school lingua franca in the coastal areas around the Gulf for most of the 20th century. This ethnonym, which now designates Bukawa-speakers in general, derives from the name of a prominent village on the Bugawac (River Gawac) at Cape Arkona in the center of the north coast.
in scheme: Lexvo - ISO 639-3 language codes
notation: buk
preferred label: Bukawa @de

Bulgarian
type: Language
type: Concept
ISO 639-1 code: bg
ISO 639-2 Bibliographical code: bul
ISO 639-2 Terminological code: bul
ISO 639-3 code: bul
alternative label: Bulgarian language
alternative label: Bulgarische Sprache @de
alternative label: Idioma búlgaro @es
alternative label: Lingua bulgara @it
alternative label: Língua búlgara @pt
alternative label: bulgare @fr
definition: Bulgarian (български език, ) is an Indo-European language, a member of the Slavic linguistic group.
in scheme: Lexvo - ISO 639-3 language codes
notation: bul
preferred label: Bulgare @fr
preferred label: Bulgarisch @de
preferred label: bulgaro @it
preferred label: búlgaro @es

Kawaiisu
type: Language
type: Concept
ISO 639-3 code: xaw
alternative label: Kawaiisu language
definition: The Kawaiisu language is an Uto-Aztecan language spoken by the Kawaiisu people of California.
in scheme: Lexvo - ISO 639-3 language codes
notation: xaw

Bulu
type: Language
type: Concept
ISO 639-3 code: bum
alternative label: Bulu (Cameroon)
alternative label: Bulu language
alternative label: boulou @fr
definition: Bulu is the language of the Bulu people of Cameroon. The language had 174,000 native speakers in 1982, with some 800,000 second language speakers in 1991. Colonial and missionary groups formerly used Bulu as a lingua franca in the region for commercial, educational, and religious purposes, though it is today becoming less frequent in those spheres. Dialects include Bene, Yelinda, Yembana, Yengono, and Zaman.
in scheme: Lexvo - ISO 639-3 language codes
notation: bum
preferred label: bulu @es

Sherbro
type: Language
type: Concept
ISO 639-3 code: bun
alternative label: Sherbro language
definition: The Sherbro language (also known as Southern Bullom, Shiba, Amampa, Mampa, and Mampwa) is an endangered language of Sierra Leone. It belongs to the Mel branch of the Niger–Congo language family. While Sherbro has more speakers than the other Bullom languages, its use is declining among the Sherbro people, in favor of English and Krio.
in scheme: Lexvo - ISO 639-3 language codes
notation: bun

Terei
type: Language
type: Concept
ISO 639-3 code: buo
alternative label: Terei language
definition: Terei or Buin, also known as Telei, Rugara, is the most populous Papuan language spoken to the east of New Guinea. There are about 27,000 speakers in the Buin District of Bougainville Province, Papua New Guinea.
in scheme: Lexvo - ISO 639-3 language codes
notation: buo

Busoa
type: Language
type: Concept
ISO 639-3 code: bup
in scheme: Lexvo - ISO 639-3 language codes
notation: bup

Brem
type: Language
type: Concept
ISO 639-3 code: buq
alternative label: Brem language
definition: Brem (Barem), also known as Bunabun (Bububun, Bunubun), is a Papuan language of Madang Province, Papua New Guinea.
in scheme: Lexvo - ISO 639-3 language codes
notation: buq

Bokobaru
type: Language
type: Concept
ISO 639-3 code: bus
in scheme: Lexvo - ISO 639-3 language codes
notation: bus

Bungain
type: Language
type: Concept
ISO 639-3 code: but
alternative label: Bungain language
definition: Bungain is a Torricelli language of Papua New Guinea.
in scheme: Lexvo - ISO 639-3 language codes
notation: but

Budu
type: Language
type: Concept
ISO 639-3 code: buu
alternative label: Budu language
definition: Budu is a Bantu language spoken by the Budu people in the Wamba Territory in the Orientale Province of the Democratic Republic of the Congo. Its orthography uses the special character ɨ, ʉ, ɛ and ɔ, as well as colon ꞉ and short equal sign ꞊ for tones.
in scheme: Lexvo - ISO 639-3 language codes
notation: buu

Bun
type: Language
type: Concept
ISO 639-3 code: buv
in scheme: Lexvo - ISO 639-3 language codes
notation: buv

Bubi
type: Language
type: Concept
ISO 639-3 code: buw
in scheme: Lexvo - ISO 639-3 language codes
notation: buw

Boghom
type: Language
type: Concept
ISO 639-3 code: bux
alternative label: Boghom language
definition: Boghom (also known as Bogghom, Bohom, Burom, Burum, Burrum, Burma, Borrom, Boghorom, Bokiyim) is an Afro-Asiatic language spoken in Plateau State, Nigeria.
in scheme: Lexvo - ISO 639-3 language codes
notation: bux

Bullom So
type: Language
type: Concept
ISO 639-3 code: buy
alternative label: Bullom So language
definition: The Bullom So language, also called Mmani or Mandingi, is an endangered language spoken near the border between Guinea and Sierra Leone. It belongs to the Mel branch of the Niger–Congo language family and is particularly closely related to the Bom language. The people have intermarried with Temne and Susu speakers. As the few remaining speakers of Bullom So are all over 60, the language is considered moribund.
in scheme: Lexvo - ISO 639-3 language codes
notation: buy

Kayan Mahakam
type: Language
type: Concept
ISO 639-3 code: xay
in scheme: Lexvo - ISO 639-3 language codes
notation: xay

Bukwen
type: Language
type: Concept
ISO 639-3 code: buz
in scheme: Lexvo - ISO 639-3 language codes
notation: buz

Barein
type: Language
type: Concept
ISO 639-3 code: bva
alternative label: Barein language
definition: Barein (also known as Baraïn, Guilia, Jalkia) is an Afro-Asiatic language spoken in south central Chad. Dialects are Guilia, Jalkia, Komi, and Sakaya.
in scheme: Lexvo - ISO 639-3 language codes
notation: bva

Bube
type: Language
type: Concept
ISO 639-3 code: bvb
alternative label: Bube language
definition: Bube, Bohobé, or Bube–Benga, is a Bantu or Bantoid language spoken by the Bubi, a Bantu people native to, and once the primary inhabitants of, Bioko Island, Equatorial Guinea. The language was brought to Bioko from continental Africa more than three thousand years ago when the Bubi began arriving on the island.
in scheme: Lexvo - ISO 639-3 language codes
notation: bvb
preferred label: Bubi @fr
preferred label: Idioma bubi @es

Baelelea
type: Language
type: Concept
ISO 639-3 code: bvc
in scheme: Lexvo - ISO 639-3 language codes
notation: bvc

Baeggu
type: Language
type: Concept
ISO 639-3 code: bvd
alternative label: Baeggu language
definition: The Baeggu language (also called Baegu or Mbaenggu) is spoken by the indigenous people of the North Malaita Island in the Solomon Islands. In 1999 there were 5,900 people known to speak the language. The language is largely intelligible with Baelelea, Toabaita, and Lau.
in scheme: Lexvo - ISO 639-3 language codes
notation: bvd

Berau Malay
type: Language
type: Concept
ISO 639-3 code: bve
alternative label: Berau Malay language
alternative label: Malay, Berau
definition: The Berau language, also known as Berau Malay, is an Austronesian language which is spoken by the Berau people in Berau Regency, East Kalimantan, Indonesia. According to the 2007 Ethnologue there are 11,200 speakers of Berau Malay.
in scheme: Lexvo - ISO 639-3 language codes
notation: bve

Boor
type: Language
type: Concept
ISO 639-3 code: bvf
alternative label: Boor language
definition: Boor (also known as Bwara, Damraw) is an endangered Afro-Asiatic language spoken in southern Chad.
in scheme: Lexvo - ISO 639-3 language codes
notation: bvf

Kamba
type: Language
type: Concept
ISO 639-3 code: xba
alternative label: Kamba (Brazil)
alternative label: Kamba language
definition: Kamba (Camba) is an extinct unclassified language of Brazil. The ethnic population of about 2000 migrated from Bolivia. They may have been Tupian.
in scheme: Lexvo - ISO 639-3 language codes
notation: xba

Bonkeng
type: Language
type: Concept
ISO 639-3 code: bvg
alternative label: Bonkeng language
definition: Bonkeng is a poorly known Bantu language of Cameroon.
in scheme: Lexvo - ISO 639-3 language codes
notation: bvg

Bure
type: Language
type: Concept
ISO 639-3 code: bvh
alternative label: Bure language
definition: Bure (639-3 bvh, also known as Bubbure) is an Afro-Asiatic language belonging to the Bole-Tangale group of the West branch of the Chadic family. It is spoken in northern Nigeria in the village of Bure (10°31’06.16”N, 10°20’03.00”E, Kirfi Local Government, Bauchi State, Nigeria) and in some small settlements nearby. The language is used mostly by a very few speakers, of great-grandparental generation. Except for Hausa, which is lingua franca in the area, Bure is surrounded by other Chadic languages such as Gera, Giiwo and Deno (Bole group). Compared to other languages of the same group (e.g. Bole or Karekare), the endangerment of Bure is by far the most critical.
in scheme: Lexvo - ISO 639-3 language codes
notation: bvh

Belanda Viri
type: Language
type: Concept
ISO 639-3 code: bvi
alternative label: Belanda Viri language
definition: Belanda Viri (Belanda, Biri, BGamba, Gumba, Mbegumba, Mvegumba) is a Ubangian language of South Sudan.
in scheme: Lexvo - ISO 639-3 language codes
notation: bvi

Baan
type: Language
type: Concept
ISO 639-3 code: bvj
in scheme: Lexvo - ISO 639-3 language codes
notation: bvj

Bukat
type: Language
type: Concept
ISO 639-3 code: bvk
in scheme: Lexvo - ISO 639-3 language codes
notation: bvk

Bolivian Sign Language
type: Language
type: Concept
ISO 639-3 code: bvl
definition: Bolivian Sign Language (Lenguaje de Señas Bolivianas, LSB) is a dialect of American Sign Language (ASL) used in Bolivia.
in scheme: Lexvo - ISO 639-3 language codes
notation: bvl
preferred label: Língua gestual boliviana @pt

Bamunka
type: Language
type: Concept
ISO 639-3 code: bvm
in scheme: Lexvo - ISO 639-3 language codes
notation: bvm

Buna
type: Language
type: Concept
ISO 639-3 code: bvn
in scheme: Lexvo - ISO 639-3 language codes
notation: bvn

Bolgo
type: Language
type: Concept
ISO 639-3 code: bvo
definition: The Bolgo language is a member of the Bua languages spoken in south-central Chad, in the villages of Koya, Boli, Gagne, and Bedi southeast of Melfi, by about 1,800 people (SIL 1993.) According to de Rendinger, it has two principal dialects, Bolgo Werel around Daguela and Bolgo Mengo around Aloa-Niagara, as well as a dialect called Bolgo Bormo; according to the Ethnologue, its principal dialects are called Bolgo Dugag and Bolgo Kubar ("small" and "great" Bolgo.) Great Bolgo is spoken to the north, bordering Mogum and Saba; Little Bolgo is spoken to the south, bordering the closely related language Koke as well as Chadian Arabic.
in scheme: Lexvo - ISO 639-3 language codes
notation: bvo

Bumang
type: Language
type: Concept
in scheme: Lexvo - ISO 639-3 language codes

Birri
type: Language
type: Concept
ISO 639-3 code: bvq
alternative label: Birri language
definition: Birri (Bviri) is a nearly extinct Central Sudanic language of CAR and formerly of (South) Sudan. It may be one of the Vale languages.
in scheme: Lexvo - ISO 639-3 language codes
notation: bvq

Burarra
type: Language
type: Concept
ISO 639-3 code: bvr
alternative label: Burarra language
definition: Burarra is an Australian Aboriginal language spoken by the Burarra people of Arnhemland.
in scheme: Lexvo - ISO 639-3 language codes
notation: bvr

Lower Burdekin
type: Language
type: Concept
ISO 639-3 code: xbb
alternative label: Burdekin, Lower
alternative label: Lower Burdekin languages
definition: The Lower Burdekin languages were probably three distinct Australian Aboriginal languages spoken around the mouth of the Burdekin River in north Queensland. One short wordlist in each was collected in the 19th century, and published in the second volume of The Australian Race in 1886. These languages have since gone extinct, with no more having been recorded. Due to the paucity of the available data, we know almost nothing of their grammatical structure. | class="wikitable sortable" ! English || Cunninghamvocabulary || Gortonvocabulary || OConnorvocabulary |- | Kangaroo || hoora || wootha || arragoo |- | Opossum || moonganna || goong || onehunger |- | Tame dog || oogier || minde || oodoodoo |- | Emu || kowwerra || goondaloo || karboonmillery |- | Black duck || yammooroo || buggininulli || hoorooburry |- | Wood duck || mumboogooba || detto || culburh |- | Pelican || boloona || booloon || dooroomully |- | Laughing jackass || kowurgurra || kookaburra || karcoobura |- | Native companion || braroogan || buberenulli || kooroogowgun |- | White cockatoo || digooi || bugina || bunginna |- | Crow || wyaguna || wethergun || wombugah |- | Swan || woergerella || || |- | Egg || wyoorda ||...
in scheme: Lexvo - ISO 639-3 language codes
notation: xbb

Bati
type: Language
type: Concept
ISO 639-3 code: bvt
alternative label: Bati (Indonesia)
in scheme: Lexvo - ISO 639-3 language codes
notation: bvt

Bukit Malay
type: Language
type: Concept
ISO 639-3 code: bvu
alternative label: Malay, Bukit
in scheme: Lexvo - ISO 639-3 language codes
notation: bvu

Baniva
type: Language
type: Concept
ISO 639-3 code: bvv
alternative label: Baniwa of Guainia
definition: Baniwa of Guainia, or Abane (Avane), is a Maipurean language of Venezuela with a few speakers in Brazil. It is one of several languages in the region called Baniwa. Ethnologue (2009) distinguishes between "Baniva" for the Baniwa of Guainia and "Baniwa" for the Baniwa of Içana, but they are merely spelling variants, and either may be used for either language. Aikhenvald counts ≈ 200 speakers while Ethnologue reports the language is extinct; Ethnologue counts Xie Warekena in Brazil as a dialect of Guarequena rather than of Baniwa as in Aikhenvald, but this only amounts to 10 speakers.
in scheme: Lexvo - ISO 639-3 language codes
notation: bvv
preferred label: Idioma yavitero @es

Boga
type: Language
type: Concept
ISO 639-3 code: bvw
alternative label: Boga language
definition: Boga (also known as Boka) is an Afro-Asiatic language spoken in the Adamawa State of Nigeria.
in scheme: Lexvo - ISO 639-3 language codes
notation: bvw

Dibole
type: Language
type: Concept
ISO 639-3 code: bvx
in scheme: Lexvo - ISO 639-3 language codes
notation: bvx

Baybayanon
type: Language
type: Concept
ISO 639-3 code: bvy
in scheme: Lexvo - ISO 639-3 language codes
notation: bvy

Bauzi
type: Language
type: Concept
ISO 639-3 code: bvz
alternative label: Bauzi language
definition: Bauzi (also written Baudi, Baudji, Baudzi, Bauri) is a Papuan language of the East Geelvink Bay family spoken in the Indonesian province of Papua.
in scheme: Lexvo - ISO 639-3 language codes
notation: bvz

Bwatoo
type: Language
type: Concept
ISO 639-3 code: bwa
in scheme: Lexvo - ISO 639-3 language codes
notation: bwa

Namosi-Naitasiri-Serua
type: Language
type: Concept
ISO 639-3 code: bwb
alternative label: Namosi-Naitasiri-Serua language
definition: Namosi-Naitasiri-Serua is an Oceanic language spoken in Fiji by about 1600 people.
in scheme: Lexvo - ISO 639-3 language codes
notation: bwb
preferred label: Namosi-naitasiri-serua @fr

Bwile
type: Language
type: Concept
ISO 639-3 code: bwc
alternative label: Bwile language
definition: Bwile is a divergent Bantu language of Zambia and DR Congo. The number of speakers is unknown: Ethnologue reports 12,400 were counted in DR Congo in 2002, and the same number in the Zambian census of 1969.
in scheme: Lexvo - ISO 639-3 language codes
notation: bwc

Bwaidoka
type: Language
type: Concept
ISO 639-3 code: bwd
in scheme: Lexvo - ISO 639-3 language codes
notation: bwd

Bwe Karen
type: Language
type: Concept
ISO 639-3 code: bwe
alternative label: Bwe Karen language
alternative label: Karen, Bwe
definition: Bwe, also known as Bwe Karen and Bghai (Baghi), is a Karen language of Burma.
in scheme: Lexvo - ISO 639-3 language codes
notation: bwe

Bactrian
type: Language
type: Concept
ISO 639-3 code: xbc
alternative label: Bactrian language
definition: The Bactrian language is an extinct Eastern Iranian language which was spoken in the Central Asian region of Bactria. Linguistically, it is classified as belonging to the middle period of the East Iranian branch. Bactrian is closely related to Pashto, as well as Yidgha and Munji, and the medieval languages Sogdian, Khwarezmian and Parthian.
in scheme: Lexvo - ISO 639-3 language codes
notation: xbc
preferred label: Bactrien @fr
preferred label: Baktrische Sprache @de
preferred label: Idioma bactriano @es
preferred label: Lingua battriana @it
preferred label: Língua bactriana @pt

Boselewa
type: Language
type: Concept
ISO 639-3 code: bwf
in scheme: Lexvo - ISO 639-3 language codes
notation: bwf

Barwe
type: Language
type: Concept
ISO 639-3 code: bwg
in scheme: Lexvo - ISO 639-3 language codes
notation: bwg

Bishuo
type: Language
type: Concept
ISO 639-3 code: bwh
alternative label: Bishuo language
definition: The Bishuo Language is a language of Cameroon. It was spoken in the North West Province, Menchum Division, Furu-Awa Subdivision, Ntjieka, Furu-Turuwa, and the Furu-Sambari villages. It was related to Bikya. It was reported by Breton 1986 that the Bishuo people had shifted to Jukun. However, there was apparently 1 remaining person who knew any Bishuo. This person was, according to Ethnologue, over 60 years old. Nevertheless, he or she is mysterious. Since this person was alive in 1986 and was reasonable elderly, he or she may be dead, and Bishuo could be an extinct language.
in scheme: Lexvo - ISO 639-3 language codes
notation: bwh
preferred label: Bischuo @de

Baniwa
type: Language
type: Concept
ISO 639-3 code: bwi
alternative label: Baniwa language
definition: Baniwa (Baniva), or Baniwa of Içana (Baniua do Içana), is an Arawakan language spoken in Amazonas, Brazil, and in Venezuela.
in scheme: Lexvo - ISO 639-3 language codes
notation: bwi

Láá Láá Bwamu
type: Language
type: Concept
ISO 639-3 code: bwj
alternative label: Bwamu, Láá Láá
in scheme: Lexvo - ISO 639-3 language codes
notation: bwj

Bauwaki
type: Language
type: Concept
ISO 639-3 code: bwk
in scheme: Lexvo - ISO 639-3 language codes
notation: bwk

Bwela
type: Language
type: Concept
ISO 639-3 code: bwl
alternative label: Bwela language
definition: Bwela, or Lingi, is a poorly known Cameroonian Bantu language of uncertain affiliation.
in scheme: Lexvo - ISO 639-3 language codes
notation: bwl

Biwat
type: Language
type: Concept
ISO 639-3 code: bwm
alternative label: Biwat language
definition: Biwat Mundugumor is a Yuat language of Papua New Guinea.
in scheme: Lexvo - ISO 639-3 language codes
notation: bwm

Wunai Bunu
type: Language
type: Concept
ISO 639-3 code: bwn
alternative label: Bunu, Wunai
alternative label: Hm Nai language
definition: Hm Nai (Mandarin: Wunai, Cantonese: Ng-nai) is a divergent Hmongic language spoken in western Hunan province, China. Its classification is uncertain.
in scheme: Lexvo - ISO 639-3 language codes
notation: bwn

Boro
type: Language
type: Concept
ISO 639-3 code: bwo
alternative label: Borna
alternative label: Borna (Ethiopia)
alternative label: Boro (Ethiopia)
alternative label: Shinasha language
definition: Shinasha, also known as Boro (Borna, Bworo) is a North Omotic language spoken in western Ethiopia by the Shinasha people. Its speakers live in scattered areas north of the Abay River: in the Dangur, Dibate and Wenbera districts, which are parts of the Benishangul-Gumuz Region.
in scheme: Lexvo - ISO 639-3 language codes
notation: bwo
preferred label: Shinasha @fr

Mandobo Bawah
type: Language
type: Concept
ISO 639-3 code: bwp
in scheme: Lexvo - ISO 639-3 language codes
notation: bwp

Southern Bobo Madaré
type: Language
type: Concept
ISO 639-3 code: bwq
alternative label: Bobo Madaré, Southern
in scheme: Lexvo - ISO 639-3 language codes
notation: bwq

Bura-Pabir
type: Language
type: Concept
ISO 639-3 code: bwr
alternative label: Bura language
definition: Bura-Pabir (also known as Bura, Burra, Bourrah, Pabir, Babir, Babur, Barburr, Mya Bura, Kwojeffa, Huve, Huviya) is a Chadic language spoken in Nigeria. Dialects are Pela, Bura Pela, Hill Bura, Hyil Hawul, Bura Hyilhawul, and Plain Bura.
in scheme: Lexvo - ISO 639-3 language codes
notation: bwr

Bomboma
type: Language
type: Concept
ISO 639-3 code: bws
in scheme: Lexvo - ISO 639-3 language codes
notation: bws

Bafaw-Balong
type: Language
type: Concept
ISO 639-3 code: bwt
alternative label: Bafaw-Balong language
definition: Bafaw-Balong is a Bantu language of Cameroon. There are two divergent varieties, Fo’ (Bafaw, Bafo, Bafowu, Afo, Nho, Lefo’) and Long (Balong, Balon, Balung, Nlong, Valongi, Bayi, Bai), which are sometimes considered distinct languages.
in scheme: Lexvo - ISO 639-3 language codes
notation: bwt

Buli
type: Language
type: Concept
ISO 639-3 code: bwu
alternative label: Buli (Ghana)
alternative label: Buli language
definition: Buli is a Gur language of Ghana. It is an SVO language.
in scheme: Lexvo - ISO 639-3 language codes
notation: bwu

Bindal
type: Language
type: Concept
in scheme: Lexvo - ISO 639-3 language codes

Bwa
type: Language
type: Concept
ISO 639-3 code: bww
alternative label: Bwa language
definition: Bwa (Boa, Boua, Bua, Kibua, Kibwa, Libua, Libwali, Yewu), including the Benge (Libenge), Baati, Boganga (Boyanga), and Ligbe dialects, is a Bantu language spoken in the Democratic Republic of Congo. Pagibete is close, and might be considered a dialect.
in scheme: Lexvo - ISO 639-3 language codes
notation: bww

Bu-Nao Bunu
type: Language
type: Concept
ISO 639-3 code: bwx
alternative label: Bu-Nao language
alternative label: Bunu, Bu-Nao
definition: Bu-Nao is a Hmongic (Miao) dialect cluster spoken in Guangxi, Yunnan, and Guizhou in China. Its speakers are Bunu : ethnic Yao (Mien) speakers of Miao languages.
in scheme: Lexvo - ISO 639-3 language codes
notation: bwx

Cwi Bwamu
type: Language
type: Concept
ISO 639-3 code: bwy
alternative label: Bwamu, Cwi
in scheme: Lexvo - ISO 639-3 language codes
notation: bwy

Bwisi
type: Language
type: Concept
ISO 639-3 code: bwz
alternative label: Bwisi language
definition: Bwisi (also spelled Ibwisi, Mbwisi) is a language spoken mainly in the Kibangou District (Niari Region) of the Republic of Congo, next to the Gabon border, where it is also spoken by a minority. According to the Ethnologue, approximately 4,250 people speak the language today worldwide.
in scheme: Lexvo - ISO 639-3 language codes
notation: bwz

Francisco León Zoque
type: Language
type: Concept
ISO 639-3 code: zos
alternative label: Zoque, Francisco León
in scheme: Lexvo - ISO 639-3 language codes
notation: zos

Bauro
type: Language
type: Concept
ISO 639-3 code: bxa
alternative label: Bauro language
alternative label: Tairaha
definition: The Bauro language is a member of the family of San Cristobal languages, and is spoken in the central part of the island of Makira, formerly known as San Cristobal in the Solomon Islands.
in scheme: Lexvo - ISO 639-3 language codes
notation: bxa

Bigambal
type: Language
type: Concept
in scheme: Lexvo - ISO 639-3 language codes

Belanda Bor
type: Language
type: Concept
ISO 639-3 code: bxb
alternative label: Belanda Bor language
alternative label: Bor, Belanda
definition: Belanda Bor is a Luo language of South Sudan. Most speakers also use Belanda Viri, which is a Ubangian language and not at all related.
in scheme: Lexvo - ISO 639-3 language codes
notation: bxb

Molengue
type: Language
type: Concept
ISO 639-3 code: bxc
in scheme: Lexvo - ISO 639-3 language codes
notation: bxc

Pela
type: Language
type: Concept
ISO 639-3 code: bxd
in scheme: Lexvo - ISO 639-3 language codes
notation: bxd

Birale
type: Language
type: Concept
ISO 639-3 code: bxe
alternative label: Ongota language
definition: Ongota (also known as Birale [ISO 639-3], Birayle) is a moribund language of southwest Ethiopia. In 2008, it was said to be in a state of decline with only 6 elderly native speakers, the rest of their small village on the west bank of the Weito River having adopted the Tsamai language instead. The grammar follows a Subject Object Verb word order. It is probably Afroasiatic, but has not been definitively classified. As of 2004, it is being studied by Aklilu Yilma of Addis Ababa University.
in scheme: Lexvo - ISO 639-3 language codes
notation: bxe
preferred label: Idioma ongota @es
preferred label: Língua ongota @pt
preferred label: Ongota @de

Bilur
type: Language
type: Concept
ISO 639-3 code: bxf
alternative label: Minigir
in scheme: Lexvo - ISO 639-3 language codes
notation: bxf

Bunganditj
type: Language
type: Concept
in scheme: Lexvo - ISO 639-3 language codes

Bangala
type: Language
type: Concept
ISO 639-3 code: bxg
alternative label: Bangala language
definition: Bangala, or Ngala, is a Bantu language spoken in the northeast part of the Democratic Republic of the Congo, in South Sudan, and the extreme western part of Uganda. A divergent form of Lingala, it's used as a lingua franca by people with different languages and rarely as a first language. The estimated number of speakers varies between 2 and 3.5 million. It is spoken to the east and northeast of the area where Lingala is spoken.
in scheme: Lexvo - ISO 639-3 language codes
notation: bxg
preferred label: Língua bangala @pt

Buhutu
type: Language
type: Concept
ISO 639-3 code: bxh
in scheme: Lexvo - ISO 639-3 language codes
notation: bxh

Pirlatapa
type: Language
type: Concept
ISO 639-3 code: bxi
in scheme: Lexvo - ISO 639-3 language codes
notation: bxi

Bayungu
type: Language
type: Concept
ISO 639-3 code: bxj
in scheme: Lexvo - ISO 639-3 language codes
notation: bxj

Bukusu
type: Language
type: Concept
ISO 639-3 code: bxk
alternative label: Bukusu dialect
alternative label: Lubukusu
definition: Bukusu (native name: Lubukusu) is a Luhya language from Bantu group spoken by the Bukusu people of western Kenya. It is one of the related languages of the Luhya people. The language is, however, more closely related to the Gisu and Masaaba languages of Eastern Uganda, and is mutually intelligible with them.
in scheme: Lexvo - ISO 639-3 language codes
notation: bxk

Kombio
type: Language
type: Concept
ISO 639-3 code: xbi
alternative label: Kombio language
definition: Kombio is a Torricelli language spoken by a decreasing number of people in Papua New Guinea, as people shift to Tok Pisin. It also goes by the name Endangen. Mwi dialect is divergent, but there is some degree of difficulty in comprehension between other major dialects as well (Wampukuamp, Yanimoi, Wampurun).
in scheme: Lexvo - ISO 639-3 language codes
notation: xbi

Jalkunan
type: Language
type: Concept
ISO 639-3 code: bxl
in scheme: Lexvo - ISO 639-3 language codes
notation: bxl

Mongolia Buriat
type: Language
type: Concept
ISO 639-3 code: bxm
alternative label: Buriat, Mongolia
in scheme: Lexvo - ISO 639-3 language codes
notation: bxm

Burduna
type: Language
type: Concept
ISO 639-3 code: bxn
alternative label: Burduna language
definition: Burduna, also known as Boordoona, Budina, Budoona, Buduna, Pinneegooroo, Poodena, Poordoona, Purduma, and Purduna is an aboriginal language of Australia. It is spoken in Henry and upper Lyndon rivers region according to Ethnologue. It is endangered, with only three speakers remaining as of 1981.
in scheme: Lexvo - ISO 639-3 language codes
notation: bxn

Barikanchi
type: Language
type: Concept
ISO 639-3 code: bxo
in scheme: Lexvo - ISO 639-3 language codes
notation: bxo

Bebil
type: Language
type: Concept
ISO 639-3 code: bxp
in scheme: Lexvo - ISO 639-3 language codes
notation: bxp

Beele
type: Language
type: Concept
ISO 639-3 code: bxq
alternative label: Beele language
definition: Beele (also known as Bele, Àbéélé, Bellawa) is an endangered Afro-Asiatic language spoken a few villages in Bauchi State, Nigeria.
in scheme: Lexvo - ISO 639-3 language codes
notation: bxq

Russia Buriat
type: Language
type: Concept
ISO 639-3 code: bxr
alternative label: Buriat, Russia
in scheme: Lexvo - ISO 639-3 language codes
notation: bxr

Busam
type: Language
type: Concept
ISO 639-3 code: bxs
in scheme: Lexvo - ISO 639-3 language codes
notation: bxs

China Buriat
type: Language
type: Concept
ISO 639-3 code: bxu
alternative label: Buriat, China
in scheme: Lexvo - ISO 639-3 language codes
notation: bxu

Berakou
type: Language
type: Concept
ISO 639-3 code: bxv
in scheme: Lexvo - ISO 639-3 language codes
notation: bxv

Bankagooma
type: Language
type: Concept
ISO 639-3 code: bxw
in scheme: Lexvo - ISO 639-3 language codes
notation: bxw

Birrpayi
type: Language
type: Concept
in scheme: Lexvo - ISO 639-3 language codes

Borna
type: Language
type: Concept
ISO 639-3 code: bxx
alternative label: Borna (Democratic Republic of Congo)
alternative label: Eborna language
definition: Borna, or Eborna, is a dubious Southern Bantoid language reportedly spoken in the Democratic Republic of the Congo. It may not exist, but only be another name for Boma.
in scheme: Lexvo - ISO 639-3 language codes
notation: bxx
preferred label: Eborna @de

Binahari
type: Language
type: Concept
ISO 639-3 code: bxz
in scheme: Lexvo - ISO 639-3 language codes
notation: bxz

Batak
type: Language
type: Concept
ISO 639-3 code: bya
in scheme: Lexvo - ISO 639-3 language codes
notation: bya

Bikya
type: Language
type: Concept
ISO 639-3 code: byb
alternative label: Bikya language
definition: Bikya (also known as Furu) is a Bantoid language isolate spoken in Cameroon. It is unknown if this language is still existent. In 1986 four surviving speakers were identified, although only one (a man in his seventies) spoke the language fluently.
in scheme: Lexvo - ISO 639-3 language codes
notation: byb

Ubaghara
type: Language
type: Concept
ISO 639-3 code: byc
alternative label: Ubaghara language
definition: Ubaghara is a Upper Cross River language of Nigeria. 80% of speakers speak the principal dialect, Biakpan.
in scheme: Lexvo - ISO 639-3 language codes
notation: byc

Middle Breton
type: Language
type: Concept
ISO 639-3 code: xbm
alternative label: Breton, Middle
in scheme: Lexvo - ISO 639-3 language codes
notation: xbm

Benyadu'
type: Language
type: Concept
ISO 639-3 code: byd
alternative label: Nyadu’ language
definition: The Nyadu’ language, Benyadu’, is a Dayak language of Borneo. It is left unclassified by Ethnologue.
in scheme: Lexvo - ISO 639-3 language codes
notation: byd

Pouye
type: Language
type: Concept
ISO 639-3 code: bye
alternative label: Pouye language
definition: Pouye (Bouye) is a language spoken in Sandaun Province, Papua New Guinea, by a thousand people, and growing.
in scheme: Lexvo - ISO 639-3 language codes
notation: bye

Bete
type: Language
type: Concept
ISO 639-3 code: byf
alternative label: Bete language
definition: The Bete language of Nigeria is a nearly extinct language spoken by a small minority of the 3,000 inhabitants of Bete Town, Takum Local Government Authority, Taraba State; its speakers have mostly shifted to Jukun Takum. It is reported to have been close to Lufu and Bibi. It belongs in the Jukunoid subfamily of Niger–Congo, according to the Vienna and the Ethnologue (15th ed.), though the latter formerly listed it as unclassified.
in scheme: Lexvo - ISO 639-3 language codes
notation: byf

Baygo
type: Language
type: Concept
ISO 639-3 code: byg
alternative label: Beigo language
definition: Beigo (Baygo, Baigo, Bego, Beko, Béogé, Beygo) is an extinct East Sudanic language once spoken in Sudan by the Baygo tribe, numbering some 850 in the late twentieth century. Similar to Daju of Darfur indeed it is classified as part of the Western Daju family of languages.
in scheme: Lexvo - ISO 639-3 language codes
notation: byg

Bhujel
type: Language
type: Concept
ISO 639-3 code: byh
alternative label: Bhujel language
definition: The Bujhyal language (also called Bhujel) is a language spoken by 5000 people in the Tanahu District of Nepal. It is a semi-tonal language, employing a complex array of affixes.
in scheme: Lexvo - ISO 639-3 language codes
notation: byh

Buyu
type: Language
type: Concept
ISO 639-3 code: byi
alternative label: Buyu language
definition: Buyu, or Buyi, is a Bantu language language of Lake Tanganyika that is closely related to Nyanga.
in scheme: Lexvo - ISO 639-3 language codes
notation: byi

Bina
type: Language
type: Concept
ISO 639-3 code: byj
alternative label: Bina (Nigeria)
in scheme: Lexvo - ISO 639-3 language codes
notation: byj

Biao
type: Language
type: Concept
ISO 639-3 code: byk
alternative label: Biao language
definition: The Biao language (; also known as Kang Bau or Kang Beu) is a Tai–Kadai language spoken in southwestern Huaiji County and Fengkai County, Zhaoqing, Guangdong. Variants of Biao include the Shidong 诗洞, Yonggu 永固, Qiaotou 桥头, and Dagang 大岗 dialects (Liang 2002:3). In Fengkai County, it is spoken in Chang'an 长安, Jinzhuang 金装, and Qixing 七星.
in scheme: Lexvo - ISO 639-3 language codes
notation: byk

Kenaboi
type: Language
type: Concept
ISO 639-3 code: xbn
in scheme: Lexvo - ISO 639-3 language codes
notation: xbn

Bayono
type: Language
type: Concept
ISO 639-3 code: byl
alternative label: Bayono language
definition: Bayono is a recently described language spoken by a hundred people in the southeast of Papua province, Indonesia. The language is related to neighboring Awbono, with which it shares half its vocabulary, but is otherwise unclassified.
in scheme: Lexvo - ISO 639-3 language codes
notation: byl

Bidyara
type: Language
type: Concept
ISO 639-3 code: bym
alternative label: Bidjara language
definition: Bidjara is a nearly extinct language of Australia. Bidyara is spoken by twenty elders in Queensland, between Tambo and Augathella, Warrego and Langlo rivers (according to Ethnologue). It is an aboriginal language. It is also the only aboriginal language in eastern Australia. It is sadly shifting to English. This is an example of people not continuing to have a passion for their native language. Ruhlen (1987) said this was an extinct language.
in scheme: Lexvo - ISO 639-3 language codes
notation: bym

Blin
type: Language
type: Concept
ISO 639-2 Bibliographical code: byn
ISO 639-2 Terminological code: byn
ISO 639-3 code: byn
alternative label: Bilin
alternative label: Blin language
alternative label: Língua blin @pt
definition: The Blin language (ብሊና, translitterated to Latin as b(ə)lina or bɨlina), Bilin or Bilen has approximately 70,000 speakers in and around the city of Keren in Eritrea. It is the only Central Cushitic language which is spoken in Eritrea.
in scheme: Lexvo - ISO 639-3 language codes
notation: byn
preferred label: blin @es

Biyo
type: Language
type: Concept
ISO 639-3 code: byo
in scheme: Lexvo - ISO 639-3 language codes
notation: byo

Bumaji
type: Language
type: Concept
ISO 639-3 code: byp
in scheme: Lexvo - ISO 639-3 language codes
notation: byp

Basay
type: Language
type: Concept
ISO 639-3 code: byq
alternative label: Basay language
definition: Basay was a Formosan language spoken around modern-day Taipei in northern Taiwan by the Basay, Qauqaut, and Trobiawan peoples. Trobiawan, Linaw, and Qauqaut were other dialects (see East Formosan languages).
in scheme: Lexvo - ISO 639-3 language codes
notation: byq
preferred label: Lingua Basay @it

Yipma
type: Language
type: Concept
ISO 639-3 code: byr
alternative label: Baruya
alternative label: Yipma language
definition: Yipma is an Angan language of Papua New Guinea. Dialects are Wantakia, Baruya (Barua), Gulicha, Usirampia (Wuzuraabya).
in scheme: Lexvo - ISO 639-3 language codes
notation: byr

Bolgarian
type: Language
type: Concept
ISO 639-3 code: xbo
alternative label: Bulgar language
definition: Bulgar (also spelled Bolğar, Bulghar) is an extinct language which was spoken by the Bulgars. It was a language belonging to Oghur subgroup of Turkic languages.
in scheme: Lexvo - ISO 639-3 language codes
notation: xbo
preferred label: Bolgarische Sprache @de

Burak
type: Language
type: Concept
ISO 639-3 code: bys
in scheme: Lexvo - ISO 639-3 language codes
notation: bys

Berti
type: Language
type: Concept
ISO 639-3 code: byt
in scheme: Lexvo - ISO 639-3 language codes
notation: byt

Medumba
type: Language
type: Concept
ISO 639-3 code: byv
alternative label: Medumba language
preferred label: medumba @es
definition: Medumba (Mədʉmba) is a Grassfields language of Cameroon.
in scheme: Lexvo - ISO 639-3 language codes
notation: byv

Belhariya
type: Language
type: Concept
ISO 639-3 code: byw
alternative label: Belhare language
definition: Belhare is a Kiranti language spoken by some 2,000 people living on the Belhara hill, at the southern foothills of the Himalayas situated in the Dhankuta district in Eastern Nepal. All speakers of Belhare are bilingual in Nepali, this results in frequent code mixing and a large amount of Nepali loan-words. Nevertheless, the grammar of Belhare has maintained its distinct Kiranti characteristics. Like other Kiranti languages, Belhare is characterized by an elaborate morphology in both the nominal and verbal domain. Syntactically, Belhare has partly an accusative, partly an ergative pivot, but accusative syntax is more prominent in terms of frequency.
in scheme: Lexvo - ISO 639-3 language codes
notation: byw

Qaqet
type: Language
type: Concept
ISO 639-3 code: byx
alternative label: Qaqet language
definition: Qaqet (Kakat, Makakat, Maqaqet) is a Papuan language spoken in East New Britain Province on the island of New Britain, Papua New Guinea.
in scheme: Lexvo - ISO 639-3 language codes
notation: byx

Buya
type: Language
type: Concept
ISO 639-3 code: byy
in scheme: Lexvo - ISO 639-3 language codes
notation: byy

Banaro
type: Language
type: Concept
ISO 639-3 code: byz
alternative label: Banaro language
definition: Banaro is a Ramu language of Papua New Guinea.
in scheme: Lexvo - ISO 639-3 language codes
notation: byz

Bandi
type: Language
type: Concept
ISO 639-3 code: bza
alternative label: Bandi language
definition: The Bandi language, also known as Bande, Gbande, Gbandi and Gbunde, is a Mande language. It is spoken primarily in Lofa County in northern Liberia by the Bandi people.
in scheme: Lexvo - ISO 639-3 language codes
notation: bza

Andio
type: Language
type: Concept
ISO 639-3 code: bzb
in scheme: Lexvo - ISO 639-3 language codes
notation: bzb

Southern Betsimisaraka Malagasy
type: Language
type: Concept
ISO 639-3 code: bzc
alternative label: Malagasy, Southern Betsimisaraka
in scheme: Lexvo - ISO 639-3 language codes
notation: bzc

Bribri
type: Language
type: Concept
ISO 639-3 code: bzd
alternative label: Bribri language
definition: The Bribri language is a tonal SOV language spoken by the Bribri people from Costa Rica. It belongs to the Chibchan language family and there are about 11,000 speakers.
in scheme: Lexvo - ISO 639-3 language codes
notation: bzd
preferred label: Idioma bribri @es

Jenaama Bozo
type: Language
type: Concept
ISO 639-3 code: bze
alternative label: Bozo, Jenaama
in scheme: Lexvo - ISO 639-3 language codes
notation: bze

Bibbulman
type: Language
type: Concept
in scheme: Lexvo - ISO 639-3 language codes

Boikin
type: Language
type: Concept
ISO 639-3 code: bzf
alternative label: Boiken language
definition: Boiken (Nucum, Yangoru) is one of the more populous of the Ndu languages of Sepik River region of northern Papua New Guinea.
in scheme: Lexvo - ISO 639-3 language codes
notation: bzf

Babuza
type: Language
type: Concept
ISO 639-3 code: bzg
alternative label: Favorlang language
definition: Favorlang is an extinct Formosan language closely related to Babuza.
in scheme: Lexvo - ISO 639-3 language codes
notation: bzg

Mapos Buang
type: Language
type: Concept
ISO 639-3 code: bzh
alternative label: Buang, Mapos
in scheme: Lexvo - ISO 639-3 language codes
notation: bzh

Bisu
type: Language
type: Concept
ISO 639-3 code: bzi
in scheme: Lexvo - ISO 639-3 language codes
notation: bzi

Lachiguiri Zapotec
type: Language
type: Concept
ISO 639-3 code: zpa
alternative label: Zapotec, Lachiguiri
in scheme: Lexvo - ISO 639-3 language codes
notation: zpa

Belizean Creole
type: Language
type: Concept
ISO 639-3 code: bzj
alternative label: Belize Kriol English
alternative label: Belizean Kriol language
alternative label: Kriol English, Belize
definition: Belizean Creole English, known as Kriol by its speakers, is an English-based creole language most closely related to Miskito Coastal Creole, Limón Coastal Creole, Colón Creole, San Andrés and Providencia Creole, Guyanese Creole, Jamaican Patois and English creoles of the Caribbean show similarity as well. Kriol has about 400,000 speakers, in Belize (where it is the lingua franca and is spoken by 70% of the population) and in the Belizean diaspora, mostly in the United States.
in scheme: Lexvo - ISO 639-3 language codes
notation: bzj
preferred label: Criollo beliceño @es
preferred label: Crioulo belizenho @pt

Kambera
type: Language
type: Concept
ISO 639-3 code: xbr
alternative label: Kambera language
definition: Kambera (also known as Sumbanese, East Sumbanese, Oost-Sumbaas, Humba, Hilu Humba, East Sumba, and Sumba) is a Malayo-Polynesian language spoken in the Lesser Sunda Islands, Indonesia. Kambera is a member of Bima-Sumba subgrouping within Central Malayo-Polynesian inside Malayo-Polynesian. The island of Sumba, located in the Eastern Indonesia, has an area of 12,297 sq. km. The name Kambera comes from a traditional region which is close to a town in Waingapu. Because of export trades which concentrated in Waingapu in the 19th century, the language of the Kambera region has become the bridging language in eastern Sumba. There are many names for the language Kambera. Its speakers refer to Kambera as hilu Humba ‘Sumbanese language’. In the Dutch literature, Kambera is known as Sumbaneesch, Sumba(a)sch, Oost-Sumbaas and Kamberaas. In Indonesian literature, it is referred as Bahasa Sumba/Kamberaor Bahasa Sumba Timur dalam dialek Kambera (‘Eastern Sumbanese in the Kambera dialect’).
in scheme: Lexvo - ISO 639-3 language codes
notation: xbr

Rama Cay Creole
type: Language
type: Concept
ISO 639-3 code: bzk
alternative label: Creole English, Nicaragua
alternative label: Nicaragua Creole English
definition: Rama Cay Creole is a Creole language spoken by some 8-900 people on the island of Rama Cay in eastern Nicaragua. It is based on Miskito Coast Creole with additional elements of the Chibchan language Rama and purportedly some elements of English spoken with a German accent. The creolization of the language is supposed to have happened when Moravian missionaries who were native Germans but preached in English encouraged the Rama-speaking population of the island to shift to English.
in scheme: Lexvo - ISO 639-3 language codes
notation: bzk

Boano
type: Language
type: Concept
ISO 639-3 code: bzl
alternative label: Boano (Sulawesi)
in scheme: Lexvo - ISO 639-3 language codes
notation: bzl

Bolondo
type: Language
type: Concept
ISO 639-3 code: bzm
in scheme: Lexvo - ISO 639-3 language codes
notation: bzm

Boano
type: Language
type: Concept
ISO 639-3 code: bzn
alternative label: Boano (Maluku)
in scheme: Lexvo - ISO 639-3 language codes
notation: bzn

Bozaba
type: Language
type: Concept
ISO 639-3 code: bzo
in scheme: Lexvo - ISO 639-3 language codes
notation: bzo

Kemberano
type: Language
type: Concept
ISO 639-3 code: bzp
in scheme: Lexvo - ISO 639-3 language codes
notation: bzp

Buli
type: Language
type: Concept
ISO 639-3 code: bzq
alternative label: Buli (Indonesia)
in scheme: Lexvo - ISO 639-3 language codes
notation: bzq

Biri
type: Language
type: Concept
ISO 639-3 code: bzr
in scheme: Lexvo - ISO 639-3 language codes
notation: bzr

Brazilian Sign Language
type: Language
type: Concept
ISO 639-3 code: bzs
definition: Brazilian Sign Language, also known as "Libras" (from "Língua Brasileira de Sinais") and previously known as LSB, LGB or LSCB (Brazilian Cities Sign Language), is the language of the Deaf communities of urban Brazil.
in scheme: Lexvo - ISO 639-3 language codes
notation: bzs
preferred label: Língua brasileira de sinais @pt

Brithenig
type: Language
type: Concept
ISO 639-3 code: bzt
definition: Brithenig is an invented language, or constructed language ("conlang"). It was created as a hobby in 1996 by Andrew Smith from New Zealand, who also invented the alternate history of Ill Bethisad to "explain" it.
in scheme: Lexvo - ISO 639-3 language codes
notation: bzt

Burmeso
type: Language
type: Concept
ISO 639-3 code: bzu
alternative label: Burmeso language
definition: The Burmeso language, also known as Taurap, is spoken by some 300 people along the mid Mamberamo River in Papua province, Indonesia. It forms a branch of Malcolm Rosss family of East Birds Head – Sentani languages, but had been considered a language isolate by Stephen Wurm.
in scheme: Lexvo - ISO 639-3 language codes
notation: bzu

Bebe
type: Language
type: Concept
ISO 639-3 code: bzv
alternative label: Bebe language
alternative label: Naami
definition: Bebe is an Eastern Beboid language of Cameroon. According to Ethnologue, it's 85% lexically similar to Kemezung.
in scheme: Lexvo - ISO 639-3 language codes
notation: bzv

Kambiwá
type: Language
type: Concept
ISO 639-3 code: xbw
alternative label: Kambiwá language
definition: Kambiwá Cambioá is an extinct unclassified language of Brazil. A couple dozen words were collected from two people in the 1960s, but by that time no-one spoke the language any longer. Apart from two apparent borrowings, none of the words are relatable to known languages. Loukotka (1968) characterized the language as unclassifiable due to lack of data.
in scheme: Lexvo - ISO 639-3 language codes
notation: xbw
preferred label: Idioma kambiwá @es

Basa
type: Language
type: Concept
ISO 639-3 code: bzw
alternative label: Basa (Nigeria)
alternative label: Basa language
definition: Basa, also called Abacha, Abatsa, Basa-Benue, Bassa-Komo, Bassa-Kwomu, Rubasa, and Rubassa, is a Kainji language spoken in central Nigeria, in the vicinity of Bassa, Ankpa, Nasarawa, and Kwali Local Government Areas and of the city of Makurdi.
in scheme: Lexvo - ISO 639-3 language codes
notation: bzw

Kɛlɛngaxo Bozo
type: Language
type: Concept
ISO 639-3 code: bzx
alternative label: Bozo, Kɛlɛngaxo
in scheme: Lexvo - ISO 639-3 language codes
notation: bzx

Obanliku
type: Language
type: Concept
ISO 639-3 code: bzy
alternative label: Banliku language
definition: Banliku (Obanliku, Abanliku) is a Bendi (Benue–Congo) language of Nigeria.
in scheme: Lexvo - ISO 639-3 language codes
notation: bzy

Evant
type: Language
type: Concept
ISO 639-3 code: bzz
in scheme: Lexvo - ISO 639-3 language codes
notation: bzz

Chortí
type: Language
type: Concept
ISO 639-3 code: caa
alternative label: Ch’orti’ language
definition: The Chorti language (sometimes also Chorti) is a Mayan language, spoken by the indigenous Maya people who are also known as the Chorti or Chorti Maya. Chorti is a direct descendant of the Classic Maya language in which many of the pre-Columbian inscriptions using the Maya script were written. This Classic Maya language is also attested in a number of inscriptions made in regions whose inhabitants most likely spoke a different Mayan language variant, including the ancestor of Yukatek Maya.
in scheme: Lexvo - ISO 639-3 language codes
notation: caa
preferred label: Ch'orti' @fr
preferred label: Chortí-Sprache @de
preferred label: Idioma chortí @es
preferred label: Língua chorti @pt

Garifuna
type: Language
type: Concept
ISO 639-3 code: cab
alternative label: Garifuna language
definition: Garifuna is an Arawakan language spoken in Honduras, Guatemala, and Belize by the Garifuna people. The language is also spoken to a lesser extent in Nicaragua's Mosquito Coast. Historically it was referred to as Carib or Black Carib and Igñeri by Europeans. Garifuna has a vocabulary split between terms used only by men and terms used only by women. This does not however affect the entire vocabulary but when it does, the terms used by men generally come from Carib and those used by women come from Arawak. It was declared a Masterpiece of the Oral and Intangible Heritage of Humanity in 2009 along with Garifuna music and dance.
in scheme: Lexvo - ISO 639-3 language codes
notation: cab
preferred label: Idioma garífuna @es
preferred label: Lingua garifuna @it
preferred label: Língua garífuna @pt

Chuj
type: Language
type: Concept
ISO 639-3 code: cac
alternative label: Chuj language
definition: Chuj is one of the Mayan languages spoken by around 40,000 people in Guatemala and 10,000 in Mexico. Chuj together with the languages of Tojolabal, Mocho, Akateko, Qanjobal and Popti' form the western branch of the Mayan family of languages. Chuj created its own branch about 21 centuries ago. In Guatemala, Chuj speakers are located in three municipalities in the department of Huehuetenango. They are San Mateo Ixtatán, San Sebastián Coatán and Nentón. There is a high level of language conservation in these areas. Some communities of Barillas and Ixcán also speak Chuj in Guatemala.
in scheme: Lexvo - ISO 639-3 language codes
notation: cac
preferred label: Chuj-Sprache @de
preferred label: Idioma chuj @es
preferred label: Língua chuj @pt

Caddo
type: Language
type: Concept
ISO 639-2 Bibliographical code: cad
ISO 639-2 Terminological code: cad
ISO 639-3 code: cad
alternative label: Caddo language
definition: Caddo is the only surviving Southern Caddoan language of the Caddo language family. It is spoken by the Caddo Nation of Oklahoma. Today, only 25 elderly speakers are estimated to remain, none of whom are monolingual Caddo speakers, making Caddo a critically endangered language. There are several mutually intelligible dialects of Caddo; some of the more prominent dialects include Kadohadacho, Hasinai, Hainai, Natchitoches, and Yatasi. Today, the most commonly used dialects are Hasinai and Hainai.
in scheme: Lexvo - ISO 639-3 language codes
notation: cad
preferred label: caddo @es

Lehar
type: Language
type: Concept
ISO 639-3 code: cae
alternative label: Laalaa
in scheme: Lexvo - ISO 639-3 language codes
notation: cae

Southern Carrier
type: Language
type: Concept
ISO 639-3 code: caf
alternative label: Carrier, Southern
in scheme: Lexvo - ISO 639-3 language codes
notation: caf

Nivaclé
type: Language
type: Concept
ISO 639-3 code: cag
alternative label: Nivaclé language
definition: Nivaclé is a Matacoan language spoken in Paraguay by c.8,400 and in Argentina by 200. It is also known as Chulupí and Ashluslay, and in older sources has been called Ashuslé, Suhin, Sujín, Chunupí, Churupí, Choropí, and other variant spellings of these names. Nivaclé speakers are found in the Chaco, in Paraguay in Presidente Hayes Department, and Boquerón Department, and in Argentina in Salta Province.
in scheme: Lexvo - ISO 639-3 language codes
notation: cag
preferred label: Nivaklé @fr

Cahuarano
type: Language
type: Concept
ISO 639-3 code: cah
alternative label: Cahuarano language
definition: Cahuarano is a possibly extinct indigenous American language of the Zaparoan family, spoken by a few native people in Perú along the Nanay river. Though classified as nearly extinct, it may already be extinct because its speakers have shifted to speaking Spanish.
in scheme: Lexvo - ISO 639-3 language codes
notation: cah
preferred label: Idioma cahuarano @es

Kabixí
type: Language
type: Concept
ISO 639-3 code: xbx
alternative label: Kabixí language
definition: Kabixí was the last language of the Guapore branch of Chapacuran. SIL reported 100 speakers from publications dated 1986, but in 2010 declared it extinct.
in scheme: Lexvo - ISO 639-3 language codes
notation: xbx

Chané
type: Language
type: Concept
ISO 639-3 code: caj
alternative label: Chané language
definition: Chané is an extinct language of Argentina and Bolivia. It was either a dialect of or closely related to the Terena language of the Arawakan language family. There are few data on this language. In Argentina it was spoken in Salta province.
in scheme: Lexvo - ISO 639-3 language codes
notation: caj
preferred label: Idioma chané @es

Kaqchikel
type: Language
type: Concept
ISO 639-3 code: cak
preferred label: Cakchiquel
alternative label: Kaqchikel language
definition: The Kaqchikel, or Kaqchiquel, language (in modern orthography; formerly also spelled Cakchiquel or Cakchiquiel) is an indigenous Mesoamerican language and a member of the Quichean–Mamean branch of the Mayan languages family. It is spoken by the indigenous Kaqchikel people in central Guatemala. It is closely related to the Kiche (Quiché) and Tz'utujil languages.
in scheme: Lexvo - ISO 639-3 language codes
notation: cak
preferred label: Cakchiquel-Sprache @de
preferred label: Idioma kakchikel @es
preferred label: Língua caqchiquel @pt

Carolinian
type: Language
type: Concept
ISO 639-3 code: cal
alternative label: Carolinian language
definition: Carolinian is an Austronesian language spoken in Northern Mariana Islands, where it is an official language along with English and Chamorro. Spoken mostly by the Carolinian people, Carolinian is most closely related to Satawalese, Woleaian, and Puluwatese. Carolinian has 95% lexical similarity with Satawalese, 88% with Woleaian and Puluwatese; 81% with Mortlockese; 78% with Chuukese, 74% with Ulithian. A 1990 census estimated the number of speakers at about 3,000, currently 5,700. Carolinian is known as Refaluwasch by native speakers. It has 31 characters in its alphabet.
in scheme: Lexvo - ISO 639-3 language codes
notation: cal
preferred label: Carolinien @fr
preferred label: Idioma carolinio @es
preferred label: Karolinische Sprache @de

Cemuhî
type: Language
type: Concept
ISO 639-3 code: cam
alternative label: Cèmuhî language
definition: Cemuhî (Camuhi, Camuki, Tyamuhi, Wagap) is a language spoken on the island of New Caledonia.
in scheme: Lexvo - ISO 639-3 language codes
notation: cam
preferred label: Cèmuhî @fr

Chambri
type: Language
type: Concept
ISO 639-3 code: can
alternative label: Chambri language
definition: The Chambri language is spoken by the Chambri people of Papua New Guinea. Spellings in the older anthropological literature include Tchambuli, Tshamberi.
in scheme: Lexvo - ISO 639-3 language codes
notation: can

Chácobo
type: Language
type: Concept
ISO 639-3 code: cao
alternative label: Chácobo language
definition: Chácobo is a Panoan language spoken by about 550 of 860 ethnic tribal Chácobo people of the Beni department of northwest of Magdalena, Bolivia. Chácobo children are learning the language as a first language.
in scheme: Lexvo - ISO 639-3 language codes
notation: cao

Chipaya
type: Language
type: Concept
ISO 639-3 code: cap
alternative label: Chipaya language
definition: Chipaya is a native South American language of the Uru–Chipaya language family. The only other language in the grouping, Uru, is considered by some to be a divergent dialect of Chipaya. Ethnologue lists the language vitality as "vigorous," with 1200 speakers out of an ethnic population of around 1800. Chipaya has been influenced considerably by Aymara, Quechua, and more recently, Spanish, with a third of its vocabulary having been replaced by those languages.
in scheme: Lexvo - ISO 639-3 language codes
notation: cap
preferred label: Idioma chipaya @es
preferred label: Puquina @fr

Car language
type: Language
type: Concept
ISO 639-3 code: caq
alternative label: Car Nicobarese
alternative label: Nicobarese, Car
definition: Car is the most widely spoken of the Nicobarese languages spoken in the Nicobar Islands of India.
in scheme: Lexvo - ISO 639-3 language codes
notation: caq
preferred label: Car @de

Carib
type: Language
type: Concept
ISO 639-2 Bibliographical code: car
ISO 639-2 Terminological code: car
ISO 639-3 code: car
alternative label: Carib language
alternative label: Carib, Galibi
alternative label: Galibi Carib
alternative label: Idioma kariña @es
alternative label: Kali'na @fr
preferred label: caribe @es
definition: Carib, also known as Caribe, Cariña, Galibi, Galibí, Kali'na, Kalihna, Kalinya, Galibi Carib, Maraworno and Marworno, is an Amerindian language in the Cariban language family.
in scheme: Lexvo - ISO 639-3 language codes
notation: car
preferred label: Karibisch @de
preferred label: caribico @it
preferred label: karib @fr

Tsimané
type: Language
type: Concept
ISO 639-3 code: cas
alternative label: Chimane language
definition: Chimané (Tsimané), also known as Mosetén, is a language of the western Bolivian lowlands spoken by the Moseten and Tsimane peoples along the Beni River. Sometimes classified as two languages, they reportedly have no trouble communicating (Ethnologue 16), and were evidently a single language separated recently through cultural contact (Campbell 2000).
in scheme: Lexvo - ISO 639-3 language codes
notation: cas
preferred label: Langues mosetenanes @fr
preferred label: Lenguas mosetenas @es

Catalan
type: Language
type: Concept
ISO 639-1 code: ca
ISO 639-2 Bibliographical code: cat
ISO 639-2 Terminological code: cat
ISO 639-3 code: cat
alternative label: Catalan language
alternative label: Idioma catalán @es
alternative label: Katalanische Sprache @de
alternative label: Lingua catalana @it
alternative label: Língua catalã @pt
definition: Catalan (, , or ; autonym: català, ) is a Romance language, the national and only official language of Andorra and a co-official language in the Spanish autonomous communities of Catalonia, the Balearic Islands and Valencian Community, where it is known as Valencian (valencià, ), as well as in the city of Alghero, on the Italian island of Sardinia. It is also spoken, with no official recognition, in the autonomous communities of Aragon (in La Franja) and Murcia (in Carche) in Spain, and in the historic Roussillon region of southern France, roughly equivalent to the current département of the Pyrénées-Orientales (Northern Catalonia).
in scheme: Lexvo - ISO 639-3 language codes
notation: cat
preferred label: Katalanisch @de
preferred label: catalan @fr
preferred label: catalano @it
preferred label: catalán @es
preferred label: catalão @pt

Batyala
type: Language
type: Concept
in scheme: Lexvo - ISO 639-3 language codes

Cavineña
type: Language
type: Concept
ISO 639-3 code: cav
alternative label: Cavineña language
definition: Cavineña is an indigenous language spoken on the Amazonian plains of northern Bolivia by over 1,000 Cavineño people. Although Cavineña is still spoken (and still learnt by some children), it is an endangered language. Guillaume (2004) states that about 1200 people speak the language, out of a population of around 1700. Nearly all Cavineña are bilingual in Spanish.
in scheme: Lexvo - ISO 639-3 language codes
notation: cav

Callawalla
type: Language
type: Concept
ISO 639-3 code: caw
alternative label: Kallawaya language
definition: Kallawaya, also Callahuaya or Callawalla is an endangered, secret, mixed language in Bolivia. It is spoken by the Kallawaya people, a group of traditional itinerant healers in the Andes in their medicinal healing practice.
in scheme: Lexvo - ISO 639-3 language codes
notation: caw
preferred label: Kallawaya @fr

Chiquitano
type: Language
type: Concept
ISO 639-3 code: cax
alternative label: Chiquitano language
definition: Chiquitano (also Bésiro or Tarapecosi) is an indigenous language of eastern Bolivia, spoken in the central region of the Santa Cruz province.
in scheme: Lexvo - ISO 639-3 language codes
notation: cax
preferred label: Idioma chiquitano @es

Cayuga
type: Language
type: Concept
ISO 639-3 code: cay
alternative label: Cayuga language
preferred label: cayuga @es
definition: Cayuga (In Cayuga ) is a Northern Iroquoian language of the Iroquois Proper (also known as "Five Nations Iroquois") subfamily, and is spoken on Six Nations of the Grand River First Nation, Ontario, by around 100 Cayuga people.
in scheme: Lexvo - ISO 639-3 language codes
notation: cay

Canichana
type: Language
type: Concept
ISO 639-3 code: caz
alternative label: Canichana language
definition: Canichana, or Canesi, is a possible language isolate of Bolivia (department Beni). As of 1991 there were 500 Canichana people, but only 20 spoke the Canichana language; by 2000 the ethnic population was 583, but the language was extinct.
in scheme: Lexvo - ISO 639-3 language codes
notation: caz
preferred label: Idioma canichana @es

Cumbric
type: Language
type: Concept
ISO 639-3 code: xcb
alternative label: Cumbric language
definition: Cumbric was a variety of the Celtic British language spoken during the Early Middle Ages in the Hen Ogledd or "Old North", or what is now northern England and southern Lowland Scotland, the area anciently known as Cumbria. It was closely related to Old Welsh and the other Brythonic languages. Place name evidence suggests Cumbric speakers may have carried it into other parts of Northern England as migrants from its core area further north. The original boundaries of the Diocese of Carlisle are said traditionally to mark the extent of the rule of Strathclyde. Cumbric placenames are also common in Lothian, Peebleshire, Dumfriesshire, Lanarkshire and Ayrshire.
in scheme: Lexvo - ISO 639-3 language codes
notation: xcb
preferred label: Cambrien @fr
preferred label: Idioma cúmbrico @es
preferred label: Kumbrische Sprache @de
preferred label: Lingua cumbrica @it

Cabiyarí
type: Language
type: Concept
ISO 639-3 code: cbb
alternative label: Cabiyari language
definition: Cabiyarí (Caviyari) is an Arawakan language spoken along the Cananarí River in the Vaupes Region of Colombia in north western South America. The name is also spelled Cabiuarí, Cauyarí, Kauyarí, Cuyare, Kawillary.
in scheme: Lexvo - ISO 639-3 language codes
notation: cbb

Carapana
type: Language
type: Concept
ISO 639-3 code: cbc
in scheme: Lexvo - ISO 639-3 language codes
notation: cbc

Carijona
type: Language
type: Concept
ISO 639-3 code: cbd
in scheme: Lexvo - ISO 639-3 language codes
notation: cbd

Chipiajes
type: Language
type: Concept
ISO 639-3 code: cbe
alternative label: Chipiajes language
definition: Chipiajes is an extinct unclassified language of Colombia. The people survive as a Saliba surname; Chipiajes is also a common name among the Guahibo.
in scheme: Lexvo - ISO 639-3 language codes
notation: cbe

Chimila
type: Language
type: Concept
ISO 639-3 code: cbg
alternative label: Chimila language
definition: Chimila (Shimizya) is a Chibchan language of Colombia.
in scheme: Lexvo - ISO 639-3 language codes
notation: cbg

Cagua
type: Language
type: Concept
ISO 639-3 code: cbh
alternative label: Cagua language
definition: Cagua is an extinct unclassified language of Colombia.
in scheme: Lexvo - ISO 639-3 language codes
notation: cbh

Chachi
type: Language
type: Concept
ISO 639-3 code: cbi
alternative label: Cha'palaachi language
definition: Cha' Palaachi also known as Chachi or Cayapa is a Barbacoan language spoken in northern Ecuador by ca. 3000 ethnic Chachi people.
in scheme: Lexvo - ISO 639-3 language codes
notation: cbi
preferred label: Cayapa @fr
preferred label: Idioma cha'palaachi @es

Ede Cabe
type: Language
type: Concept
ISO 639-3 code: cbj
in scheme: Lexvo - ISO 639-3 language codes
notation: cbj

Chavacano
type: Language
type: Concept
ISO 639-3 code: cbk
alternative label: Chavacano language
definition: Chavacano or Chabacano, sometimes referred to by linguists as Philippine Creole Spanish, is a Spanish-based creole language spoken in the Philippines. The word "Chavacano" is derived from the Spanish word "chabacano", meaning "poor taste," "vulgar," "common," "of low quality," "tacky," or "coarse" for the chavacano language which was developed in Cavite City, Ternate and Ermita, and also derived from the word chavano which was coined by the people of Zamboanga-- . Six different dialects have developed: Zamboangueño in Zamboanga City, Davaoeño Zamboangueño / Castellano Abakay in Davao, Ternateño in Ternate, Caviteño in Cavite City, Cotabateño in Cotabato City and Ermiteño in Ermita.
in scheme: Lexvo - ISO 639-3 language codes
notation: cbk
preferred label: Chabacano @de
preferred label: Idioma chabacano @es
preferred label: Lingua zamboangueña @it
preferred label: Língua chavacana @pt

Bualkhaw Chin
type: Language
type: Concept
ISO 639-3 code: cbl
alternative label: Chin, Bualkhaw
in scheme: Lexvo - ISO 639-3 language codes
notation: cbl

Nyahkur
type: Language
type: Concept
ISO 639-3 code: cbn
alternative label: Nyah Kur language
definition: The Nyah Kur language is an Austroasiatic language spoken by a remnant of the Mon people of Dvaravati, the Nyah Kur people, who live in present-day Thailand. It is known as Chao-bon in Thai.
in scheme: Lexvo - ISO 639-3 language codes
notation: cbn

Izora
type: Language
type: Concept
ISO 639-3 code: cbo
in scheme: Lexvo - ISO 639-3 language codes
notation: cbo

Cashibo language
type: Language
type: Concept
ISO 639-3 code: cbr
alternative label: Cashibo-Cacataibo
definition: Cashibo (Caxibo, Cacibo, Cachibo, Cahivo), Cacataibo, Cashibo-Cacataibo, Managua, or Hagueti is an indigenous language of Peru in the region of the Aguaytía, San Alejandro, and Súngaro rivers. It belongs to the Panoan language family, which consists of 28 languages including Shipibo and Yora. The language is spoken vigorously by the aboriginal people of the same name. According to the Ethnologue there were 5,000 speakers of Cashibo in 1999, but the language was vigorous in the communities.
in scheme: Lexvo - ISO 639-3 language codes
notation: cbr
preferred label: Cashibo @fr

Cashinahua
type: Language
type: Concept
ISO 639-3 code: cbs
alternative label: Cashinahua language
definition: Cashinahua (also spelled Kaxinawá, Kaxynawa, Caxinawa, and Caxinawá), or Hantxa Kuin, is an indigenous American language of western South America which belongs to the Panoan language family. It is spoken by about 1,600 Cashinahua people in Perú along the Curanja and Purus rivers; and in Brazil by 400 Cashinahua people in the state of Acre.
in scheme: Lexvo - ISO 639-3 language codes
notation: cbs

Chayahuita
type: Language
type: Concept
ISO 639-3 code: cbt
alternative label: Chayahuita language
definition: Chayahuita is an indigenous American language spoken by thousands of native Chayahuita people in South America. Spoken along the banks of the Paranapura, Cahuapanas, Sillay, and Shanusi rivers. Also known as Chayawita, Chawi, Tshaahui, Chayhuita, Chayabita, Shayabit, Balsapuertino, Paranapura, and Cahuapa. 1-5% literacy rate, compared with 5-15% for Spanish. Dictionary since 1978. Can not be understood by Jebero speakers.
in scheme: Lexvo - ISO 639-3 language codes
notation: cbt

Camunic
type: Language
type: Concept
ISO 639-3 code: xcc
alternative label: Camunic language
definition: The Camunic language is an extinct language which was spoken in the first millennium BC in the Valcamonica and Valtellina valleys of the Central Alps. It has most recently been considered to represent a form of Celtic (Markey 2008).
in scheme: Lexvo - ISO 639-3 language codes
notation: xcc
preferred label: Idioma camúnico @es
preferred label: Langue camunienne @fr
preferred label: Lingua camuna @it

Candoshi-Shapra
type: Language
type: Concept
ISO 639-3 code: cbu
alternative label: Candoshi-Shapra language
definition: Candoshi-Shapra (also known as: Candoshi, Candoxi, Kandoshi, and Murato) is an indigenous American language isolate spoken by several thousand people in western South America along the Chapuli, Huitoyacu, Pastaza, and Morona river valleys. There are two dialects, Chapara (also spelled Shapra) and Kandoashi. This language is an official language of Perú as are all native languages in the areas where they are spoken and are the predominant language in use. Their people are prideful in their language and seems to be prospering, 88.5 percent of people are bilingual with Spanish. There is 10 to 30 percent literacy and 15 to 25 percent in Second language Spanish. There is a Candoshi-Shapra dictionary and grammar rules have been developed.
in scheme: Lexvo - ISO 639-3 language codes
notation: cbu
preferred label: Candoshi @fr
preferred label: Idioma candoshi @es

Cacua
type: Language
type: Concept
ISO 639-3 code: cbv
alternative label: Kakwa language
definition: The Kakwa or Cacua language is an endangered language spoken by a little over a hundred people in North Western South America, particularly Colombia and Brazil. interfluvial tropical forests higher than in elevation. The people have traditional livelihoods such as nomadic hunting-gathering and swidden agriculture.
in scheme: Lexvo - ISO 639-3 language codes
notation: cbv
preferred label: Kakua @fr

Kinabalian
type: Language
type: Concept
ISO 639-3 code: cbw
in scheme: Lexvo - ISO 639-3 language codes
notation: cbw

Carabayo
type: Language
type: Concept
ISO 639-3 code: cby
alternative label: Carabayo language
definition: The Carabayo (Yuri, Aroje) are an uncontacted Amazonian people of Colombia living in at least three long houses, one of several suspected uncontacted peoples living along the Rio Puré (now the Río Puré National Park) in the southeastern corner of the country. They are known as the Aroje to the Bora people. Maku and Macusa are pejorative Arawak terms applied to many local languages, not anything specific to Carabayo.
in scheme: Lexvo - ISO 639-3 language codes
notation: cby
preferred label: Idioma carabayo @es

Cauca
type: Language
type: Concept
ISO 639-3 code: cca
in scheme: Lexvo - ISO 639-3 language codes
notation: cca

Chamicuro
type: Language
type: Concept
ISO 639-3 code: ccc
alternative label: Chamicuro language
definition: Chamicuro is a critically endangered indigenous American language spoken by only 8 of aboriginal people in South America. The language is of the Chamicuro people who number between 10 and 20. The Chamicuros live on a tributary of the Huallaga river, in Perú, in an area called Pampa Hermosa, meaning beautiful plains.
in scheme: Lexvo - ISO 639-3 language codes
notation: ccc
preferred label: Lingua chamicura @it

Cafundo Creole
type: Language
type: Concept
ISO 639-3 code: ccd
alternative label: Cafundó language
alternative label: Creole, Cafundo
definition: Cafundó, or Cupópia, is a secret language spoken in the village of Cafundó, São Paulo (Brazil). The language is structurally similar to Portuguese, with a large number of Bantu words in its lexicon.
in scheme: Lexvo - ISO 639-3 language codes
notation: ccd
preferred label: Cupópia @pt

Chopi
type: Language
type: Concept
ISO 639-3 code: cce
alternative label: Chopi language
definition: Chopi, also spelled Copi, Tschopi, and Txopi, is a Bantu language spoken along the southern coast of Mozambique.
in scheme: Lexvo - ISO 639-3 language codes
notation: cce
preferred label: Língua chope @pt

Samba Daka
type: Language
type: Concept
ISO 639-3 code: ccg
alternative label: Daka, Samba
in scheme: Lexvo - ISO 639-3 language codes
notation: ccg

Atsam
type: Language
type: Concept
ISO 639-3 code: cch
alternative label: Atsam language
definition: Atsam, also known as Cawai (Chawai) is a Kainji language of Nigeria.
in scheme: Lexvo - ISO 639-3 language codes
notation: cch
preferred label: atsam @es

Kasanga
type: Language
type: Concept
ISO 639-3 code: ccj
alternative label: Kasanga language
definition: Kasanga (Cassanga) or Haal is a Senegambian language of Guinea-Bissau.
in scheme: Lexvo - ISO 639-3 language codes
notation: ccj

Cutchi-Swahili
type: Language
type: Concept
ISO 639-3 code: ccl
in scheme: Lexvo - ISO 639-3 language codes
notation: ccl

Malaccan Creole Malay
type: Language
type: Concept
ISO 639-3 code: ccm
alternative label: Creole Malay, Malaccan
in scheme: Lexvo - ISO 639-3 language codes
notation: ccm

Comaltepec Chinantec
type: Language
type: Concept
ISO 639-3 code: cco
alternative label: Chinantec, Comaltepec
in scheme: Lexvo - ISO 639-3 language codes
notation: cco

Celtiberian
type: Language
type: Concept
ISO 639-3 code: xce
alternative label: Celtiberian language
definition: Celtiberian (also known as Hispano-Celtic) is an extinct Indo-European language of the Celtic branch spoken by the Celtiberians in an area of the Iberian Peninsula lying between the headwaters of the Duero, Tajo, Júcar and Turia rivers and the Ebro river. This language is directly attested in nearly two hundred inscriptions dated in the 2nd century BC and the 1st century BC, mainly in Celtiberian script, a direct adaptation of the northeastern Iberian script, but also in Latin alphabet. The longest extant Celtiberian inscriptions are those on three Botorrita plaques, bronze plaques from Botorrita near Zaragoza, dating to the early 1st century BC, labelled Botorrita I, III and IV (Botorrita II is in the Latin language).
in scheme: Lexvo - ISO 639-3 language codes
notation: xce
preferred label: Celtiberico @it
preferred label: Celtibère @fr
preferred label: Idioma celtíbero @es
preferred label: Keltiberische Sprache @de
preferred label: Língua celtibérica @pt

Chakma
type: Language
type: Concept
ISO 639-3 code: ccp
alternative label: Chakma language
definition: Chakma language (Changma Vaj or Changma Kodha) is an Indo-European language spoken by the Chakma people. Its better-known closest relatives are Bengali, Assamese, Chittagonian, Bishnupriya Manipuri, Tanchangya, Rohingya and Sylheti. It is spoken by nearly 310,000 people in southeast Bangladesh near Chittagong City, and another 300,000 in India in Mizoram, Assam, and Tripura. It is written using the Chakma script, which is also called   Ajhā pāṭh, sometimes romanized Ojhopath. Literacy in Chakma script is low.
in scheme: Lexvo - ISO 639-3 language codes
notation: ccp
preferred label: Changma kodha @fr
preferred label: Língua chakma @pt

Cacaopera
type: Language
type: Concept
ISO 639-3 code: ccr
alternative label: Cacaopera language
definition: Cacaopera is an extinct language belonging to the Misumalpan family, formerly spoken in the department of Morazán in El Salvador. It was closely related to Matagalpa, and slightly more distantly to Sumo, but was geographically separated from other Misumalpan languages.
in scheme: Lexvo - ISO 639-3 language codes
notation: ccr

Choni
type: Language
type: Concept
ISO 639-3 code: cda
in scheme: Lexvo - ISO 639-3 language codes
notation: cda

Chenchu
type: Language
type: Concept
ISO 639-3 code: cde
alternative label: Chenchu language
definition: Chenchu language is a Dravidian language which belongs to the Telugu branch of its South-Central family. This language is spoken mostly in Andhra Pradesh state in India. This language is spoken by about 28,754 persons (1981 census) of the Chenchu Aboriginal forests hunter-gatherer tribe. It is also called as Chenchukulam, Chenchwar, Chenswar or Choncharu.
in scheme: Lexvo - ISO 639-3 language codes
notation: cde

Chiru
type: Language
type: Concept
ISO 639-3 code: cdf
in scheme: Lexvo - ISO 639-3 language codes
notation: cdf

Chamari
type: Language
type: Concept
ISO 639-3 code: cdg
in scheme: Lexvo - ISO 639-3 language codes
notation: cdg

Chambeali
type: Language
type: Concept
ISO 639-3 code: cdh
in scheme: Lexvo - ISO 639-3 language codes
notation: cdh

Chodri
type: Language
type: Concept
ISO 639-3 code: cdi
in scheme: Lexvo - ISO 639-3 language codes
notation: cdi

Churahi
type: Language
type: Concept
ISO 639-3 code: cdj
in scheme: Lexvo - ISO 639-3 language codes
notation: cdj

Chepang
type: Language
type: Concept
ISO 639-3 code: cdm
alternative label: Chepang language
definition: Chepang is a language spoken by approximately 37,000 people in Nepal. The people are known as Chepang.
in scheme: Lexvo - ISO 639-3 language codes
notation: cdm

Chaudangsi
type: Language
type: Concept
ISO 639-3 code: cdn
in scheme: Lexvo - ISO 639-3 language codes
notation: cdn

Língua min oriental
type: Language
type: Concept
ISO 639-3 code: cdo
alternative label: Chinese, Min Dong
alternative label: Min Dong Chinese
definition: The Eastern Min language, or Min Dong (; Foochow Romanized: ) is the language mainly spoken in the eastern part of Fujian Province in China, in and near Fuzhou and Ningde. Fuzhou is the province's capital and largest city. Fuzhou dialect is considered the standard form of the Eastern Min Language.
in scheme: Lexvo - ISO 639-3 language codes
notation: cdo
preferred label: Min Dong
preferred label: Min dong @it
preferred label: Mindong @fr

Kamuku language
type: Language
type: Concept
ISO 639-3 code: cdr
alternative label: Cinda-Regi-Tiyal
definition: Kamuku is a Kainji language of Nigeria. The three dialects, Cinda, Regi, and Tiyal, are close.
in scheme: Lexvo - ISO 639-3 language codes
notation: cdr
preferred label: Kamuku @de

Chadian Sign Language
type: Language
type: Concept
ISO 639-3 code: cds
in scheme: Lexvo - ISO 639-3 language codes
notation: cds

Chadong
type: Language
type: Concept
ISO 639-3 code: cdy
alternative label: Chadong language
definition: The Chadong language (also called Chaodong) is a Kam–Sui language spoken mainly in Chadong Township, Lingui County, Guilin, northeastern Guangxi, China. It is most closely related to the Maonan language. Chadong has only been recently described by Chinese linguist Jinfang Li in the 1990s and 2000s.
in scheme: Lexvo - ISO 639-3 language codes
notation: cdy

Koda
type: Language
type: Concept
ISO 639-3 code: cdz
in scheme: Lexvo - ISO 639-3 language codes
notation: cdz

Cisalpine Gaulish
type: Language
type: Concept
ISO 639-3 code: xcg
alternative label: Gaulish, Cisalpine
definition: The Celtic Cisalpine Gaulish inscriptions are frequently combined with the Lepontic inscriptions under the term Celtic language remains in northern Italy. While it is possible that the Lepontians were autochthonous to northern Italy since the end of the 2nd millennium BC, it is well-known that the Gauls invaded the regions north of the river Po in several waves since the 5th century BC. They apparently took over the art of writing from the Lepontians, including some of the orthographic peculiarities. There are only about half a dozen Cisalpine Gaulish inscriptions, three of which are longer than just one or two words. The inscriptions stem largely from the area south of the Lepontians. The bilingual inscription from Todi in Umbria is an exception and must be due to an exilant.
in scheme: Lexvo - ISO 639-3 language codes
notation: xcg
preferred label: Idioma insubre @es
preferred label: Lingua insubre @it

Lower Chehalis
type: Language
type: Concept
ISO 639-3 code: cea
alternative label: Chehalis, Lower
in scheme: Lexvo - ISO 639-3 language codes
notation: cea

Cebuano
type: Language
type: Concept
ISO 639-2 Bibliographical code: ceb
ISO 639-2 Terminological code: ceb
ISO 639-3 code: ceb
alternative label: Cebuano language
alternative label: Idioma cebuano @es
alternative label: Lingua cebuana @it
alternative label: Língua cebuana @pt
preferred label: cebuano @es
definition: Cebuano, referred to by most of its speakers as Bisaya (or Visayan in English), is an Austronesian language spoken in the Philippines by about 20 million people mostly in the Central Visayas. It is the most widely spoken of the languages within the so-named Bisayan subgroup and is closely related to other Filipino languages. It has the largest native language speaking population of the Philippines despite not being taught formally in schools and universities. It is the lingua franca of the Central Visayas and parts of Mindanao. The name Cebuano is derived from the island of Cebu where the prestige dialect is spoken.
in scheme: Lexvo - ISO 639-3 language codes
notation: ceb

Chamacoco
type: Language
type: Concept
ISO 639-3 code: ceg
alternative label: Chamacoco language
definition: Chamacoco is a Zamucoan language spoken in Paraguay and maybe Brazil by the Chamacoco people. It is also known as Xamicoco or Xamacoco, although the tribe itself prefers the name Ishír, which is also spelled Ishiro or Jewyo. It is spoken by a traditionally hunter-gatherer society that has now turned to agriculture. Its speakers are of all ages, and generally do not speak Spanish or Guarani well.
in scheme: Lexvo - ISO 639-3 language codes
notation: ceg

Eastern Khumi Chin
type: Language
type: Concept
ISO 639-3 code: cek
alternative label: Chin, Eastern Khumi
in scheme: Lexvo - ISO 639-3 language codes
notation: cek

Cen
type: Language
type: Concept
ISO 639-3 code: cen
in scheme: Lexvo - ISO 639-3 language codes
notation: cen

Czech
type: Language
type: Concept
ISO 639-1 code: cs
ISO 639-2 Bibliographical code: cze
ISO 639-2 Terminological code: ces
ISO 639-3 code: ces
alternative label: Czech language
alternative label: Idioma checo @es
alternative label: Lingua ceca @it
alternative label: Língua tcheca @pt
alternative label: Tschechische Sprache @de
alternative label: tcheco @pt
alternative label: tchèque @fr
definition: Czech (; čeština ) is a West Slavic language with about 12 million native speakers; it is the majority language in the Czech Republic and spoken by Czechs worldwide. The language was known as Bohemian in English until the late 19th century. Czech is similar to and mutually intelligible with Slovak and, to a lesser extent, with Polish and Sorbian.
in scheme: Lexvo - ISO 639-3 language codes
notation: ces
preferred label: Tchèque @fr
preferred label: Tschechisch @de
preferred label: ceco @it
preferred label: checo @es

Centúúm
type: Language
type: Concept
ISO 639-3 code: cet
alternative label: Jalaa language
definition: Jalaa (autonym bàsàrə̀n dà jàlààbè̩) Centúúm or Cen Tuum is an endangered language of northeastern Nigeria (Loojaa settlement in Balanga Local Government Area, Bauchi State), of uncertain (possibly Niger–Congo) origins. It is nearly extinct; the ethnic group has come to use the Bwilim dialect of Cham in daily life, and the few remaining speakers of Jalaa, all elderly, are much more fluent in Cham than in Jalaa.
in scheme: Lexvo - ISO 639-3 language codes
notation: cet
preferred label: Idioma centúúm @es
preferred label: Jalaa @fr

Dijim-Bwilim
type: Language
type: Concept
ISO 639-3 code: cfa
alternative label: Dijim-Bwilim language
definition: Dijim-Bwilim is one of the Savanna languages of eastern Nigeria. Its name is merely a compound of its two dialects, Dijim and Bwilim. A tonal language, it has a whistled register.
in scheme: Lexvo - ISO 639-3 language codes
notation: cfa

Cara
type: Language
type: Concept
ISO 639-3 code: cfd
alternative label: Cara language
definition: Cara (Chara), also called Teriya after the village it is spoken in, is a small Plateau language of Nigeria.
in scheme: Lexvo - ISO 639-3 language codes
notation: cfd

Como Karim
type: Language
type: Concept
ISO 639-3 code: cfg
alternative label: Como Karim language
definition: Como Karim (Chomo / Shomo, Kirim) is a Jukunoid language of Nigeria.
in scheme: Lexvo - ISO 639-3 language codes
notation: cfg

Falam Chin
type: Language
type: Concept
ISO 639-3 code: cfm
alternative label: Chin, Falam
alternative label: Falam language
definition: Falam, also known as Falam Chin, Falam Lai, Zahau, and Laiţawng, is a Kukish language of Burma and India.
in scheme: Lexvo - ISO 639-3 language codes
notation: cfm

Changriwa
type: Language
type: Concept
ISO 639-3 code: cga
in scheme: Lexvo - ISO 639-3 language codes
notation: cga

Yautepec Zapotec
type: Language
type: Concept
ISO 639-3 code: zpb
alternative label: Zapotec, Yautepec
in scheme: Lexvo - ISO 639-3 language codes
notation: zpb

Kagayanen
type: Language
type: Concept
ISO 639-3 code: cgc
alternative label: Kagayanen language
definition: The Kagayanen language is spoken in the province of Palawan in the Philippines.
in scheme: Lexvo - ISO 639-3 language codes
notation: cgc

Chemakum
type: Language
type: Concept
ISO 639-3 code: xch
alternative label: Chemakum language
preferred label: Chimakum
definition: The Chemakum language (; also written as Chimakum or Chimacum) was spoken by the Chemakum, a Native American group that once lived on western Washington state's Olympic Peninsula. The Chemakum language was very similar to the Quileute language (the only surviving Chimakuan language). In the 1860s, Chief Seattle and the Suquamish people wiped out the Chimakum people, killing the language off with them.
in scheme: Lexvo - ISO 639-3 language codes
notation: xch

Chiga
type: Language
type: Concept
ISO 639-3 code: cgg
alternative label: Kiga language
alternative label: Língua rukiga @pt
definition: Kiga (also called Rukiga, Ruchiga, or Chiga) is the native language of the people of Kiga people (Bakiga). Kiga is a very similar language to the Nkore language. It was first written in the second half of the nineteenth century.
in scheme: Lexvo - ISO 639-3 language codes
notation: cgg
preferred label: chiga @es
preferred label: kiga @fr

Chocangacakha
type: Language
type: Concept
ISO 639-3 code: cgk
alternative label: Chocangaca language
definition: Chocangacakha (Dzongkha: ཁྱོད་ཅ་ང་ཅ་ཁ་; Wylie: Khyod-ca-nga-ca-kha; also called "Cho-ca-nga-ca-kha," "Kursmadkha," "Maphekha," "Rtsamangpaikha," and "Tsagkaglingpaikha") is a Southern Tibetan language spoken by about 20,000 people in the Kurichu Valley of Lhuntse and Mongar Districts in eastern Bhutan. Chocangacakha is a "sister language" to Dzongkha, however under pressure to assimilate into the mainstream Dzongkha speaking Ngalop culture, this proximity has resulted in significant loss of its particularly distinctive "Kurichu linguistic substrait."
in scheme: Lexvo - ISO 639-3 language codes
notation: cgk

Chamorro
type: Language
type: Concept
ISO 639-1 code: ch
ISO 639-2 Bibliographical code: cha
ISO 639-2 Terminological code: cha
ISO 639-3 code: cha
alternative label: Chamorro language
alternative label: Chamorro-Sprache @de
alternative label: Idioma chamorro @es
alternative label: Lingua chamorro @it
alternative label: Língua chamorro @pt
definition: Chamorro (Chamorro: Fino' Chamoru or simply Chamoru) is a Malayo-Polynesian (Austronesian) language, spoken on the Mariana Islands (Guam, Rota, Tinian, and Saipan) by about 47,000 people (about 35,000 people on Guam and about 12,000 in the N. Marianas).
in scheme: Lexvo - ISO 639-3 language codes
notation: cha
preferred label: chamorro @es

Chibcha
type: Language
type: Concept
ISO 639-2 Bibliographical code: chb
ISO 639-2 Terminological code: chb
ISO 639-3 code: chb
alternative label: Chibcha language
alternative label: Idioma muisca @es
preferred label: chibcha @es
definition: Chibcha, also known as Muisca or Mosca, is an extinct Chibchan language of Colombia, formerly spoken by the Muisca people, a complex indigenous civilization of South America and the present-day Colombian region. Scholars believe the Chibcha language arose in South America and then migrated with people to nearby areas.
in scheme: Lexvo - ISO 639-3 language codes
notation: chb
preferred label: Chibcha-Sprache @de
preferred label: Muisca @fr

Catawba
type: Language
type: Concept
ISO 639-3 code: chc
alternative label: Catawba language
definition: Catawba is one of two Eastern Siouan languages of the eastern US, which together with the Western Siouan languages formed the Siouan language family.
in scheme: Lexvo - ISO 639-3 language codes
notation: chc

Highland Oaxaca Chontal
type: Language
type: Concept
ISO 639-3 code: chd
alternative label: Chontal, Highland Oaxaca
definition: Highland Oaxaca Chontal, or Chontal de la Sierra de Oaxaca, is one of the Chontal languages of Oaxaca. It is sometimes called Tequistlatec, but is not the same as Tequistlatec proper, which is extinct.
in scheme: Lexvo - ISO 639-3 language codes
notation: chd
preferred label: Idioma chontal de Oaxaca @es

Chechen
type: Language
type: Concept
ISO 639-1 code: ce
ISO 639-2 Bibliographical code: che
ISO 639-2 Terminological code: che
ISO 639-3 code: che
alternative label: Chechen language
alternative label: Idioma checheno @es
alternative label: Lingua cecena @it
alternative label: Língua chechena @pt
alternative label: Tchétchène @fr
alternative label: Tschetschenische Sprache @de
preferred label: checheno @es
definition: The Chechen language (Нохчийн мотт / Noxçiyn mott; Medieval Chechen: ) is spoken by more than 1.5 million people, mostly in Chechnya and by Chechen people elsewhere. It is a member of the Northeast Caucasian languages.
in scheme: Lexvo - ISO 639-3 language codes
notation: che
preferred label: Tschetschenisch @de
preferred label: ceceno @it
preferred label: chechene @pt
preferred label: tchétchène @fr

Tabasco Chontal
type: Language
type: Concept
ISO 639-3 code: chf
alternative label: Chontal Maya language
alternative label: Chontal, Tabasco
definition: Yoko ochoco, also known as Chontal Maya, and Acalan, is a Maya language of the Cholan family spoken by the Chontal Maya people of the Mexican state of Tabasco. There are at least three dialects, identified as Tamulté de las Sábanas Chontal, Buena Vista Chontal, and Miramar Chontal.
in scheme: Lexvo - ISO 639-3 language codes
notation: chf
preferred label: Chontal-Maya-Sprache @de
preferred label: Idioma chontal de Tabasco @es
preferred label: Língua chontal maia @pt

Chagatai
type: Language
type: Concept
ISO 639-2 Bibliographical code: chg
ISO 639-2 Terminological code: chg
ISO 639-3 code: chg
alternative label: Chagatai language
alternative label: Tchaghataï @fr
alternative label: Tschagataische Sprache @de
alternative label: tchaghataï @fr
definition: The Chagatai language (جغتای – Jağatāy;Uzbek: چەغەتاي Chag'atoy; Uyghur: چاغاتاي Chāghātāy Turkish: Çağatayca) is an extinct Turkic language which was once widely spoken in Central Asia, and remained the shared literary language there until the early twentieth century. It was also spoken by the early Mughal rulers in the Indian subcontinent.
in scheme: Lexvo - ISO 639-3 language codes
notation: chg
preferred label: Tschagataisch @de
preferred label: chagatai @pt
preferred label: chagatái @es
preferred label: ciagataico @it
preferred label: djaghataï @fr

Chinook
type: Language
type: Concept
ISO 639-3 code: chh
alternative label: Lower Chinook
definition: Lower Chinook, also simple Chinook or Chinook proper, is a highly endangered language of the US Pacific Northwest.
in scheme: Lexvo - ISO 639-3 language codes
notation: chh

Ojitlán Chinantec
type: Language
type: Concept
ISO 639-3 code: chj
alternative label: Chinantec, Ojitlán
in scheme: Lexvo - ISO 639-3 language codes
notation: chj

Chuukese
type: Language
type: Concept
ISO 639-2 Bibliographical code: chk
ISO 639-2 Terminological code: chk
ISO 639-3 code: chk
alternative label: Chuuk @fr
alternative label: Chuukese language
alternative label: Chuukesische Sprache @de
preferred label: chuukese @pt
definition: Chuukese (also called Trukese) is a Trukic language of the Austronesian language family spoken primarily on the islands of Chuuk in the Caroline Islands in Micronesia. There are some speakers on Pohnpei and Guam as well. Estimates place the number of speakers at about 45,000 including second-language speakers.
in scheme: Lexvo - ISO 639-3 language codes
notation: chk
preferred label: Trukesisch @de
preferred label: chuuk @fr
preferred label: trukés @es

Cahuilla
type: Language
type: Concept
ISO 639-3 code: chl
alternative label: Cahuilla language
definition: Cahuilla is an endangered Uto-Aztecan language, spoken by the Cahuilla tribe, living in the Coachella Valley, San Gorgonio Pass and San Jacinto Mountain region of Southern California. Cahuilla call themselves Iviatam, speakers of Ivia - the original language. A 1990 census revealed 35 speakers in an ethnic population of 800. It is nearly extinct, since most speakers are middle-aged or older.
in scheme: Lexvo - ISO 639-3 language codes
notation: chl

Mari
type: Language
type: Concept
ISO 639-2 Bibliographical code: chm
ISO 639-2 Terminological code: chm
ISO 639-3 code: chm
alternative label: Idioma mari @es
alternative label: Lingua mari @it
alternative label: Língua mari @pt
alternative label: Mari (Russia)
alternative label: Mari language
alternative label: Tscheremissisch @de
preferred label: mari @it
definition: The Mari language (Mari: , marii jylme, ), spoken by more than 600,000 people, belongs to the Uralic language family. It is spoken primarily in the Mari Republic (Mari: , Marii El, i.e., Mari land) of the Russian Federation as well as in the area along the Vyatka river basin and eastwards to the Urals. Mari speakers, known as the Mari are found also in the Tatarstan, Udmurtia, and Perm regions.
in scheme: Lexvo - ISO 639-3 language codes
notation: chm
preferred label: marí @es

Chinook jargon
type: Language
type: Concept
ISO 639-2 Bibliographical code: chn
ISO 639-2 Terminological code: chn
ISO 639-3 code: chn
alternative label: Chinook Jargon
alternative label: Chinook Wawa @de
alternative label: chinook, jargon @fr
alternative label: jargon chinook @fr
alternative label: jargão chinook @pt
definition: Chinook Jargon (also known as chinuk wawa) originated as a pidgin trade language of the Pacific Northwest, and spread during the 19th century from the lower Columbia River, first to other areas in modern Oregon and Washington, then British Columbia and as far as Alaska, sometimes taking on characteristics of a creole language. It is related to, but not the same as, the aboriginal language of the Chinook people, upon which much of its vocabulary is based.
in scheme: Lexvo - ISO 639-3 language codes
notation: chn
preferred label: Chinook @de
preferred label: chinook jargon @pt
preferred label: gergo chinook @it
preferred label: jerga chinuk @es

Classical Armenian
type: Language
type: Concept
ISO 639-3 code: xcl
alternative label: Armenian, Classical
definition: Classical Armenian ( grabar, meaning "literary"; also Old Armenian or Liturgical Armenian) is the oldest attested form of the Armenian language. It was first written down at the beginning of the 5th century, and all Armenian literature from then through the 18th century is in the Grabar Armenian language. Many ancient Greek, Persian, Hebrew, Syriac, and Latin manuscripts survive only in their Armenian translation. Classical Armenian continues to be the liturgical language of the Armenian Apostolic Church and is often learned by Biblical, Intertestamental, and Patristic scholars dedicated to textual studies. Classical Armenian is also important for the reconstruction of the Proto-Indo-European language, since it preserves many archaic features.
in scheme: Lexvo - ISO 639-3 language codes
notation: xcl
preferred label: Altarmenische Sprache @de
preferred label: Arménien classique @fr
preferred label: Grabar @it

Choctaw
type: Language
type: Concept
ISO 639-2 Bibliographical code: cho
ISO 639-2 Terminological code: cho
ISO 639-3 code: cho
alternative label: Choctaw language
alternative label: Idioma choctaw @es
alternative label: Língua choctaw @pt
preferred label: choctaw @es
definition: The Choctaw language, traditionally spoken by the Native American Choctaw people of the southeastern United States, is a member of the Muskogean family. Although Chickasaw is sometimes listed as a dialect of Choctaw, more extensive documentation of Chickasaw has shown that Choctaw and Chickasaw are best treated as separate but closely related languages.
in scheme: Lexvo - ISO 639-3 language codes
notation: cho

Chipewyan
type: Language
type: Concept
ISO 639-2 Bibliographical code: chp
ISO 639-2 Terminological code: chp
ISO 639-3 code: chp
alternative label: Chipewyan language
alternative label: Dene Suline
alternative label: Idioma dene suliné @es
preferred label: chipewyan @es
definition: Dene Suline or Chipewyan (also Dëne Sųłiné, Dene Sųłiné, Dene Suliné, Dëne Suliné, Dene Soun’liné or just Dene) is the language spoken by the Chipewyan people of central Canada. It is categorized as part of the Northern Athabaskan language family. Dene Suline has over 11,000 speakers in Canada, mostly in Saskatchewan, Alberta and the Northwest Territories,
in scheme: Lexvo - ISO 639-3 language codes
notation: chp

Quiotepec Chinantec
type: Language
type: Concept
ISO 639-3 code: chq
alternative label: Chinantec, Quiotepec
in scheme: Lexvo - ISO 639-3 language codes
notation: chq

Cherokee
type: Language
type: Concept
ISO 639-2 Bibliographical code: chr
ISO 639-2 Terminological code: chr
ISO 639-3 code: chr
alternative label: Cherokee language
alternative label: Idioma cheroqui @es
alternative label: Lingua cherokee @it
alternative label: Língua cherokee @pt
definition: Cherokee (, Tsalagi Gawonihisdi) is an Iroquoian language spoken by the Cherokee people which uses a unique syllabary writing system. It is the only Southern Iroquoian language that remains spoken. Cherokee is a polysynthetic language.
in scheme: Lexvo - ISO 639-3 language codes
notation: chr
preferred label: cherokee @es

Cholón
type: Language
type: Concept
ISO 639-3 code: cht
alternative label: Cholón language
definition: Cholón, also known as Seeptsá and Tsinganeses, is a recently extinct language of Peru.
in scheme: Lexvo - ISO 639-3 language codes
notation: cht

Old Slavonic
type: Language
type: Concept
ISO 639-1 code: cu
ISO 639-2 Bibliographical code: chu
ISO 639-2 Terminological code: chu
ISO 639-3 code: chu
alternative label: Altkirchenslawische Sprache @de
alternative label: Antico slavo ecclesiastico @it
alternative label: Antigo eslavo eclesiástico @pt
alternative label: Antiguo eslavo eclesiástico @es
alternative label: Bulgarian, Old
alternative label: Church Slavic
alternative label: Church Slavonic
alternative label: Old Bulgarian
alternative label: Old Church Slavonic
alternative label: Slavic, Church
alternative label: Slavonic, Church
alternative label: Slavonic, Old
alternative label: Slavonic, Old Church
alternative label: slavon d'église @fr
alternative label: slavon d’église @fr
definition: Old Church Slavonic or Old Church Slavic (OCS) (, slověnĭskŭ językŭ) was the first literary Slavic language, developed by the 9th century Byzantine Greek missionaries Saints Cyril and Methodius who were credited with standardizing the language and using it for translating the Bible and other Ancient Greek ecclesiastical texts as part of the Christianisation of the Slavic peoples. It played an important role in the history of the Slavic languages and served as a basis and model for later Church Slavonic traditions, and some Eastern Orthodox and Eastern Catholic churches use Church Slavonic as a liturgical language to this day.
in scheme: Lexvo - ISO 639-3 language codes
notation: chu
preferred label: Kirchenslawisch @de
preferred label: Vieux-slave @fr
preferred label: eslavo eclesiástico @es
preferred label: slavo della Chiesa @it

Chuvash
type: Language
type: Concept
ISO 639-1 code: cv
ISO 639-2 Bibliographical code: chv
ISO 639-2 Terminological code: chv
ISO 639-3 code: chv
alternative label: Chuvash language
alternative label: Idioma chuvasio @es
alternative label: Lingua ciuvascia @it
alternative label: Língua tchuvache @pt
alternative label: Tchouvache @fr
alternative label: Tschuwaschische Sprache @de
definition: Chuvash (; ) is a Turkic language spoken in central Russia, primarily in the Chuvash Republic and adjacent areas. It is the only surviving member of the Oghur branch of Turkic languages.
in scheme: Lexvo - ISO 639-3 language codes
notation: chv
preferred label: Tschuwaschisch @de
preferred label: chuvash @es
preferred label: tchouvache @fr

Chuwabu
type: Language
type: Concept
ISO 639-3 code: chw
alternative label: Chuwabu language
definition: Chuwabo, also known as Cuabo and Txuwabo, is a Bantu language spoken along the central coast of Mozambique.
in scheme: Lexvo - ISO 639-3 language codes
notation: chw

Chantyal
type: Language
type: Concept
ISO 639-3 code: chx
alternative label: Chantyal language
definition: The Chantyal language is spoken by approximately 2,000 of the 10,000 ethnic Chantyal. The Chantyal live in the Baglung and Myagdi Districts of Nepal. The Chantyal language is a member of the Tamangic group (along with Gurung, Thakali, Manangba, Nar-Phu and Tamang) of the Tibeto-Burman family. Within the group, it is lexically and grammatically closest to Thakali.
in scheme: Lexvo - ISO 639-3 language codes
notation: chx

Cheyenne
type: Language
type: Concept
ISO 639-2 Bibliographical code: chy
ISO 639-2 Terminological code: chy
ISO 639-3 code: chy
alternative label: Cheyenne language
alternative label: Idioma cheyenne @es
alternative label: Lingua cheyenne @it
alternative label: Língua cheyenne @pt
preferred label: cheyenne @it
definition: The Cheyenne language (Tsėhesenėstsestotse or, in easier spelling, Tsisinstsistots) is a Native American language spoken by the Cheyenne people, predominantly in present-day Montana and Oklahoma in the United States. It is part of the Algonquian language family. Like all Algonquian languages, it has complex agglutinative morphology.
in scheme: Lexvo - ISO 639-3 language codes
notation: chy
preferred label: cheiene @pt
preferred label: cheyene @es

Ozumacín Chinantec
type: Language
type: Concept
ISO 639-3 code: chz
alternative label: Chinantec, Ozumacín
in scheme: Lexvo - ISO 639-3 language codes
notation: chz

Cia-Cia
type: Language
type: Concept
ISO 639-3 code: cia
alternative label: Cia-Cia language
definition: The Cia-Cia language (Roman: Bahasa Ciacia), also known as South Buton(ese), is an Austronesian language spoken principally around the town of Bau-Bau on the southern tip of Buton Island off the southeast coast of Sulawesi in Indonesia.
in scheme: Lexvo - ISO 639-3 language codes
notation: cia
preferred label: Cia-cia @fr
preferred label: Idima cia-cia @es
preferred label: Lingua cia-cia @it
preferred label: Língua cia-cia @pt

Ci Gbe
type: Language
type: Concept
ISO 639-3 code: cib
alternative label: Gbe, Ci
in scheme: Lexvo - ISO 639-3 language codes
notation: cib

Chicacha
type: Language
type: Concept
ISO 639-3 code: cic
alternative label: Chickasaw language
definition: The Chickasaw language (Chikashshanompa’, IPA ) is a Native American language of the Muskogean family. It is agglutinative and follows the pattern of subject–object–verb. The language is closely related to, though perhaps not entirely mutually intelligible with, Choctaw. It is spoken by the Chickasaw tribe, now residing in Southeast Oklahoma, centered around Ada.
in scheme: Lexvo - ISO 639-3 language codes
notation: cic
preferred label: Chickasaw

Comecrudo
type: Language
type: Concept
ISO 639-3 code: xcm
alternative label: Comecrudo language
definition: Comecrudo is an extinct Comecrudan language of Mexico. The name Comecrudo is Spanish for "eat-raw"; Carrizo is Spanish for "reed". It was best recorded in a list of 148 words in 1829 by French botanist Jean Louis Berlandier (Berlandier called it "Mulato") (Berlandier et al. 1828–1829). It was spoken on the lower Rio Grande near Reynosa, Tamaulipas, in Mexico.
in scheme: Lexvo - ISO 639-3 language codes
notation: xcm

Chimariko
type: Language
type: Concept
ISO 639-3 code: cid
alternative label: Chimariko language
definition: Chimariko is an extinct language isolate formerly spoken in Trinity County in northwestern California by Chimariko peoples.
in scheme: Lexvo - ISO 639-3 language codes
notation: cid
preferred label: Idioma chimariko @es

Cineni
type: Language
type: Concept
ISO 639-3 code: cie
alternative label: Cineni language
definition: Cineni is an Afro-Asiatic language spoken in Borno State, Nigeria in the single village of Cineni.
in scheme: Lexvo - ISO 639-3 language codes
notation: cie

Chinali
type: Language
type: Concept
ISO 639-3 code: cih
in scheme: Lexvo - ISO 639-3 language codes
notation: cih

Chitkuli Kinnauri
type: Language
type: Concept
ISO 639-3 code: cik
alternative label: Kinnauri, Chitkuli
in scheme: Lexvo - ISO 639-3 language codes
notation: cik

Cimbrian
type: Language
type: Concept
ISO 639-3 code: cim
alternative label: Cimbrian language
definition: Cimbrian ( or ; ) refers to any of several local Upper German varieties spoken in northeastern Italy. The speakers of the language are known as Zimbern.
in scheme: Lexvo - ISO 639-3 language codes
notation: cim
preferred label: Cimbre @fr
preferred label: Lingua cimbra @it
preferred label: Zimbrisch @de

Cinta Larga
type: Language
type: Concept
ISO 639-3 code: cin
alternative label: Cinta Larga language
definition: Cinta Larga is a Tupian dialect cluster of Brazil, the largest language of the Monde branch.
in scheme: Lexvo - ISO 639-3 language codes
notation: cin

Chiapanec
type: Language
type: Concept
ISO 639-3 code: cip
alternative label: Chiapanec language
definition: Chiapanec is the name of an indigenous Mexican language of the Oto-Manguean language family. The 1990 census reported 17 speakers of the language in southern Chiapas out of an ethnic population of 32, but later investigations failed to find any speakers.
in scheme: Lexvo - ISO 639-3 language codes
notation: cip
preferred label: Idioma chiapaneco @es

Méa
type: Language
type: Concept
ISO 639-3 code: cir
alternative label: Haméa
alternative label: Tiri
in scheme: Lexvo - ISO 639-3 language codes
notation: cir

Chippewa
type: Language
type: Concept
ISO 639-3 code: ciw
alternative label: Chippewa language
definition: Chippewa (also known as Southwestern Ojibwa, Ojibwe, Ojibway, or Ojibwemowin) is an Algonquian language spoken from upper Michigan westward to North Dakota in the United States. It represents the southern component of the Ojibwe language. Its ISO-3 designation is "ciw".
in scheme: Lexvo - ISO 639-3 language codes
notation: ciw

Chaima
type: Language
type: Concept
ISO 639-3 code: ciy
in scheme: Lexvo - ISO 639-3 language codes
notation: ciy

Western Cham
type: Language
type: Concept
ISO 639-3 code: cja
alternative label: Cham, Western
in scheme: Lexvo - ISO 639-3 language codes
notation: cja

Chru
type: Language
type: Concept
ISO 639-3 code: cje
in scheme: Lexvo - ISO 639-3 language codes
notation: cje

Cotoname
type: Language
type: Concept
ISO 639-3 code: xcn
alternative label: Cotoname language
definition: Cotoname is an extinct language isolate spoken by Native Americans indigenous to the lower Rio Grande Valley of northeastern Mexico and extreme southern Texas (United States).
in scheme: Lexvo - ISO 639-3 language codes
notation: xcn
preferred label: Idioma cotoname @es

Upper Chehalis
type: Language
type: Concept
ISO 639-3 code: cjh
alternative label: Chehalis, Upper
in scheme: Lexvo - ISO 639-3 language codes
notation: cjh

Chamalal
type: Language
type: Concept
ISO 639-3 code: cji
alternative label: Chamalal language
definition: Chamalal is an Andic language of the Northeast Caucasian language family spoken in southwestern Dagestan, Russia by approximately 5,000 people, the Chamalals. It has three quite distinct dialects, Gadyri, Gakvari, and Gigatl.
in scheme: Lexvo - ISO 639-3 language codes
notation: cji

Chokwe
type: Language
type: Concept
ISO 639-3 code: cjk
alternative label: Chokwe language
definition: Chokwe is the Bantu language spoken by the Chokwe people of the Democratic Republic of the Congo, Angola and Zambia. It is recognized as a national language of Angola, where about 456,000 people spoke it as of 1991. Another half a million speakers lived in the Congo in 1990, and some 44,200 in Zambia as of 1986. Angola's Instituto de Línguas Nacionais (National Languages Institute) has established spelling rules for Chokwe with a view to facilitate and promote its use. It is used as a lingua franca in eastern Angola.
in scheme: Lexvo - ISO 639-3 language codes
notation: cjk
preferred label: Côkwe @pt
preferred label: Idioma chokwe @es
preferred label: Tchokwé @fr

Eastern Cham
type: Language
type: Concept
ISO 639-3 code: cjm
alternative label: Cham, Eastern
in scheme: Lexvo - ISO 639-3 language codes
notation: cjm

Chenapian
type: Language
type: Concept
ISO 639-3 code: cjn
in scheme: Lexvo - ISO 639-3 language codes
notation: cjn

Pajonal Ashéninka
type: Language
type: Concept
ISO 639-3 code: cjo
alternative label: Ashéninka Pajonal
definition: Ashéninka Pajonal is an American indigenous language of the Arawakan family spoken in Perú by native people in the Central Gran Pajonal area. All but a few of the 12,000 people in the ethnic group are fluent. Other names for Ashéninka Pajonal are Ashéninca, Atsiri, Pajonal, and lasty the largely pejorative term, Campa. Pajonal is an official language in Perú throughout the area in which it is spoken as all languages are in this nation. The literacy rate is 20% compared to 15% for second language Spanish. Pajonal is one of 5 related Ashéninka languages.
in scheme: Lexvo - ISO 639-3 language codes
notation: cjo

Cabécar
type: Language
type: Concept
ISO 639-3 code: cjp
alternative label: Cabécar language
definition: The Cabécar language is an indigenous American language of the Chibchan language family which is spoken in Costa Rica. Specifically, it is spoken in the inland Turrialba Region of the Cartago Province. According to Ethnologue there were only 8,840 Cabécar speakers in 2000 with 80% of these speakers being monolingual.
in scheme: Lexvo - ISO 639-3 language codes
notation: cjp

Shor
type: Language
type: Concept
ISO 639-3 code: cjs
alternative label: Shor language
definition: The Shor language (Шор тили) is a Turkic language spoken by about 10,000 people in the Kemerovo Province in south-central Siberia. In the history of the Turkic states and China, Shors played an important role, mostly connected with their offshoot Shatuo. Presently, not all ethnic Shors speak Shor, and the language suffered a decline from the late 1930s to the early 1990s. However, the dissolution of the Soviet Union brought about the Shor lingual revival. The language is now being taught at the Novokuznetsk branch of the Kemerovo State University.
in scheme: Lexvo - ISO 639-3 language codes
notation: cjs
preferred label: Chor @fr
preferred label: Língua shor @pt
preferred label: Schorische Sprache @de

Chuave
type: Language
type: Concept
ISO 639-3 code: cjv
in scheme: Lexvo - ISO 639-3 language codes
notation: cjv

Jin Chinese
type: Language
type: Concept
ISO 639-3 code: cjy
alternative label: Chinese, Jinyu
alternative label: Jinyu Chinese
definition: Jin , or Jinese, Jinhua or Jin-yu, is a subdivision of spoken Chinese. Its exact status is disputed among linguists; some prefer to classify it under Mandarin, while others set it apart as an independent branch.
in scheme: Lexvo - ISO 639-3 language codes
notation: cjy
preferred label: Chino jin @es
preferred label: Jin @de
preferred label: Jinyu @fr

Soranî
type: Language
type: Concept
ISO 639-3 code: ckb
alternative label: Central Kurdish
alternative label: Kurdish, Central
alternative label: Língua sorâni @pt
alternative label: Sorani Kurdish
alternative label: sorani @fr
alternative label: sorani curdo @pt
definition: Soranî ( Soranî ; also called Central Kurdish) is the name of a Kurdish language that is spoken in Iran and Iraq. Soranî is one of the main Kurdish languages, which are a branch of the Iranian languages.
in scheme: Lexvo - ISO 639-3 language codes
notation: ckb
preferred label: Sorani @de
preferred label: Sorâni curdo @pt
preferred label: curdo sorani @it
preferred label: kurdo central @es

Chak
type: Language
type: Concept
ISO 639-3 code: ckh
in scheme: Lexvo - ISO 639-3 language codes
notation: ckh

Cibak
type: Language
type: Concept
ISO 639-3 code: ckl
alternative label: Cibak language
definition: Cibak (Chibuk, Chibok, Chibbak, Chibbuk, Kyibaku, Kibbaku, Kikuk) is an Afro-Asiatic language spoken by about 100,000 people in Borno State, Nigeria.
in scheme: Lexvo - ISO 639-3 language codes
notation: ckl

Kaang Chin
type: Language
type: Concept
ISO 639-3 code: ckn
alternative label: Chin, Kaang
in scheme: Lexvo - ISO 639-3 language codes
notation: ckn

Chorasmian
type: Language
type: Concept
ISO 639-3 code: xco
alternative label: Khwarezmian language
definition: Khwarezmian, also known as Khwarazmian or Chorasmian, is the name of an extinct East Iranian language closely related to Sogdian. The language was spoken in the area of Khwarezm (Chorasmia), centered in the lower Amu Darya south of the Aral Sea (the northern part of the modern Republic of Uzbekistan, and the adjacent areas of Turkmenistan).
in scheme: Lexvo - ISO 639-3 language codes
notation: xco
preferred label: Chorasmien @fr
preferred label: Choresmische Sprache @de
preferred label: Lingua corasmia @it
preferred label: Língua corásmia @pt

Anufo
type: Language
type: Concept
ISO 639-3 code: cko
alternative label: Chakosi language
definition: Chakosi, or Anufo, is a Central Tano language spoken in Ghana, Togo, and Benin.
in scheme: Lexvo - ISO 639-3 language codes
notation: cko

Kajakse
type: Language
type: Concept
ISO 639-3 code: ckq
alternative label: Kajakse language
definition: Kajakse (also known as Kadjakse, Kajeske, Kujarke, Mini, Kawa Tadimini) is an Afro-Asiatic language spoken in eastern Chad.
in scheme: Lexvo - ISO 639-3 language codes
notation: ckq

Kairak
type: Language
type: Concept
ISO 639-3 code: ckr
in scheme: Lexvo - ISO 639-3 language codes
notation: ckr

Tayo
type: Language
type: Concept
ISO 639-3 code: cks
alternative label: Tayo language
definition: Tayo, also known as "patois de Saint-Louis", is a French-based Creole spoken in New Caledonia. It is the community language of one village, Saint-Louis, which is situated approximately 17 kilometres from the capital Noumea.
in scheme: Lexvo - ISO 639-3 language codes
notation: cks

Chukot
type: Language
type: Concept
ISO 639-3 code: ckt
alternative label: Chukchi language
definition: The Chukchi language (also known as Chukchee, Luoravetlan, Chukot and Chukcha; in its own language: ԓыгъоравэтԓьэн йиԓыйиԓ ) is a Palaeosiberian language spoken by Chukchi people in the easternmost extremity of Siberia, mainly in Chukotka Autonomous Okrug. According to the Russian Census of 2002, about 7,700 of the 15,700 Chukchi people speak Chukchi; knowledge of the Chukchi language is decreasing, and most Chukchis now speak the Russian language (fewer than 500 report not speaking Russian at all). Chukchi is closely related to Koryak, which is spoken by about half that number. The language together with Koryak, Kerek, Alutor and Itelmen forms the Chukotko-Kamchatkan language family.
in scheme: Lexvo - ISO 639-3 language codes
notation: ckt
preferred label: Idioma chucoto @es
preferred label: Lingua ciukcia @it
preferred label: Língua chukoto @pt
preferred label: Tchouktche @fr
preferred label: Tschuktschische Sprache @de

Koasati
type: Language
type: Concept
ISO 639-3 code: cku
alternative label: Koasati language
definition: Koasati (also Coushatta) is a Native American language of Muskogean origin. The language is spoken by the Coushatta people, most of whom live in Allen Parish north of the town of Elton, Louisiana, though a smaller number share a reservation near Livingston, Texas, with the Alabama people. In 1991, linguist Geoffrey Kimball estimated the number of speakers of the language at around 400 people, of whom approximately 350 live in Louisiana. The exact number of current speakers is unclear, but Coushatta Tribe officials claim that most tribe members over 20 speak Koasati. In 2007, the Coushatta Tribe of Louisiana, in collaboration with McNeese State University and the College of William and Mary, began the Koasati (Coushatta) Language Project as a part of broader language revitalization efforts with National Science Foundation grant money under the Documenting Endangered Languages program.
in scheme: Lexvo - ISO 639-3 language codes
notation: cku
preferred label: Coushatta @de
preferred label: Língua koasati @pt

Kavalan
type: Language
type: Concept
ISO 639-3 code: ckv
alternative label: Kavalan language
definition: Kavalan (Kebalan) was formerly spoken in the Northeast coast area of Taiwan by the Kavalan people (噶瑪蘭). It is an East Formosan language of the Austronesian family.
in scheme: Lexvo - ISO 639-3 language codes
notation: ckv
preferred label: Lingua Kavalan @it

Caka
type: Language
type: Concept
ISO 639-3 code: ckx
in scheme: Lexvo - ISO 639-3 language codes
notation: ckx

Cakfem-Mushere
type: Language
type: Concept
ISO 639-3 code: cky
alternative label: Cakfem-Mushere language
definition: Cakfem-Mushere is an Afro-Asiatic language spoken in Plateau State, Nigeria. Dialects are Kadim-Kaban and Jajura.
in scheme: Lexvo - ISO 639-3 language codes
notation: cky

Cakchiquel-Quiché Mixed Language
type: Language
type: Concept
ISO 639-3 code: ckz
in scheme: Lexvo - ISO 639-3 language codes
notation: ckz

Ron
type: Language
type: Concept
ISO 639-3 code: cla
alternative label: Ron language
definition: Ron (also known as Challa, Chala) is an Afro-Asiatic language spoken in Plateau State, Nigeria. Dialects include Bokkos, Daffo-Butura, Monguna.
in scheme: Lexvo - ISO 639-3 language codes
notation: cla

Chilcotin
type: Language
type: Concept
ISO 639-3 code: clc
alternative label: Chilcotin language
definition: Chilcotin (also Tsilhqot’in, Tsilhqut’in, Tzilkotin) is a Northern Athabaskan language spoken in British Columbia by the Tsilhqot’in people.
in scheme: Lexvo - ISO 639-3 language codes
notation: clc

Chaldean Neo-Aramaic
type: Language
type: Concept
ISO 639-3 code: cld
alternative label: Neo-Aramaic, Chaldean
in scheme: Lexvo - ISO 639-3 language codes
notation: cld

Lealao Chinantec
type: Language
type: Concept
ISO 639-3 code: cle
alternative label: Chinantec, Lealao
in scheme: Lexvo - ISO 639-3 language codes
notation: cle

Chilisso
type: Language
type: Concept
ISO 639-3 code: clh
alternative label: Chilisso language
definition: Chilisso is a Dardic language in the Kohistani language group spoken by about 2,300 people in eastern Kohistan.
in scheme: Lexvo - ISO 639-3 language codes
notation: clh

Carian
type: Language
type: Concept
ISO 639-3 code: xcr
alternative label: Carian language
definition: The Carian language is an extinct language of the Luwian subgroup of the Anatolian branch of the Indo-European language family. The Carian language was spoken in Caria, a region of western Anatolia between the ancient regions of Lycia and Lydia, by the Carians, a name possibly first mentioned in Hittite sources. Prior to the late 20th century CE the language remained a total mystery even though many characters of the script appeared to be from Greek alphabet. Using Greek phonetic values of letters investigators of the 19th and 20th centuries were unable to make headway and classified the language as non-Indo-European. Speculations multiplied, none very substantial. Progress finally came as a result of rejecting the presumption of Greek phonetic values.
in scheme: Lexvo - ISO 639-3 language codes
notation: xcr
preferred label: Carien @fr
preferred label: Karische Sprache @de
preferred label: Lingua caria @it

Chakali
type: Language
type: Concept
ISO 639-3 code: cli
in scheme: Lexvo - ISO 639-3 language codes
notation: cli

Laitu Chin
type: Language
type: Concept
ISO 639-3 code: clj
alternative label: Chin, Laitu
in scheme: Lexvo - ISO 639-3 language codes
notation: clj

Idu-Mishmi
type: Language
type: Concept
ISO 639-3 code: clk
alternative label: Idu Mishmi language
definition: The Idu Mishmi Language (Chinese: 义都语; Hanyu Pinyin: yìdōuyŭ) is a small language spoken by the Mishmi people in the Dibang Valley District of the Indian state of Arunachal Pradesh and in Southeastern Tibet. There are 8,569 speakers in India as of 1981 and 7,000 speakers in China as of 1994. It is considered an endangered language.
in scheme: Lexvo - ISO 639-3 language codes
notation: clk

Chala
type: Language
type: Concept
ISO 639-3 code: cll
in scheme: Lexvo - ISO 639-3 language codes
notation: cll

Clallam
type: Language
type: Concept
ISO 639-3 code: clm
alternative label: Klallam language
definition: Klallam or Clallam (native name: ) is a nearly extinct Straits Salishan language that was traditionally spoken by the Klallam peoples at Beecher Bay on Vancouver Island in British Columbia and across the Strait of Juan de Fuca on the north coast of the Olympic Peninsula in Washington. Today it has only 4 remaining native speakers, though revival efforts exist.
in scheme: Lexvo - ISO 639-3 language codes
notation: clm
preferred label: Klallam @fr

Huamelultec language
type: Language
type: Concept
ISO 639-3 code: clo
alternative label: Chontal, Lowland Oaxaca
alternative label: Lowland Oaxaca Chontal
definition: Huamelultec, also known as Huamelula Chontal, Lowland Oaxaca Chontal, and Chontal de la Costa de Oaxaca, is one of the Chontal languages of Oaxaca.
in scheme: Lexvo - ISO 639-3 language codes
notation: clo

Lautu Chin
type: Language
type: Concept
ISO 639-3 code: clt
alternative label: Chin, Lautu
in scheme: Lexvo - ISO 639-3 language codes
notation: clt

Caluyanun
type: Language
type: Concept
ISO 639-3 code: clu
alternative label: Caluyanon language
definition: Caluyanon (also spelled Caluyanun) is a dialect of the Kinaray-a language and spoken in the Caluya Islands, Antique in the Philippines. Most of its speakers use Hiligaynon as their second language.
in scheme: Lexvo - ISO 639-3 language codes
notation: clu

Chulym
type: Language
type: Concept
ISO 639-3 code: clw
alternative label: Chulym language
definition: Chulym , also known as Chulim, Chulym-Turkic, Küerik, Chulym Tatar or Melets Tatar (not to be confused with the Tatar language) is the language of the Chulyms. The name the people use to refer to themselves, and also to their language, is Ös, literally ‘self’ or ‘own’. It is also spoken by the Kacik (Kazik, Kuarik).
in scheme: Lexvo - ISO 639-3 language codes
notation: clw
preferred label: Idioma chulym @es
preferred label: Tchoulym @fr
preferred label: Tschulymische Sprache @de

Eastern Highland Chatino
type: Language
type: Concept
ISO 639-3 code: cly
alternative label: Chatino, Eastern Highland
in scheme: Lexvo - ISO 639-3 language codes
notation: cly

Maa
type: Language
type: Concept
ISO 639-3 code: cma
in scheme: Lexvo - ISO 639-3 language codes
notation: cma

Cerma
type: Language
type: Concept
ISO 639-3 code: cme
alternative label: Cerma language
definition: Cerma (Kirma) is a Gur language of Burkina Faso. The people are called Ciramba (< Cerma-ba) or Gouin (Gwe, Gwen).
in scheme: Lexvo - ISO 639-3 language codes
notation: cme

Classical Mongolian
type: Language
type: Concept
ISO 639-3 code: cmg
alternative label: Classical Mongolian language
alternative label: Mongolian, Classical
definition: Classical Mongolian is an extinct Mongolic language formerly used in Mongolia, China, and Russia. It is a standardized written language used in a number of written texts such as the translation of the Kanjur and Tanjur and several cronicles roughly between 1700 and 1900. The term is sometimes also used to refer to any language documents in Mongolian script that are neither Pre-classical nor modern Mongolian.
in scheme: Lexvo - ISO 639-3 language codes
notation: cmg
preferred label: Mongol clássico @pt

Emberá-Chamí
type: Language
type: Concept
ISO 639-3 code: cmi
alternative label: Chami language
definition: Chamí Emberá Chami is an Embera language of Colombia.
in scheme: Lexvo - ISO 639-3 language codes
notation: cmi
preferred label: Emberá chamí @fr

Classical Tibetan
type: Language
type: Concept
ISO 639-3 code: xct
alternative label: Tibetan, Classical
in scheme: Lexvo - ISO 639-3 language codes
notation: xct

Campalagian
type: Language
type: Concept
ISO 639-3 code: cml
in scheme: Lexvo - ISO 639-3 language codes
notation: cml

Michigamea
type: Language
type: Concept
ISO 639-3 code: cmm
in scheme: Lexvo - ISO 639-3 language codes
notation: cmm

Chinese
type: Language
type: Concept
ISO 639-3 code: cmn
alternative label: Chinese, Mandarin
alternative label: Chino mandarín @es
alternative label: Hochchinesisch @de
alternative label: Lingua cinese mandarino @it
alternative label: Língua mandarim @pt
alternative label: Mandarin @fr
alternative label: Mandarin Chinese
alternative label: Mandarin language
definition: In Chinese linguistics, Mandarin refers to a group of related varieties or dialects spoken across most of northern and southwestern China. Because most Mandarin dialects are found in the north, the group is also referred to, particularly among Chinese speakers, as the "northern dialect(s)" . A northeastern-dialect speaker and a southwestern-dialect speaker can hardly communicate except through the standard language, mainly because of the differences in tone. Nonetheless, the variation within Mandarin is less significant than the much greater variation found within several other varieties of Chinese, and this is thought to be due to a relatively recent spread of Mandarin across China, combined with a greater ease of travel and communication compared to the more mountainous south of China.
in scheme: Lexvo - ISO 639-3 language codes
notation: cmn
preferred label: Chinesisch @de
preferred label: chino @es
preferred label: chinois @fr
preferred label: chinês @pt
preferred label: cinese @it

Central Mnong
type: Language
type: Concept
ISO 639-3 code: cmo
alternative label: Mnong, Central
in scheme: Lexvo - ISO 639-3 language codes
notation: cmo

Mro language
type: Language
type: Concept
ISO 639-3 code: cmr
alternative label: Chin, Mro-Khimi
alternative label: Mro-Khimi Chin
definition: Mro, also Mro-Khimi or Mro Chin, is a Kukish language of Burma.
in scheme: Lexvo - ISO 639-3 language codes
notation: cmr

Messapic
type: Language
type: Concept
ISO 639-3 code: cms
alternative label: Messapian language
definition: Messapian (also known as Messapic) is an extinct Indo-European language of South-eastern Italy, once spoken in the region of Apulia. It was spoken by the three Iapygian tribes of the region: the Messapians, the Dauni and the Peucetii.
in scheme: Lexvo - ISO 639-3 language codes
notation: cms
preferred label: Idioma mesapio @es
preferred label: Lingua messapica @it
preferred label: Messapien @fr
preferred label: Messapische Sprache @de

Camtho
type: Language
type: Concept
ISO 639-3 code: cmt
in scheme: Lexvo - ISO 639-3 language codes
notation: cmt

Changthang
type: Language
type: Concept
ISO 639-3 code: cna
in scheme: Lexvo - ISO 639-3 language codes
notation: cna

Curonian
type: Language
type: Concept
ISO 639-3 code: xcu
alternative label: Curonian language
definition: The Curonian language (; ; ) or Old Curonian is an extinct language of uncertain origin spoken by the Curonian tribe, who lived mainly on the Courland peninsula (now western Latvia) and along the nearby Baltic shores.
in scheme: Lexvo - ISO 639-3 language codes
notation: xcu
preferred label: Curonien @fr
preferred label: Kurische Sprache @de
preferred label: Lingua curlandese @it
preferred label: Língua curônia @pt

Chinbon Chin
type: Language
type: Concept
ISO 639-3 code: cnb
alternative label: Chin, Chinbon
in scheme: Lexvo - ISO 639-3 language codes
notation: cnb

Côông
type: Language
type: Concept
ISO 639-3 code: cnc
in scheme: Lexvo - ISO 639-3 language codes
notation: cnc

Northern Qiang
type: Language
type: Concept
ISO 639-3 code: cng
alternative label: Northern Qiang language
alternative label: Qiang, Northern
definition: Northern Qiang is a Qiangic language of the Tibeto-Burman language family spoken by approximately 130,000 people in north-central Sichuan Province, China.
in scheme: Lexvo - ISO 639-3 language codes
notation: cng
preferred label: Qiang @fr

Haka Chin
type: Language
type: Concept
ISO 639-3 code: cnh
alternative label: Chin, Haka
alternative label: Hakha-Chin language
definition: Hakha Chin (Baungshe, Lai) is a language spoken in southern Asia by 446,264 people. The total figure includes 2,000 Zokhua, and 60,100 Lai speakers. The speakers are largely concentrated in eastern India in addition to Burma with a small amount of speakers in Bangladesh in South Asia and northwestern Southeast Asian region.
in scheme: Lexvo - ISO 639-3 language codes
notation: cnh

Asháninka
type: Language
type: Concept
ISO 639-3 code: cni
alternative label: Asháninka language
definition: Asháninka is an Arawakan language spoken by the Asháninca people along the Apurímac, Ene, Perené, and Tambo Rivers and tributaries in Perú. Their ethnic group numbers from 25,000 to 30,000. Many of them still speak their native tongue.
in scheme: Lexvo - ISO 639-3 language codes
notation: cni
preferred label: Idioma asháninca @es

Khumi Chin
type: Language
type: Concept
ISO 639-3 code: cnk
alternative label: Chin, Khumi
in scheme: Lexvo - ISO 639-3 language codes
notation: cnk

Lalana Chinantec
type: Language
type: Concept
ISO 639-3 code: cnl
alternative label: Chinantec, Lalana
in scheme: Lexvo - ISO 639-3 language codes
notation: cnl

Con
type: Language
type: Concept
ISO 639-3 code: cno
alternative label: Con language
definition: Con is a language spoken by some 1,000 people in Louang Namtha Province in north-west Laos. Its nearest relative is the more populous Lamet language.
in scheme: Lexvo - ISO 639-3 language codes
notation: cno
preferred label: Idioma con @es

Central Asmat
type: Language
type: Concept
ISO 639-3 code: cns
alternative label: Asmat, Central
in scheme: Lexvo - ISO 639-3 language codes
notation: cns

Tepetotutla Chinantec
type: Language
type: Concept
ISO 639-3 code: cnt
alternative label: Chinantec, Tepetotutla
in scheme: Lexvo - ISO 639-3 language codes
notation: cnt

Chenoua
type: Language
type: Concept
ISO 639-3 code: cnu
alternative label: Shenwa language
definition: Shenwa, also spelled Chenoua (autonym Haqbaylit̠), is the Berber language of Jebel Chenoua in Algeria, just west of Algiers near Tipasa and Cherchell. The speech of Jebel Chenoua proper is mutually comprehensible with that of the nearby Beni Menacer, and the two are thus treated as a single language. According to the Ethnologue (2004) (whose figure is taken from the , 2000), Shenwa has 4,764 speakers.
in scheme: Lexvo - ISO 639-3 language codes
notation: cnu
preferred label: Chenoui @fr

Ngawn Chin
type: Language
type: Concept
ISO 639-3 code: cnw
alternative label: Chin, Ngawn
in scheme: Lexvo - ISO 639-3 language codes
notation: cnw

Middle Cornish
type: Language
type: Concept
ISO 639-3 code: cnx
alternative label: Cornish, Middle
in scheme: Lexvo - ISO 639-3 language codes
notation: cnx

Cocos Islands Malay
type: Language
type: Concept
ISO 639-3 code: coa
alternative label: Malay, Cocos Islands
definition: Cocos Islands Malay is a variety of Malay, spoken by the Cocos Malays of Home Island, which amounts to around 500, and those originally from the Cocos Islands currently living in Sabah.
in scheme: Lexvo - ISO 639-3 language codes
notation: coa

Choapan Zapotec
type: Language
type: Concept
ISO 639-3 code: zpc
alternative label: Zapotec, Choapan
in scheme: Lexvo - ISO 639-3 language codes
notation: zpc

Chicomuceltec
type: Language
type: Concept
ISO 639-3 code: cob
alternative label: Chicomuceltec language
definition: Chicomuceltec (also Chikomuselteko or Chicomucelteco; archaically, Cotoque) is a Mayan language formerly spoken in the region defined by the municipios of Chicomuselo, Mazapa de Madero, and Amatenango de la Frontera in Chiapas, Mexico, as well as some nearby areas of Guatemala. By the 1970s-80s it had become extinct, with recent reports in Mayanist literature finding that there are no living native speakers. Communities of contemporary Chicomucelteco descendants, numbering approximately 1500 persons in Mexico and 100 in Guatemala are Spanish-speakers.
in scheme: Lexvo - ISO 639-3 language codes
notation: cob
preferred label: Língua chicomucelteca @pt

Chuvantsy
type: Language
type: Concept
ISO 639-3 code: xcv
in scheme: Lexvo - ISO 639-3 language codes
notation: xcv

Cocopa
type: Language
type: Concept
ISO 639-3 code: coc
alternative label: Cocopah language
definition: Cocopah is a Delta language of the Yuman language family spoken by the Cocopah. It is still being learned by children.
in scheme: Lexvo - ISO 639-3 language codes
notation: coc
preferred label: Idioma cucapá @es

Cocama language
type: Language
type: Concept
ISO 639-3 code: cod
preferred label: Cocama-Cocamilla
definition: Cocama (Kokáma) is an indigenous language spoken by thousands of native people in western South America. It is spoken along the banks of the Northeastern lower Ucayali, lower Marañón, and Huallaga rivers and in neighboring areas of Brazil and an isolated area in Colombia. There are three dialects. The robust dialect is known as Cocama, Kokama, Ucayali, Xibitaoan, Huallaga, Pampadeque, and Pandequebo. As of 1999, Cocamilla (Kokamíya) was moribund, being only spoken by people over 40. Omagua (Omáwa) of Peru is reported to be extinct by Aikhenvald 1999,
in scheme: Lexvo - ISO 639-3 language codes
notation: cod
preferred label: Cocama @de
preferred label: Idioma cocama-cocamilla @es
preferred label: Língua cocama @pt

Koreguaje
type: Language
type: Concept
ISO 639-3 code: coe
in scheme: Lexvo - ISO 639-3 language codes
notation: coe

Colorado
type: Language
type: Concept
ISO 639-3 code: cof
alternative label: Tsáchila language
definition: Tsafiki, also known as Tsáchila or Colorado, is a Barbacoan language spoken in Ecuador by ca. 2000 ethnic Tsáchila people.
in scheme: Lexvo - ISO 639-3 language codes
notation: cof
preferred label: Idioma tsafiki @es
preferred label: Tsafiki @it
preferred label: Tsafiqui @fr

Chong
type: Language
type: Concept
ISO 639-3 code: cog
alternative label: Chong language
definition: Chong, or more specifically Western Chong (also spelled Chawng, Shong, Xong), is an endangered language spoken in Cambodia and southeastern Thailand. It is a Western Pearic language in the Eastern Mon–Khmer language family branch. Chong is currently the focus of a language revitalization project in Thailand.
in scheme: Lexvo - ISO 639-3 language codes
notation: cog

Chonyi-Dzihana-Kauma
type: Language
type: Concept
ISO 639-3 code: coh
alternative label: Chichonyi-Chidzihana-Chikauma
in scheme: Lexvo - ISO 639-3 language codes
notation: coh

Cochimi
type: Language
type: Concept
ISO 639-3 code: coj
alternative label: Cochimí language
definition: Cochimí was once the language of the greater part Baja California, as attested by Jesuit documents of the 18th century. It seems to have become extinct around the beginning of the 20th century. There were two main dialects, northern and southern; the dividing line was approximately at the Misión San Ignacio Kadakaamán, in the north of present-day Baja California Sur.
in scheme: Lexvo - ISO 639-3 language codes
notation: coj
preferred label: Idioma cochimí laymón @es

Coahuilteco
type: Language
type: Concept
ISO 639-3 code: xcw
alternative label: Coahuilteco language
definition: Coahuilteco (also Pajalate) was a language isolate that was spoken in southern Texas (United States) and northeastern Coahuila (Mexico). It was spoken by one tribe of a group of American Indian hunter-gatherers named the Quems.
in scheme: Lexvo - ISO 639-3 language codes
notation: xcw
preferred label: Coahuiltekisch @de
preferred label: Idioma coahuilteco @es

Santa Teresa Cora
type: Language
type: Concept
ISO 639-3 code: cok
alternative label: Cora, Santa Teresa
in scheme: Lexvo - ISO 639-3 language codes
notation: cok

Columbia-Wenatchi
type: Language
type: Concept
ISO 639-3 code: col
alternative label: Columbia-Moses language
definition: Columbia-Moses, or Columbia-Wenatchi, is a Southern Interior Salish language, also known as Nxaảmxcín. Speakers currently reside on the Colville Indian Reservation
in scheme: Lexvo - ISO 639-3 language codes
notation: col
preferred label: Moses-columbia salish @fr

Comanche
type: Language
type: Concept
ISO 639-3 code: com
alternative label: Comanche language
definition: Comanche is a Uto-Aztecan language spoken by the Comanche people, who split off from the Shoshone soon after they acquired horses in around 1705. The Comanche language and the Shoshoni language are therefore quite similar, although certain low-level consonant changes in Comanche have inhibited mutual intelligibility.
in scheme: Lexvo - ISO 639-3 language codes
notation: com
preferred label: Idioma comanche @es
preferred label: Língua comanche @pt

Cofán
type: Language
type: Concept
ISO 639-3 code: con
alternative label: Cofán language
definition: The Cofán language (also Kofan or Kofane; autonym: A'ingae) is the language of the Cofán people, an indigenous group native to Napo Province northeast Ecuador and southern Colombia, between the Guamués River (a tributary of the Putumayo River) and the Aguarico River (a tributary of the Napo River).
in scheme: Lexvo - ISO 639-3 language codes
notation: con
preferred label: Idioma cofán @es
preferred label: Língua cofán @pt

Comox
type: Language
type: Concept
ISO 639-3 code: coo
alternative label: Comox language
definition: Comox, also known as K'omoks, is a Coast Salish language historically spoken in the northern Georgia Strait region, spanning the east coast of Vancouver Island and the northern Sunshine Coast and adjoining inlets and islands. It has two main dialects, Island Comox, associated with the Comox Indian Band, and Mainland Comox, associated with the Sliammon, Klahoose and Homalhco peoples.
in scheme: Lexvo - ISO 639-3 language codes
notation: coo

Coptic
type: Language
type: Concept
ISO 639-2 Bibliographical code: cop
ISO 639-2 Terminological code: cop
ISO 639-3 code: cop
alternative label: Coptic language
alternative label: Idioma copto @es
alternative label: Koptische Sprache @de
alternative label: Lingua copta @it
alternative label: Língua copta @pt
alternative label: copte @fr
definition: Coptic or Coptic Egyptian ( Met Remenkēmi) is the current stage of the Egyptian language, a northern Afro-Asiatic language spoken in Egypt until at least the 17th century. Egyptian began to be written using the Greek alphabet in the 1st century. The new writing system became the Coptic script, an adapted Greek alphabet with the addition of six or seven signs from the demotic script to represent Egyptian sounds the Greek language did not have. Several distinct Coptic dialects are identified, the most prominent of which are Sahidic and Bohairic.
in scheme: Lexvo - ISO 639-3 language codes
notation: cop
preferred label: Copte @fr
preferred label: Koptisch @de
preferred label: copta @pt
preferred label: copto @es

Coquille
type: Language
type: Concept
ISO 639-3 code: coq
in scheme: Lexvo - ISO 639-3 language codes
notation: coq

Cornish
type: Language
type: Concept
ISO 639-1 code: kw
ISO 639-2 Bibliographical code: cor
ISO 639-2 Terminological code: cor
ISO 639-3 code: cor
alternative label: Cornique @fr
alternative label: Cornish language
alternative label: Idioma córnico @es
alternative label: Kornische Sprache @de
alternative label: Lingua cornica @it
alternative label: Língua córnica @pt
definition: Cornish (Kernowek or Kernewek) is a Brythonic Celtic language and a recognised minority language of the United Kingdom. Along with Welsh and Breton, it is directly descended from the ancient British language spoken throughout much of Britain before the English language came to dominate. The language continued to function as a common community language in parts of Cornwall until the late 18th century. Some children used the language to converse in, and families used it as a language of the home through the 19th century and possibly into the 20th. Some elderly speakers were known to be still living into the 20th century including one still alive in 1914. A process to revive the language was started in the early 20th century, continuing to this day.
in scheme: Lexvo - ISO 639-3 language codes
notation: cor
preferred label: Kornisch @de
preferred label: cornico @it
preferred label: cornique @fr
preferred label: córnico @es

Corsican
type: Language
type: Concept
ISO 639-1 code: co
ISO 639-2 Bibliographical code: cos
ISO 639-2 Terminological code: cos
ISO 639-3 code: cos
alternative label: córsico @pt
in scheme: Lexvo - ISO 639-3 language codes
notation: cos
preferred label: Korsisch @de
preferred label: corse @fr
preferred label: corso @es

Caquinte
type: Language
type: Concept
ISO 639-3 code: cot
alternative label: Caquinte language
definition: Caquinte (Caquinte Campa), also Poyenisati, is an Arawakan language of Peru. It is spoken along the Poyeni, Mayapo, Picha, Yori, and Agueni rivers, with some speakers along parts of the Sensa and Vitiricaya rivers.
in scheme: Lexvo - ISO 639-3 language codes
notation: cot
preferred label: Idioma caquinte @es

Coniagui
type: Language
type: Concept
ISO 639-3 code: cou
alternative label: Wamey language
definition: Wamey, or Konyagi (Conhague, Coniagui, Koniagui), is a Senegambian language of Senegal and Guinea.
in scheme: Lexvo - ISO 639-3 language codes
notation: cou
preferred label: Wamey

Cao Miao
type: Language
type: Concept
ISO 639-3 code: cov
in scheme: Lexvo - ISO 639-3 language codes
notation: cov

Cowlitz
type: Language
type: Concept
ISO 639-3 code: cow
alternative label: Cowlitz language
definition: The Cowlitz language is a member of the Tsamosan (Olympic) branch of the Coast Salish family of Salishan languages.
in scheme: Lexvo - ISO 639-3 language codes
notation: cow

Nanti
type: Language
type: Concept
ISO 639-3 code: cox
in scheme: Lexvo - ISO 639-3 language codes
notation: cox

Cayuse
type: Language
type: Concept
ISO 639-3 code: xcy
alternative label: Cayuse language
definition: The Cayuse language (Cailloux, Willetpoos) is an extinct language formerly spoken by the Cayuse Native American tribe in the U.S. state of Oregon. The Cayuse name for themselves was Liksiyu (see Aoki 1998).
in scheme: Lexvo - ISO 639-3 language codes
notation: xcy
preferred label: Idioma cayuse @es

Coyaima
type: Language
type: Concept
ISO 639-3 code: coy
in scheme: Lexvo - ISO 639-3 language codes
notation: coy

Chochotec
type: Language
type: Concept
ISO 639-3 code: coz
alternative label: Chocho language
definition: Chocho (also Chocholtec, Chocholteco Chochotec, Chochon, or Ngigua) is a language of the Popolocan branch of the Oto-Manguean linguistic family spoken in Mexico in the following communities of Oaxaca: Santa María Nativitas, San Juan Bautista Coixtlahuaca, San Miguel Tulancingo. Chocho is Spoken by 770 speakers (1998 Ethnologue Survey).
in scheme: Lexvo - ISO 639-3 language codes
notation: coz
preferred label: Chocho @fr
preferred label: Idioma chocho @es

Palantla Chinantec
type: Language
type: Concept
ISO 639-3 code: cpa
alternative label: Chinantec, Palantla
in scheme: Lexvo - ISO 639-3 language codes
notation: cpa

Ucayali–Yurúa Ashéninka
type: Language
type: Concept
ISO 639-3 code: cpb
alternative label: Ashéninka, Ucayali-Yurúa
alternative label: Ucayali-Yurúa Ashéninka
in scheme: Lexvo - ISO 639-3 language codes
notation: cpb

Axininca language
type: Language
type: Concept
ISO 639-3 code: cpc
alternative label: Ajyíninka Apurucayali
definition: Axininca (also Axininca Campa, Ajyíninka Apurucayali, Campa, Ashaninca, Ashéninca Apurucayali, Apurucayali Campa, Ajyéninka) is an Arawakan language spoken along the Apurucayali tributary of the Pachitea River in Peru.
in scheme: Lexvo - ISO 639-3 language codes
notation: cpc
preferred label: Idioma axininca @es

Cappadocian Greek
type: Language
type: Concept
ISO 639-3 code: cpg
alternative label: Cappadocian Greek language
alternative label: Greek, Cappadocian
definition: Cappadocian , also known as Cappadocian Greek or Asia Minor Greek, is a mixed language formerly spoken in Cappadocia (Central Turkey). In the population exchange between Greece and Turkey in the 1920s, Cappadocian speakers were forced to emigrate to Greece, where they were resettled in various locations, especially in Central and Northern Greece. The Cappadocians rapidly shifted to Standard Modern Greek and their language was thought to be extinct since the 1960s. In June 2005, Mark Janse (Ghent University) and Dimitris Papazachariou (University of Patras) discovered Cappadocians in Central and Northern Greece who could still speak their ancestral language fluently. Amongst them are middle-aged, third-generation speakers who take a very positive attitude towards the language as opposed to their parents and grandparents. The latter are much less inclined to speak Cappadocian and more often than not switch to Standard Modern Greek. A survey of Cappadocian speakers and language use is currently in preparation.
in scheme: Lexvo - ISO 639-3 language codes
notation: cpg
preferred label: Cappadocien @fr
preferred label: Kappadokische Sprache @de

Chinese Pidgin English
type: Language
type: Concept
ISO 639-3 code: cpi
alternative label: Pidgin English, Chinese
definition: Chinese Pidgin English is a Pidgin language between English and Chinese. From the 17th to the 19th centuries, there was also Chinese Pidgin English spoken in Cantonese-speaking portions of China. Chinese Pidgin English is heavily influenced by various Chinese languages with variants arising among different provinces (for example in Shanghai and Ningbo).
in scheme: Lexvo - ISO 639-3 language codes
notation: cpi

Cherepon
type: Language
type: Concept
ISO 639-3 code: cpn
alternative label: Cherepon language
definition: Cherepon (Chiripon, Chiripong, Kyerepong), or Okere, is a Guang language spoken by 111,000 in Ghana.
in scheme: Lexvo - ISO 639-3 language codes
notation: cpn

Kpeego
type: Language
type: Concept
in scheme: Lexvo - ISO 639-3 language codes

Capiznon
type: Language
type: Concept
ISO 639-3 code: cps
alternative label: Capiznon language
definition: Capiznon (Spanish: capiceño ) is an Austronesian language spoken in Western Visayas in the Philippines. Capiznon is concentrated in the province of Capiz in the northeast of Panay Island.
in scheme: Lexvo - ISO 639-3 language codes
notation: cps

Pichis Ashéninka
type: Language
type: Concept
ISO 639-3 code: cpu
alternative label: Ashéninka, Pichis
definition: Ashéninka Pichis is an indigenous American language spoken along Perú's Pichis river. There is a 30% literacy rate, it is an official language.
in scheme: Lexvo - ISO 639-3 language codes
notation: cpu

Pu-Xian Min
type: Language
type: Concept
ISO 639-3 code: cpx
alternative label: Chinese, Pu-Xian
alternative label: Pu-Xian Chinese
definition: Pu–Xian or Puxian Min , also known as Xinghua, is a branch of Min Chinese.
in scheme: Lexvo - ISO 639-3 language codes
notation: cpx
preferred label: Puxian @fr

Darkinyung
type: Language
type: Concept
in scheme: Lexvo - ISO 639-3 language codes

South Ucayali Ashéninka
type: Language
type: Concept
ISO 639-3 code: cpy
alternative label: Ashéninka, South Ucayali
in scheme: Lexvo - ISO 639-3 language codes
notation: cpy

Chuanqiandian Cluster Miao
type: Language
type: Concept
ISO 639-3 code: cqd
alternative label: Miao, Chuanqiandian Cluster
in scheme: Lexvo - ISO 639-3 language codes
notation: cqd

Chilean Quechua
type: Language
type: Concept
ISO 639-3 code: cqu
alternative label: Quechua, Chilean
definition: Chilean Quechua is Quechua as spoken in northern Chile. It may be South Bolivian Quechua.
in scheme: Lexvo - ISO 639-3 language codes
notation: cqu

Chara
type: Language
type: Concept
ISO 639-3 code: cra
alternative label: Chara language
definition: Chara (alternatively Ciara or C’ara) is an Afro-Asiatic language of the North Omotic variety spoken in the Southern Nations, Nationalities, and People's Region of Ethiopia by more than 13,000 people.
in scheme: Lexvo - ISO 639-3 language codes
notation: cra

Island Carib
type: Language
type: Concept
ISO 639-3 code: crb
alternative label: Carib, Island
alternative label: Island Carib language
definition: Island Carib, also known as Iñeri (Igñeri, Inyeri), was an Arawakan language of the Lesser Antilles related to Taíno. It went extinct about 1920, but survives in its daughter language Garifuna.
in scheme: Lexvo - ISO 639-3 language codes
notation: crb

Dacian
type: Language
type: Concept
ISO 639-3 code: xdc
alternative label: Dacian language
definition: The extinct Dacian language may have developed from Proto-Indo-European in the Carpathian region around 2,500 BC and probably died out by AD 600. In the 1st century AD, it was the predominant language of the ancient regions of Dacia and (probably) Moesia and, possibly, of some surrounding regions.
in scheme: Lexvo - ISO 639-3 language codes
notation: xdc
preferred label: Dace @fr
preferred label: Idioma dacio @es
preferred label: Lingua daca @it
preferred label: Língua dácia @pt

Lonwolwol
type: Language
type: Concept
ISO 639-3 code: crc
in scheme: Lexvo - ISO 639-3 language codes
notation: crc

Coeur d'Alene
type: Language
type: Concept
ISO 639-3 code: crd
alternative label: Coeur d'Alene language
definition: Coeur dAlene (Cœur dAlène) is a Salishan language spoken by only five of the 800 individuals in the Coeur dAlene Tribe on the Coeur dAlene Reservation in northern Idaho, United States. It is considered an endangered language.
in scheme: Lexvo - ISO 639-3 language codes
notation: crd
preferred label: Cœur d'Alène @fr

Cree
type: Language
type: Concept
ISO 639-1 code: cr
ISO 639-2 Bibliographical code: cre
ISO 639-2 Terminological code: cre
ISO 639-3 code: cre
alternative label: Cree language
alternative label: Idioma cree @es
alternative label: Lingua cree @it
alternative label: Língua cree @pt
preferred label: cree @es
definition: Cree (Nēhiyawēwin / ᓀᐦᐃᔭᐍᐏᐣ; also known as Cree–Montagnais, Cree–Montagnais–Naskapi) is an Algonquian language spoken by approximately 117,000 people across Canada, from the Northwest Territories and Alberta to Labrador, making it the aboriginal language with the highest number of speakers in Canada. Subject, Verb, and Object (SVO) in a sentence can vary in order, for example, SVO, VOS, OVS, and SOV.
in scheme: Lexvo - ISO 639-3 language codes
notation: cre
preferred label: Cri @fr

Caramanta
type: Language
type: Concept
ISO 639-3 code: crf
in scheme: Lexvo - ISO 639-3 language codes
notation: crf

Michif
type: Language
type: Concept
ISO 639-3 code: crg
alternative label: Michif language
definition: Michif (also Mitchif, Mechif, Michif-Cree, Métif, Métchif, French Cree) is the language of the Métis people of Canada and the United States, who are the descendants of First Nations women (mainly Cree, Nakota and Ojibwe) and fur trade workers of European ancestry (mainly French Canadians and Scottish Canadians). Nowadays Michif is spoken in scattered Métis communities in the provinces of Saskatchewan and Manitoba in Canada and in North Dakota in the U.S. There are some 230 speakers of Mitchif in the United States (down from 390 at the 1990 census ), most of whom live in North Dakota, particularly in the Turtle Mountain Indian Reservation. Michif emerged in the early 19th century as a mixed language (not to be confused with a creole), and adopted a consistent character between about 1820 and 1840.
in scheme: Lexvo - ISO 639-3 language codes
notation: crg
preferred label: Métchif @fr

Crimean Tatar
type: Language
type: Concept
ISO 639-2 Bibliographical code: crh
ISO 639-2 Terminological code: crh
ISO 639-3 code: crh
alternative label: Crimean Tatar language
alternative label: Crimean Turkish
alternative label: Krimtatarische Sprache @de
alternative label: Lingua tatara di Crimea @it
alternative label: Língua tártara da Crimeia @pt
alternative label: Tatar de Crimée @fr
alternative label: Tatar, Crimean
alternative label: Turkish, Crimean
alternative label: Tártaro de Crimea @es
alternative label: tatar de Crimé @fr
definition: The Crimean Tatar language is the language of the Crimean Tatars. It is a Turkic language spoken in Crimea, Central Asia (mainly in Uzbekistan), and the Crimean Tatar diasporas in Turkey, Romania, Bulgaria. It is not to be confused with the Tatar language.
in scheme: Lexvo - ISO 639-3 language codes
notation: crh
preferred label: Krimtatarisch @de
preferred label: turc de Crimée @fr
preferred label: turco crimeo @it
preferred label: turco da Crimeia @pt
preferred label: tártaro de Crimea @es

Sãotomense
type: Language
type: Concept
ISO 639-3 code: cri
alternative label: Forro language
definition: Forro is a Portuguese-based creole language spoken in São Tomé and Príncipe.
in scheme: Lexvo - ISO 639-3 language codes
notation: cri
preferred label: Criollo forro @es
preferred label: Forro @fr
preferred label: Lingua forro @it
preferred label: Saotomensische Sprache @de
preferred label: São-tomense @pt

Southern East Cree
type: Language
type: Concept
ISO 639-3 code: crj
alternative label: Cree, Southern East
in scheme: Lexvo - ISO 639-3 language codes
notation: crj

Plains Cree
type: Language
type: Concept
ISO 639-3 code: crk
alternative label: Cree, Plains
alternative label: Plains Cree language
definition: Plains Cree (native name: ) is a dialect of the Algonquian language, Cree, which is the most common Canadian indigenous language. Plains Cree is sometimes considered a dialect of the Cree-Montagnais language, or sometimes a dialect of the Cree language, distinct from the Montagnais language. Plains Cree is one of five main dialects of Cree in this second sense, along with Woods Cree, Swampy Cree, Moose Cree, and Atikamekw. Although no single dialect of Cree is favored over another, Plains Cree is the most widely used. Out of the 80 thousand speakers of the Cree language, the Plains Cree dialect is spoken by about 34,000 people primarily in Saskatchewan and Alberta but also in Manitoba and Montana. This number is diminishing as social pressures increase to use English, leaving many Cree children without a fluent command of Cree.
in scheme: Lexvo - ISO 639-3 language codes
notation: crk

Northern East Cree
type: Language
type: Concept
ISO 639-3 code: crl
alternative label: Cree, Northern East
in scheme: Lexvo - ISO 639-3 language codes
notation: crl

Moose Cree
type: Language
type: Concept
ISO 639-3 code: crm
alternative label: Cree, Moose
alternative label: Moose Cree language
definition: Moose Cree (also known as York Cree, West Shore Cree, West Main Cree) is an Algonquian language spoken in Ontario, Canada around the southern tip of James Bay.
in scheme: Lexvo - ISO 639-3 language codes
notation: crm

Cora language
type: Language
type: Concept
ISO 639-3 code: crn
alternative label: Cora, El Nayar
alternative label: El Nayar Cora
definition: The Cora language is an indigenous language of Mexico of the Uto-Aztecan language family. It is spoken by the ethnic group that is widely known as the Cora but who refer to themselves as Naáyarite. The Cora inhabit the northern sierra of the Mexican state Nayarit which is named after its indigenous inhabitants. Cora is a Mesoamerican language and shows many of the traits defining the Mesoamerican Linguistic Area. Under the "Law of Linguistic Rights" it is recognized as a "national language" along with 62 other indigenous languages and Spanish which have the same "validity" in Mexico .
in scheme: Lexvo - ISO 639-3 language codes
notation: crn
preferred label: Cora @fr
preferred label: Idioma cora @es

Crow
type: Language
type: Concept
ISO 639-3 code: cro
alternative label: Crow language
definition: Crow (native name: Apsáalookanq̌i ) is a Missouri Valley Siouan language spoken primarily by the Crow Nation in present-day southeastern Montana. It is has one of the larger populations of American Indian languages with 4,280 speakers according to the 1990 US Census.
in scheme: Lexvo - ISO 639-3 language codes
notation: cro

Iyo'wujwa Chorote
type: Language
type: Concept
ISO 639-3 code: crq
alternative label: Chorote, Iyo'wujwa
definition: Iyo'wujwa (Chorote) is a Mataco language spoken by about 2,000 people, mostly in Argentina where it is spoken by about 1,500 people; 50% of whom are monolingual.
in scheme: Lexvo - ISO 639-3 language codes
notation: crq

Carolina Algonquian
type: Language
type: Concept
ISO 639-3 code: crr
alternative label: Algonquian, Carolina
in scheme: Lexvo - ISO 639-3 language codes
notation: crr

Dharuk
type: Language
type: Concept
in scheme: Lexvo - ISO 639-3 language codes

Seychellois Creole
type: Language
type: Concept
ISO 639-3 code: crs
alternative label: Creole French, Seselwa
alternative label: Seselwa Creole French
definition: Seychellois Creole, also known as Kreol or Seselwa, is the French-based creole language of the Seychelles. It shares official language status with English and French (in contrast to Mauritian Creole, which has no official status in Mauritius).
in scheme: Lexvo - ISO 639-3 language codes
notation: crs
preferred label: Creolo delle Seychelles @it
preferred label: Criollo seychelense @es
preferred label: Crioulo de Seychelles @pt
preferred label: Créole seychellois @fr
preferred label: Seychellenkreol @de

Iyojwa'ja Chorote
type: Language
type: Concept
ISO 639-3 code: crt
alternative label: Chorote, Iyojwa'ja
alternative label: Iyojwa'ja Chorote language
definition: Eklenhui (Iyojwa'ja Chorote) is a language spoken in northeast Salta province in Argentina by 800.
in scheme: Lexvo - ISO 639-3 language codes
notation: crt

Chaura
type: Language
type: Concept
ISO 639-3 code: crv
alternative label: Chaura language
definition: Chaura, or Tutet, is one of the Nicobarese languages spoken on the Nicobar Islands.
in scheme: Lexvo - ISO 639-3 language codes
notation: crv

Chrau
type: Language
type: Concept
ISO 639-3 code: crw
alternative label: Chrau language
definition: Chrau is a Bahnaric language spoken by some 22,000 people in southern Vietnam. Unlike most languages of Southeast Asia, Chrau has no lexical tone, though it does have significant sentence intonation.
in scheme: Lexvo - ISO 639-3 language codes
notation: crw

Carrier
type: Language
type: Concept
ISO 639-3 code: crx
in scheme: Lexvo - ISO 639-3 language codes
notation: crx

Edomite
type: Language
type: Concept
ISO 639-3 code: xdm
alternative label: Edomite language
definition: The Edomite language was a Canaanite language spoken by the Edomites in southwestern Jordan in the first millennium BC. It is known only from a very small corpus. In early times, it seems to have been written with a Canaanite alphabet; like the Moabite language, it retained feminine -t. However, in the 6th century BC, it adopted the Aramaic alphabet. Meanwhile, Aramaic or Arabic features such as whb ("gave") and tgr "merchant" entered the language, with whb becoming especially common in proper names.
in scheme: Lexvo - ISO 639-3 language codes
notation: xdm
preferred label: Língua edomita @pt

Cori
type: Language
type: Concept
ISO 639-3 code: cry
alternative label: Cori language
definition: The Cori (Chori) language is a minor Plateau language spoken in a single village in Kaduna State in Nigeria.
in scheme: Lexvo - ISO 639-3 language codes
notation: cry
preferred label: Chori @de

Cruzeño
type: Language
type: Concept
ISO 639-3 code: crz
in scheme: Lexvo - ISO 639-3 language codes
notation: crz

Chiltepec Chinantec
type: Language
type: Concept
ISO 639-3 code: csa
alternative label: Chinantec, Chiltepec
in scheme: Lexvo - ISO 639-3 language codes
notation: csa

Kashubian
type: Language
type: Concept
ISO 639-2 Bibliographical code: csb
ISO 639-2 Terminological code: csb
ISO 639-3 code: csb
alternative label: Cachoube @fr
alternative label: Idioma casubio @es
alternative label: Kaschubische Sprache @de
alternative label: Kashubian language
alternative label: Lingua casciuba @it
alternative label: Língua cassúbia @pt
definition: Kashubian or Cassubian (Kashubian: kaszëbsczi jãzëk, pòmòrsczi jãzëk, kaszëbskò-słowińskô mòwa; ) is one of the Lechitic languages, a subgroup of the Slavic languages.
in scheme: Lexvo - ISO 639-3 language codes
notation: csb
preferred label: Kaschubisch @de
preferred label: casubio @es
preferred label: kachoube @fr
preferred label: kashubian @it

Catalan Sign Language
type: Language
type: Concept
ISO 639-3 code: csc
alternative label: Lengua de señas catalana
preferred label: Llengua de Signes Catalana
definition: Catalan Sign Language (; ) is a sign language used by 18,000 signers in Catalonia. About 50% intelligibility by users of Spanish Sign Language.
in scheme: Lexvo - ISO 639-3 language codes
notation: csc
preferred label: Langue des signes catalane @fr
preferred label: Lengua de signos catalana @es
preferred label: Língua de sinais catalã @pt

Chiangmai Sign Language
type: Language
type: Concept
ISO 639-3 code: csd
in scheme: Lexvo - ISO 639-3 language codes
notation: csd

Czech Sign Language
type: Language
type: Concept
ISO 639-3 code: cse
in scheme: Lexvo - ISO 639-3 language codes
notation: cse

Cuba Sign Language
type: Language
type: Concept
ISO 639-3 code: csf
in scheme: Lexvo - ISO 639-3 language codes
notation: csf

Chilean Sign Language
type: Language
type: Concept
ISO 639-3 code: csg
definition: Chilean Sign Language is the deaf sign language of Chile's 7 deaf institutions.
in scheme: Lexvo - ISO 639-3 language codes
notation: csg
preferred label: Lenguaje de Señas Chileno @es
preferred label: Língua Gestual Chilena @pt

Asho Chin
type: Language
type: Concept
ISO 639-3 code: csh
alternative label: Chin, Asho
in scheme: Lexvo - ISO 639-3 language codes
notation: csh

Coast Miwok
type: Language
type: Concept
ISO 639-3 code: csi
alternative label: Miwok, Coast
in scheme: Lexvo - ISO 639-3 language codes
notation: csi

Songlai Chin
type: Language
type: Concept
alternative label: Chin, Songlai
in scheme: Lexvo - ISO 639-3 language codes

Malayic Dayak
type: Language
type: Concept
ISO 639-3 code: xdy
alternative label: Dayak, Malayic
in scheme: Lexvo - ISO 639-3 language codes
notation: xdy

Jola-Kasa
type: Language
type: Concept
ISO 639-3 code: csk
alternative label: Kasa language
definition: Kasa, or Jóola-Kaasa (also Bacuki, Casa, etc.) is a Jola language of the Casamance region of Senegal and neighboring Gambia.
in scheme: Lexvo - ISO 639-3 language codes
notation: csk

Chinese Sign Language
type: Language
type: Concept
ISO 639-3 code: csl
definition: Modern Chinese Sign Language (or CSL or ZGS; ) is the deaf sign language of the People's Republic of China. It is unrelated to Taiwanese Sign Language.
in scheme: Lexvo - ISO 639-3 language codes
notation: csl
preferred label: Língua de Sinais Chinesa @pt

Central Sierra Miwok
type: Language
type: Concept
ISO 639-3 code: csm
alternative label: Miwok, Central Sierra
in scheme: Lexvo - ISO 639-3 language codes
notation: csm

Colombian Sign Language
type: Language
type: Concept
ISO 639-3 code: csn
definition: Colombian Sign Language is the deaf sign language of Colombia.
in scheme: Lexvo - ISO 639-3 language codes
notation: csn
preferred label: Langue des signes colombienne @fr
preferred label: Língua de Sinais Colombiana @pt

Sochiapam Chinantec
type: Language
type: Concept
ISO 639-3 code: cso
alternative label: Chinantec, Sochiapam
alternative label: Chinantec, Sochiapan
alternative label: Sochiapan Chinantec
in scheme: Lexvo - ISO 639-3 language codes
notation: cso

Croatia Sign Language
type: Language
type: Concept
ISO 639-3 code: csq
alternative label: Croatian Sign Language
definition: Croatian sign language (Hrvatski znakovni jezik, HZJ ) is a sign language of the deaf community in Croatia. It is sometimes regarded as a dialect of Yugoslav Sign Language, although the dialectical diversity of the former Yugoslavia has not been assessed.
in scheme: Lexvo - ISO 639-3 language codes
notation: csq
preferred label: Língua de sinais croata @pt

Costa Rican Sign Language
type: Language
type: Concept
ISO 639-3 code: csr
in scheme: Lexvo - ISO 639-3 language codes
notation: csr

Southeastern Ixtlán Zapotec
type: Language
type: Concept
ISO 639-3 code: zpd
alternative label: Zapotec, Southeastern Ixtlán
in scheme: Lexvo - ISO 639-3 language codes
notation: zpd

Southern Ohlone
type: Language
type: Concept
ISO 639-3 code: css
alternative label: Ohlone, Southern
alternative label: Rumsen language
definition: Rumsen (also known as Rumsien, San Carlos Costanoan and Carmeleno) is one of eight language divisions of the Ohlone (Costanoan) Native American people of Northern California. The Rumsen language was spoken from the Pajaro River to Point Sur, and on the lower courses of the Pajaro, as well as on the Salinas and Carmel Rivers, and the region of the present-day cities of Salinas, Monterey and Carmel. One of eight languages within the Costanoan (alias Ohlone) branch of the Utian family, it became one of two important native languages spoken at the Mission San Carlos Borroméo de Carmelo founded in 1770, the other being Esselen.
in scheme: Lexvo - ISO 639-3 language codes
notation: css
preferred label: Rumsen @fr

Eblan
type: Language
type: Concept
ISO 639-3 code: xeb
alternative label: Eblaite language
definition: Eblaite (also known as Eblan ISO 639-3) is an extinct Semitic language, which was spoken in the 3rd millennium BC in the ancient city of Ebla, at Tell Mardikh (تل مرديخ), between Aleppo and Hama, in western modern Syria.
in scheme: Lexvo - ISO 639-3 language codes
notation: xeb
preferred label: Eblaitische Sprache @de
preferred label: Idioma eblaíta @es
preferred label: Língua eblaíta @pt
preferred label: Éblaïte @fr

Tamyen
type: Language
type: Concept
ISO 639-3 code: cst
alternative label: Northern Ohlone
alternative label: Ohlone, Northern
definition: The Tamyen (also spelled as Tamien, Thamien) are one of eight linguistic divisions of the Ohlone (Coastanoan) people groups of Native Americans who lived in Northern California. The Tamyen lived throughout the Santa Clara Valley. The use of the name Tamyen is on record as early as 1777, it comes from the Ohlone name for the location of the first Mission Santa Clara (Mission Santa Clara de Thamien) on the Guadalupe River. Father Pena mentioned in a letter to Junipero Serra that the area around the mission was called Thamien by the native people. The missionary fathers erected the mission on January 17, 1777 at the native village of So-co-is-u-ka.
in scheme: Lexvo - ISO 639-3 language codes
notation: cst

Sumtu Chin
type: Language
type: Concept
ISO 639-3 code: csv
alternative label: Chin, Sumtu
in scheme: Lexvo - ISO 639-3 language codes
notation: csv

Swampy Cree
type: Language
type: Concept
ISO 639-3 code: csw
alternative label: Cree, Swampy
alternative label: Swampy Cree language
definition: Swampy Cree (sometimes known as Maskekon or Omaškêkowak) is a dialect of the Algonquian language, Cree. Swampy Cree is spoken in a series of communities in northern Manitoba, central northeast of Saskatchewan along the Saskatchewan River and along the Hudson Bay coast and adjacent inland areas to the south and west, and Ontario along the coast of Hudson Bay and James Bay. It is one of the western n-dialects of Cree, meaning that for a particular variable phoneme common to all Cree, Swampy Cree shows the "n" variant (as opposed to y, r, l, or ð).
in scheme: Lexvo - ISO 639-3 language codes
notation: csw

Siyin Chin
type: Language
type: Concept
ISO 639-3 code: csy
alternative label: Chin, Siyin
in scheme: Lexvo - ISO 639-3 language codes
notation: csy

Coos
type: Language
type: Concept
ISO 639-3 code: csz
alternative label: Hanis language
definition: Hanis, or Coos, was one of two Coosan languages of Oregon, and the better documented. It was spoken north of the Miluk around the Coos River and Coos Bay. The há·nis was the Hanis name for themselves. The last speaker of Hanis was Martha Johnson, who died in 1972.
in scheme: Lexvo - ISO 639-3 language codes
notation: csz
preferred label: Hanis @fr

Tataltepec Chatino
type: Language
type: Concept
ISO 639-3 code: cta
alternative label: Chatino, Tataltepec
in scheme: Lexvo - ISO 639-3 language codes
notation: cta

Chetco
type: Language
type: Concept
ISO 639-3 code: ctc
in scheme: Lexvo - ISO 639-3 language codes
notation: ctc

Tedim Chin
type: Language
type: Concept
ISO 639-3 code: ctd
alternative label: Chin, Tedim
alternative label: Sukte language
definition: Sukte, commonly known as Tedim (Tiddim) or Tedim Chin, is a Kukish language of India and Burma.
in scheme: Lexvo - ISO 639-3 language codes
notation: ctd

Tepinapa Chinantec
type: Language
type: Concept
ISO 639-3 code: cte
alternative label: Chinantec, Tepinapa
in scheme: Lexvo - ISO 639-3 language codes
notation: cte

Chittagonian
type: Language
type: Concept
ISO 639-3 code: ctg
alternative label: Chittagonian language
definition: Chittagonian (চাটগাঁইয়া বুলি Chaţgãia Buli) is an Indo-Aryan language spoken by the people of Chittagong in Bangladesh and in much of the southeast of the country. It is closely related to Bangla, but is normally considered by linguists to be a separate language rather than a dialect of Bangla. It is estimated to have 14 million speakers, United States and other countries. According to the status of Top 100 Languages by Population by Ethnologue, Chittagong ranked 67th of the world.
in scheme: Lexvo - ISO 639-3 language codes
notation: ctg
preferred label: Chittagonien @fr

Thaiphum Chin
type: Language
type: Concept
ISO 639-3 code: cth
alternative label: Chin, Thaiphum
in scheme: Lexvo - ISO 639-3 language codes
notation: cth

Tlacoatzintepec Chinantec
type: Language
type: Concept
ISO 639-3 code: ctl
alternative label: Chinantec, Tlacoatzintepec
in scheme: Lexvo - ISO 639-3 language codes
notation: ctl

Chitimacha
type: Language
type: Concept
ISO 639-3 code: ctm
alternative label: Chitimacha language
definition: The Chitimacha language is a language isolate historically spoken by the Chitimacha people of Louisiana, United States. It went extinct in 1940 with the death of the last fluent speaker, Delphine Ducloux.
in scheme: Lexvo - ISO 639-3 language codes
notation: ctm
preferred label: Idioma chitimacha @es

Chhintange
type: Language
type: Concept
ISO 639-3 code: ctn
alternative label: Chintang language
definition: Chintang (Chintang: छिन्ताङ् Chintāṅ), also called Chhintang is an eastern Kiranti language spoken by 5,000 to 6,000 people in Chintang Village Development Committee (VDC) in Dhankuta District, Koshi Zone, Nepal.
in scheme: Lexvo - ISO 639-3 language codes
notation: ctn

Emberá-Catío
type: Language
type: Concept
ISO 639-3 code: cto
alternative label: Catio language
definition: Catío Emberá (Catío, Katío) is an indigenous American language spoken by the Embera people of Colombia and Panama.
in scheme: Lexvo - ISO 639-3 language codes
notation: cto
preferred label: Emberá catío @fr

Hdi
type: Language
type: Concept
ISO 639-3 code: xed
alternative label: Hdi language
definition: Hdi (Hedi, Xedi) is an Afro-Asiatic language of Cameroon and Nigeria.
in scheme: Lexvo - ISO 639-3 language codes
notation: xed

Western Highland Chatino
type: Language
type: Concept
ISO 639-3 code: ctp
alternative label: Chatino, Western Highland
in scheme: Lexvo - ISO 639-3 language codes
notation: ctp

Pandan Bikol language
type: Language
type: Concept
ISO 639-3 code: cts
alternative label: Bikol, Northern Catanduanes
alternative label: Northern Catanduanes Bikol
definition: Pandan Bikol or Northern Catanduanes Bicolano is one of the three groups of the Bikol languages. It is spoken in Pandan and northeastern portion of Catanduanes.
in scheme: Lexvo - ISO 639-3 language codes
notation: cts

Wayanad Chetti
type: Language
type: Concept
ISO 639-3 code: ctt
alternative label: Chetti, Wayanad
in scheme: Lexvo - ISO 639-3 language codes
notation: ctt

Chol
type: Language
type: Concept
ISO 639-3 code: ctu
alternative label: Ch’ol language
definition: Chol (or Chol) is a member of the western branch of the Mayan language family used by the Chol people in the Mexican state of Chiapas. There are two main dialects: *Chol of Tila spoken by 43,870 people of whom 10,000 are monolinguals in the villages of Tila, Vicente Guerrero, Chivalito and Limar in Chiapas. * Chol of Tumbalá spoken by 90,000 people of whom 30,000 are monolinguals in the villages of Tumbalá, Sabanilla, Misijá, Limar, Chivalita and Vicente Guerrero.
in scheme: Lexvo - ISO 639-3 language codes
notation: ctu
preferred label: Ch'ol @fr
preferred label: Chol-Sprache @de
preferred label: Idioma chol @es
preferred label: Lingua ch'ol @it
preferred label: Língua chol @pt

Zacatepec Chatino
type: Language
type: Concept
ISO 639-3 code: ctz
alternative label: Chatino, Zacatepec
in scheme: Lexvo - ISO 639-3 language codes
notation: ctz

Cua
type: Language
type: Concept
ISO 639-3 code: cua
alternative label: Cua language
definition: The Cua language (also known as Bòng Mieu) is a Mon–Khmer language spoken in the Quang Ngai and Quang Nam provinces of Vietnam. Cua dialects include Kol (Kor, Cor, Co, Col, Dot, Yot) and Traw (Tràu, Dong).
in scheme: Lexvo - ISO 639-3 language codes
notation: cua

Cubeo
type: Language
type: Concept
ISO 639-3 code: cub
alternative label: Cubeo language
definition: The Cubeo language (otherwise known as Cuveo, Hehenawa, Kobeua, Kobewa, Kubwa, or Pamiwa) is a SOV language spoken by the Cubeo people and is a member of the central branch of the Tukano language. It has many lexical loans from the Nadahup languages and has a grammar which was apparently influenced by Arawak. The language is spoken in the Vaupés department, Cuduyari, and Querarií rivers and tributaries of Columbia. It is also spoken in Brazil.
in scheme: Lexvo - ISO 639-3 language codes
notation: cub

Usila Chinantec
type: Language
type: Concept
ISO 639-3 code: cuc
alternative label: Chinantec, Usila
in scheme: Lexvo - ISO 639-3 language codes
notation: cuc

Cung
type: Language
type: Concept
ISO 639-3 code: cug
alternative label: Cung language
definition: Cung is an Eastern Beboid language of Cameroon.
in scheme: Lexvo - ISO 639-3 language codes
notation: cug

Chuka
type: Language
type: Concept
ISO 639-3 code: cuh
alternative label: Cuka language
alternative label: Gichuka
definition: Cuka, or Gichuka, is a Bantu language of Kenya. It has marginal intelligibility with Meru and Gikuyu.
in scheme: Lexvo - ISO 639-3 language codes
notation: cuh

Cuiba
type: Language
type: Concept
ISO 639-3 code: cui
alternative label: Cuiba language
definition: Cuiba is a Guahiban language that is spoken by about 2300 people in Colombia and additional 650 in Venezuela. More than half of Cuiba speakers are monoglot, and in Colombia there is a 45% literacy rate.
in scheme: Lexvo - ISO 639-3 language codes
notation: cui

//Xegwi
type: Language
type: Concept
ISO 639-3 code: xeg
alternative label: ǁXegwi language
definition: ǁXegwi, also known as Batwa, is an extinct ǃKwi language of South Africa, near the Swazi border. The last known speaker was killed in 1988.
in scheme: Lexvo - ISO 639-3 language codes
notation: xeg
preferred label: Lingua ǁxegwi @it

Mashco Piro
type: Language
type: Concept
ISO 639-3 code: cuj
in scheme: Lexvo - ISO 639-3 language codes
notation: cuj

San Blas Kuna
type: Language
type: Concept
ISO 639-3 code: cuk
alternative label: Kuna, San Blas
in scheme: Lexvo - ISO 639-3 language codes
notation: cuk

Kulina
type: Language
type: Concept
ISO 639-3 code: cul
preferred label: Culina
alternative label: Culina language
definition: Kulina (also Kulína, Kulyna, Culina, Curina, Corina, Korina, Culina-Madijá, Madijá, Madija, Madiha, Madihá) is an Arawan language of Brazil and Peru spoken by about 4,000 people.
in scheme: Lexvo - ISO 639-3 language codes
notation: cul
preferred label: Idioma culina @es

Cumeral
type: Language
type: Concept
ISO 639-3 code: cum
in scheme: Lexvo - ISO 639-3 language codes
notation: cum

Cumanagoto
type: Language
type: Concept
ISO 639-3 code: cuo
in scheme: Lexvo - ISO 639-3 language codes
notation: cuo

Cupeño
type: Language
type: Concept
ISO 639-3 code: cup
alternative label: Cupeño language
definition: Cupeño is an extinct Uto-Aztecan language, formerly spoken by the Cupeño people of Southern California, USA, who now speak English. Roscinda Nolasquez was the last native speaker of Cupeño.
in scheme: Lexvo - ISO 639-3 language codes
notation: cup
preferred label: Idioma cupeño @es

Cun
type: Language
type: Concept
ISO 639-3 code: cuq
alternative label: Cun language
definition: Cun is a variety of Hlai language on Hainan Island. Lexical similarity with standard Hlai is 40%.
in scheme: Lexvo - ISO 639-3 language codes
notation: cuq

Chhulung
type: Language
type: Concept
ISO 639-3 code: cur
in scheme: Lexvo - ISO 639-3 language codes
notation: cur

Teutila Cuicatec
type: Language
type: Concept
ISO 639-3 code: cut
alternative label: Cuicatec, Teutila
in scheme: Lexvo - ISO 639-3 language codes
notation: cut

Tai Ya
type: Language
type: Concept
ISO 639-3 code: cuu
in scheme: Lexvo - ISO 639-3 language codes
notation: cuu

Cuvok
type: Language
type: Concept
ISO 639-3 code: cuv
alternative label: Cuvok language
definition: Cuvok is an Afro-Asiatic language spoken in northern Cameroon.
in scheme: Lexvo - ISO 639-3 language codes
notation: cuv

Chukwa
type: Language
type: Concept
ISO 639-3 code: cuw
in scheme: Lexvo - ISO 639-3 language codes
notation: cuw

Kelo
type: Language
type: Concept
ISO 639-3 code: xel
alternative label: Kelo language
definition: Kelo is a moribund Nilo-Saharan language spoken in Sudan.
in scheme: Lexvo - ISO 639-3 language codes
notation: xel

Tepeuxila Cuicatec
type: Language
type: Concept
ISO 639-3 code: cux
alternative label: Cuicatec, Tepeuxila
in scheme: Lexvo - ISO 639-3 language codes
notation: cux

Chug
type: Language
type: Concept
ISO 639-3 code: cvg
in scheme: Lexvo - ISO 639-3 language codes
notation: cvg

Valle Nacional Chinantec
type: Language
type: Concept
ISO 639-3 code: cvn
alternative label: Chinantec, Valle Nacional
in scheme: Lexvo - ISO 639-3 language codes
notation: cvn

Kabwa
type: Language
type: Concept
ISO 639-3 code: cwa
in scheme: Lexvo - ISO 639-3 language codes
notation: cwa

Maindo
type: Language
type: Concept
ISO 639-3 code: cwb
in scheme: Lexvo - ISO 639-3 language codes
notation: cwb

Woods Cree
type: Language
type: Concept
ISO 639-3 code: cwd
alternative label: Cree, Woods
alternative label: Woods Cree language
definition: Woods Cree is an Algonquian language spoken in Manitoba and Saskatchewan, Canada.
in scheme: Lexvo - ISO 639-3 language codes
notation: cwd

Kwere
type: Language
type: Concept
ISO 639-3 code: cwe
in scheme: Lexvo - ISO 639-3 language codes
notation: cwe

Chewong
type: Language
type: Concept
ISO 639-3 code: cwg
alternative label: Cheq Wong
alternative label: Cheq Wong language
definition: Chewong (Cheq Wong) is an aboriginal Mon–Khmer language spoken in Malaya. The small number of speakers is increasing.
in scheme: Lexvo - ISO 639-3 language codes
notation: cwg
preferred label: Cheq wong @fr

Kuwaataay
type: Language
type: Concept
ISO 639-3 code: cwt
alternative label: Kwatay language
definition: Kwatay (Kuwaataay) is a divergent Jola language of Senegal.
in scheme: Lexvo - ISO 639-3 language codes
notation: cwt
preferred label: Kwatay @de

Nopala Chatino
type: Language
type: Concept
ISO 639-3 code: cya
alternative label: Chatino, Nopala
in scheme: Lexvo - ISO 639-3 language codes
notation: cya

Cayubaba
type: Language
type: Concept
ISO 639-3 code: cyb
alternative label: Cayuvava language
definition: Cayuvava (Cayubaba, Cayuwaba, Kayuvava) is an extinct language of Bolivia, the descendants of the ethnic group of the same name live in the region of Beni, west of Mamore River, north of Santa Ana del Yacuma with a population of 794 inhabitants.
in scheme: Lexvo - ISO 639-3 language codes
notation: cyb
preferred label: Idioma cayubaba @es

Kembayan
type: Language
type: Concept
ISO 639-3 code: xem
in scheme: Lexvo - ISO 639-3 language codes
notation: xem

Welsh
type: Language
type: Concept
ISO 639-1 code: cy
ISO 639-2 Bibliographical code: wel
ISO 639-2 Terminological code: cym
ISO 639-3 code: cym
alternative label: Idioma galés @es
alternative label: Lingua gallese @it
alternative label: Língua galesa @pt
alternative label: Walisische Sprache @de
alternative label: Welsh language
alternative label: gallois @fr
definition: Welsh ( or , pronounced ) is a member of the Brythonic branch of the Celtic languages spoken natively in Wales, by some along the Welsh border in England, and in Y Wladfa (the Welsh colony in Chubut Province, Argentina). Historically, it has also been known in English as "Cambrian", "Cambric" and "Cymric".
in scheme: Lexvo - ISO 639-3 language codes
notation: cym
preferred label: Gallois @fr
preferred label: Walisisch @de
preferred label: gallese @it
preferred label: galés @es
preferred label: galês @pt

Cuyonon
type: Language
type: Concept
ISO 639-3 code: cyo
alternative label: Cuyonon language
definition: Cuyonon is a language spoken on the coast of Palawan, and the Cuyo Islands in the Philippines.
in scheme: Lexvo - ISO 639-3 language codes
notation: cyo

Huizhou Chinese
type: Language
type: Concept
ISO 639-3 code: czh
alternative label: Chinese, Huizhou
definition: : The Huī (徽) dialects are unrelated to the Huí (回) ethnic group of China. Huizhou or Hui , is a division of Chinese. Its status is disputed among linguists, with some classifying it as Wu, others as Gan, and still others setting it apart as a primary branch of Chinese.
in scheme: Lexvo - ISO 639-3 language codes
notation: czh
preferred label: Chino hui @es
preferred label: Hui @fr
preferred label: Hui-Dialekt @de

Knaanic
type: Language
type: Concept
ISO 639-3 code: czk
alternative label: Knaanic language
definition: Knaanic (also called Canaanic, Leshon Knaan, Judaeo-Czech or Judaeo-Slavic) is an extinct West Slavic Jewish language, formerly spoken in the lands of the Western Slavs, notably the Czech lands, but also the lands of modern Poland, Lusatia and other Sorbian regions. It became extinct in the Late Middle Ages.
in scheme: Lexvo - ISO 639-3 language codes
notation: czk
preferred label: Knaanisch @de
preferred label: Lingua canaan @it

Zenzontepec Chatino
type: Language
type: Concept
ISO 639-3 code: czn
alternative label: Chatino, Zenzontepec
in scheme: Lexvo - ISO 639-3 language codes
notation: czn

Min Zhong
type: Language
type: Concept
ISO 639-3 code: czo
alternative label: Chinese, Min Zhong
alternative label: Min Zhong Chinese
definition: The Central Min language, or Min Zhong is a member of the Min subcategory of Chinese languages. It is spoken around Yong'an, Sanming and Sha located in the central mountain areas of Fujian. The total population of approximately 3,500,000 native speakers, is the fourth most common variety of the Min branch of Chinese languages.
in scheme: Lexvo - ISO 639-3 language codes
notation: czo
preferred label: Minzhong @fr

Zotung Chin
type: Language
type: Concept
ISO 639-3 code: czt
alternative label: Chin, Zotung
alternative label: Zotung language
definition: Zotung (Zotung Chin) is a Kukish language of Burma.
in scheme: Lexvo - ISO 639-3 language codes
notation: czt

Epi-Olmec
type: Language
type: Concept
ISO 639-3 code: xep
in scheme: Lexvo - ISO 639-3 language codes
notation: xep

Dangaléat
type: Language
type: Concept
ISO 639-3 code: daa
alternative label: Dangaléat language
definition: Dangaléat (also known as Dangla, Danal, Dangal) is an Afro-Asiatic language spoken in central Chad.
in scheme: Lexvo - ISO 639-3 language codes
notation: daa

Dambi
type: Language
type: Concept
ISO 639-3 code: dac
in scheme: Lexvo - ISO 639-3 language codes
notation: dac

Marik
type: Language
type: Concept
ISO 639-3 code: dad
alternative label: Marik language
definition: Marik is an Austronesian language spoken by about 3500 people in 10 villages around the Gogol River, Madang Province, Papua New Guinea.
in scheme: Lexvo - ISO 639-3 language codes
notation: dad

Duupa
type: Language
type: Concept
ISO 639-3 code: dae
in scheme: Lexvo - ISO 639-3 language codes
notation: dae

Dan
type: Language
type: Concept
ISO 639-3 code: daf
alternative label: Dan language
definition: Dan is a Mande language spoken primarily in Côte d'Ivoire (~800,000 speakers) and Liberia (150,800–200,000 speakers). There is also a population of about 800 speakers in Guinea. Dan is a tonal language, with three main tones and two glide/contour tones.
in scheme: Lexvo - ISO 639-3 language codes
notation: daf
preferred label: Língua dan @pt

Dagbani
type: Language
type: Concept
ISO 639-3 code: dag
alternative label: Dagbani language
definition: ' Dagbani is a Gur language spoken in Ghana. Its native speakers are primarily of the Dagomba people, but Dagbani is also widely known as a first language in northern Ghana.
in scheme: Lexvo - ISO 639-3 language codes
notation: dag
preferred label: Língua dagbani @pt

Gwahatike
type: Language
type: Concept
ISO 639-3 code: dah
alternative label: Gwahatike language
definition: Gwahatike (also called Dahating or Gwatike) is a language generally classified in the Warup branch of the Finisterre family of Finisterre–Huon languages. It is spoken in several villages located south of Saidor.
in scheme: Lexvo - ISO 639-3 language codes
notation: dah

Xerénte
type: Language
type: Concept
ISO 639-3 code: xer
alternative label: Xerénte language
definition: Xerénte (Sherenté) is a Ge language of Brazil by the Xakriabá people.
in scheme: Lexvo - ISO 639-3 language codes
notation: xer

Day
type: Language
type: Concept
ISO 639-3 code: dai
alternative label: Day language
definition: Day (ISO 639-3: dai) is a Mbum–Day language of southern Chad, spoken by 49,916 as of that country's 1993 census.
in scheme: Lexvo - ISO 639-3 language codes
notation: dai

Dar Fur Daju
type: Language
type: Concept
ISO 639-3 code: daj
alternative label: Daju, Dar Fur
alternative label: Sila language
definition: The Sila language, also known as Dar Sila, Dar Sila Daju, Bokor, Bokorike, Bokoruge, Dadjo, Dajou, Daju, and Sula, is an Eastern Sudanic language, one of three closely related languages in the area called "Daju" (the other two being the Nyala language and the Daju Mongo language). It is spoken in Chad near the Darfur border, with migration into Sudan. There are two dialects, Sila proper and Mongo, the latter not to be confused with Daju Mongo.
in scheme: Lexvo - ISO 639-3 language codes
notation: daj

Dakota
type: Language
type: Concept
ISO 639-2 Bibliographical code: dak
ISO 639-2 Terminological code: dak
ISO 639-3 code: dak
in scheme: Lexvo - ISO 639-3 language codes
notation: dak
preferred label: Dakota-Sprache @de
preferred label: dacota @pt
preferred label: dakota @es

Dahalo
type: Language
type: Concept
ISO 639-3 code: dal
alternative label: Dahalo language
definition: Dahalo is an endangered South Cushitic language spoken by at most 400 people on the Kenyan coast near the mouth of the Tana River. The Dahalo, former elephant hunters, are dispersed among Swahili and other Bantu peoples, with no villages of their own, and are bilingual in those languages. It may be that children are no longer learning the language.
in scheme: Lexvo - ISO 639-3 language codes
notation: dal

Damakawa
type: Language
type: Concept
ISO 639-3 code: dam
alternative label: Damakawa language
definition: Damakawa is a moribund Benue–Congo language of northwest Nigeria. There are no longer any speakers of the language, although the oldest people can remember a few words. Approximately 80 or so words and phrases were collected, with difficulty, in April 2008 (the language seems to have been unknown to linguists until then).
in scheme: Lexvo - ISO 639-3 language codes
notation: dam

Danish
type: Language
type: Concept
ISO 639-1 code: da
ISO 639-2 Bibliographical code: dan
ISO 639-2 Terminological code: dan
ISO 639-3 code: dan
alternative label: Danish language
alternative label: Dänische Sprache @de
alternative label: Idioma danés @es
alternative label: Lingua danese @it
alternative label: Língua dinamarquesa @pt
alternative label: danois @fr
definition: Danish (dansk, ; dansk sprog, ) is a North Germanic language spoken by around six million people, principally in the country of Denmark. It is also spoken by 50,000 Germans of Danish ethnicity in the northern parts of Schleswig-Holstein, Germany, and 25,000 Danes in Norway where it holds minority language status. Danish is a mandatory subject in school in the Danish crown territories of the Faroe Islands (where it is also an official language after Faroese) and Greenland (where, however, the only official language since 2009 is Kalaallisut), as well as the former crown holding of Iceland. There are also Danish language communities in Argentina, the United States and Canada. Danish is mutually intelligible with Norwegian and Swedish (see "Classification").
in scheme: Lexvo - ISO 639-3 language codes
notation: dan
preferred label: Danois @fr
preferred label: Dänisch @de
preferred label: danese @it
preferred label: danés @es
preferred label: dinamarquês @pt

Daai Chin
type: Language
type: Concept
ISO 639-3 code: dao
alternative label: Chin, Daai
alternative label: Daai language
definition: Daai (Daai Chin), also known as Mün and Ütbü, is a Kukish language of Burma.
in scheme: Lexvo - ISO 639-3 language codes
notation: dao

Dandami Maria
type: Language
type: Concept
ISO 639-3 code: daq
alternative label: Maria, Dandami
in scheme: Lexvo - ISO 639-3 language codes
notation: daq

Dargwa
type: Language
type: Concept
ISO 639-2 Bibliographical code: dar
ISO 639-2 Terminological code: dar
ISO 639-3 code: dar
alternative label: Darginische Sprache @de
alternative label: Dargwa language
alternative label: Lingua dargwa @it
alternative label: Língua dargínica @pt
definition: The Dargwa or Dargin language is spoken by the Dargin people of Dagestan. It is the literary and main dialect of the dialect continuum constituting the Dargin languages. The four other languages in this dialect continuum (Kajtak, Kubachi, Itsari, and Chirag) are often considered variants of Dargwa. Ethnologue lists these under Dargwa, but recognizes that these may be different languages. Its people are Sunni Muslims. Dargwa uses a modified version of the Cyrillic script.
in scheme: Lexvo - ISO 639-3 language codes
notation: dar
preferred label: Darginisch @de
preferred label: dargva @es
preferred label: dargwa @fr

Daho-Doo
type: Language
type: Concept
ISO 639-3 code: das
alternative label: Daho-Doo language
definition: Daho and 'Doo are two mutually intelligible Guere dialects which are divergent from other varieties spoken by the Guere people.
in scheme: Lexvo - ISO 639-3 language codes
notation: das

Dar Sila Daju
type: Language
type: Concept
ISO 639-3 code: dau
alternative label: Daju, Dar Sila
in scheme: Lexvo - ISO 639-3 language codes
notation: dau

Kesawai
type: Language
type: Concept
ISO 639-3 code: xes
in scheme: Lexvo - ISO 639-3 language codes
notation: xes

Taita
type: Language
type: Concept
ISO 639-3 code: dav
alternative label: Dawida
alternative label: Taita language
definition: Taita, or Dawida, is a Bantu language of Kenya. It is closely related to the Chaga languages of Kenya and Tanzania.
in scheme: Lexvo - ISO 639-3 language codes
notation: dav
preferred label: dawida @fr
preferred label: taita @es

Davawenyo
type: Language
type: Concept
ISO 639-3 code: daw
in scheme: Lexvo - ISO 639-3 language codes
notation: daw

Dayi
type: Language
type: Concept
ISO 639-3 code: dax
in scheme: Lexvo - ISO 639-3 language codes
notation: dax

Dao
type: Language
type: Concept
ISO 639-3 code: daz
in scheme: Lexvo - ISO 639-3 language codes
notation: daz

Bangime
type: Language
type: Concept
ISO 639-3 code: dba
alternative label: Bangi Me
alternative label: Bangime language
definition: The Bangime language, or in full , is spoken by some 1500 ethnic Dogon in seven villages in southern Mali, who call themselves the (hidden people). Long known to be highly divergent from (other) Dogon languages, it was first proposed as a possible isolate by Blench (2005). Research since then has confirmed that it appears to be unrelated to neighboring languages.
in scheme: Lexvo - ISO 639-3 language codes
notation: dba

Deno
type: Language
type: Concept
ISO 639-3 code: dbb
alternative label: Deno language
definition: Deno (also known as Denawa, Denwa, Be) is an Afro-Asiatic language spoken in Nigeria. Speakers are shifting to Hausa and Fulfulde.
in scheme: Lexvo - ISO 639-3 language codes
notation: dbb

Petapa Zapotec
type: Language
type: Concept
ISO 639-3 code: zpe
alternative label: Zapotec, Petapa
in scheme: Lexvo - ISO 639-3 language codes
notation: zpe

Dadiya
type: Language
type: Concept
ISO 639-3 code: dbd
alternative label: Dadiya language
definition: Dadiya (Daadiya, Loodiya) is one of the Savanna languages of eastern Nigeria.
in scheme: Lexvo - ISO 639-3 language codes
notation: dbd

Xetá
type: Language
type: Concept
ISO 639-3 code: xet
alternative label: Xeta language
definition: Xetá is a possibly extinct Guarani language of Brazil.
in scheme: Lexvo - ISO 639-3 language codes
notation: xet

Dabe
type: Language
type: Concept
ISO 639-3 code: dbe
in scheme: Lexvo - ISO 639-3 language codes
notation: dbe

Edopi
type: Language
type: Concept
ISO 639-3 code: dbf
in scheme: Lexvo - ISO 639-3 language codes
notation: dbf

Dogul Dogon
type: Language
type: Concept
ISO 639-3 code: dbg
alternative label: Dogon, Dogul Dom
alternative label: Dogul Dom Dogon
definition: The Dogul language, Dogul Dom, is a Dogon language spoken in Mali. It is closest to Bondum Dogon, though not enough for mutual intelligibility.
in scheme: Lexvo - ISO 639-3 language codes
notation: dbg

Doka
type: Language
type: Concept
ISO 639-3 code: dbi
in scheme: Lexvo - ISO 639-3 language codes
notation: dbi

Ida'an
type: Language
type: Concept
ISO 639-3 code: dbj
alternative label: Ida'an language
definition: The Idaan (also Idahan) language is a Malayo-Polynesian language spoken by the Idaan people of Sabah, Malaysia.
in scheme: Lexvo - ISO 639-3 language codes
notation: dbj
preferred label: Ida’an @fr

Dyirbal
type: Language
type: Concept
ISO 639-3 code: dbl
alternative label: Dyirbal language
definition: Dyirbal (also Djirubal) is an Australian Aboriginal language spoken in northeast Queensland by about 5 speakers of the Dyirbal tribe. It is a member of the small Dyirbalic branch of the Pama–Nyungan family. It possesses many outstanding features that have made it well known among linguists.
in scheme: Lexvo - ISO 639-3 language codes
notation: dbl
preferred label: Lingua dyirbal @it

Duguri
type: Language
type: Concept
ISO 639-3 code: dbm
in scheme: Lexvo - ISO 639-3 language codes
notation: dbm

Duriankere
type: Language
type: Concept
ISO 639-3 code: dbn
in scheme: Lexvo - ISO 639-3 language codes
notation: dbn

Dulbu
type: Language
type: Concept
ISO 639-3 code: dbo
in scheme: Lexvo - ISO 639-3 language codes
notation: dbo

Duwai
type: Language
type: Concept
ISO 639-3 code: dbp
alternative label: Duwai language
definition: Duwai is an Afro-Asiatic language spoken in Jigawa and Kano States, Nigeria.
in scheme: Lexvo - ISO 639-3 language codes
notation: dbp

Daba
type: Language
type: Concept
ISO 639-3 code: dbq
alternative label: Daba language
definition: Daba (also known as Dabba) is an Afro-Asiatic language spoken in Cameroon in Far North Province and in one village in neighboring Nigeria.
in scheme: Lexvo - ISO 639-3 language codes
notation: dbq

Keoru-Ahia
type: Language
type: Concept
ISO 639-3 code: xeu
in scheme: Lexvo - ISO 639-3 language codes
notation: xeu

Dabarre
type: Language
type: Concept
ISO 639-3 code: dbr
alternative label: Dabarre language
definition: Dabarre (also known as Af-Dabarre) is an Afro-Asiatic language spoken in Somalia by the Dabarre and Iroole clans. Dialects include Dabarre and Iroole.
in scheme: Lexvo - ISO 639-3 language codes
notation: dbr

Ben Tey Dogon
type: Language
type: Concept
ISO 639-3 code: dbt
alternative label: Dogon, Ben Tey
definition: Ben Tey Dogon, named after the village Been it is spoken in, is a divergent, recently described Dogon language spoken in Mali. It is closely related to Bankan Tey and Nanga Dogon. It is said that elders in the Dogon village of Gawru also speak this language. Been is reported to have been settled from the village of Walo, and Ben Tey Dogon differs from Walo Dogon primarily from being under a different foreign influence, as Been village is surround by Jamsay-speaking villages, which Walo is not.
in scheme: Lexvo - ISO 639-3 language codes
notation: dbt

Bondum Dogon
type: Language
type: Concept
ISO 639-3 code: dbu
alternative label: Bondum Dom Dogon
alternative label: Dogon, Bondum Dom
definition: The Bondum language, Bondum Dom, is a Dogon language spoken in Mali. It is closest to Dogul Dogon, though not enough for mutual intelligibility. Dialects are Kindjim and Nadjamba.
in scheme: Lexvo - ISO 639-3 language codes
notation: dbu

Dungu
type: Language
type: Concept
ISO 639-3 code: dbv
in scheme: Lexvo - ISO 639-3 language codes
notation: dbv

Bankan Tey Dogon
type: Language
type: Concept
ISO 639-3 code: dbw
alternative label: Dogon, Bankan Tey
definition: Bankan Tey Dogon, at first called Walo-Kumbe Dogon after the two main villages it is spoken in, also known as Walo and Walonkore, is a divergent, recently described Dogon language spoken in Mali. It was first reported online by Roger Blench, who reports that it is "clearly related to Nanga", which is only known from one report from 1953.
in scheme: Lexvo - ISO 639-3 language codes
notation: dbw

Dibiyaso
type: Language
type: Concept
ISO 639-3 code: dby
in scheme: Lexvo - ISO 639-3 language codes
notation: dby

Deccan
type: Language
type: Concept
ISO 639-3 code: dcc
alternative label: Dakhini
definition: Dakhini also spelled Dakkhani and Deccani, arose as a Muslim court language of the Deccan Plateau ca. 1300 AD in ways similar to Urdu. It is similar to Urdu in its mixture of Persian with a Hindi base, but differs in its strong influence from Arabic, Urdu, Konkani and Marathi. There is an extensive literature.
in scheme: Lexvo - ISO 639-3 language codes
notation: dcc

Faliscan
type: Language
type: Concept
ISO 639-3 code: xfa
alternative label: Faliscan language
definition: The Faliscan language, the extinct language of the ancient Falisci, forms, together with Latin, the group of Latino-Faliscan languages. It seems probable that the dialect lasted on, though being gradually permeated with Latin, until at least 150 BC.
in scheme: Lexvo - ISO 639-3 language codes
notation: xfa
preferred label: Faliskische Sprache @de
preferred label: Falisque @fr
preferred label: Idioma falisco @es
preferred label: Lingua falisca @it
preferred label: Língua falisca @pt

Negerhollands
type: Language
type: Concept
ISO 639-3 code: dcr
definition: Negerhollands (English translation: Negro-Dutch) is a Dutch-based creole language that was once spoken in the Danish West Indies, now known as the U.S. Virgin Islands. Dutch is its superstrate language with Danish, English, French, Spanish, and African elements incorporated. Notwithstanding its name, Negerhollands draws primarily from the Zeelandic rather than the Hollandic dialect.
in scheme: Lexvo - ISO 639-3 language codes
notation: dcr
preferred label: Negerholländisch @de

Dadi Dadi
type: Language
type: Concept
ISO 639-3 code: dda
in scheme: Lexvo - ISO 639-3 language codes
notation: dda

Dongotono
type: Language
type: Concept
ISO 639-3 code: ddd
in scheme: Lexvo - ISO 639-3 language codes
notation: ddd

Doondo
type: Language
type: Concept
ISO 639-3 code: dde
in scheme: Lexvo - ISO 639-3 language codes
notation: dde

Fataluco
type: Language
type: Concept
ISO 639-3 code: ddg
alternative label: Fataluku language
definition: Fataluku (also known as Dagaga, Dagoda', Dagada) is a Papuan language spoken by approximately 30,000 people of Fataluku ethnicity in the eastern areas of East Timor, especially around Lospalos. It is a Papuan language, and is usually considered a Trans–New Guinea language. It is given the status of a national language under the constitution.
in scheme: Lexvo - ISO 639-3 language codes
notation: ddg
preferred label: Fataluku
preferred label: Idioma fataluco @es

West Goodenough
type: Language
type: Concept
ISO 639-3 code: ddi
alternative label: Goodenough, West
in scheme: Lexvo - ISO 639-3 language codes
notation: ddi

Jaru
type: Language
type: Concept
ISO 639-3 code: ddj
in scheme: Lexvo - ISO 639-3 language codes
notation: ddj

Dendi
type: Language
type: Concept
ISO 639-3 code: ddn
alternative label: Dendi (Benin)
alternative label: Dendi language
definition: Dendi is a Songhay language used as a trade language across northern Benin (along the Niger River; Donga and Alibori provinces, e.g. Djougou, Kandi). It forms a dialect cluster with Zarma and Songhai proper, but is heavily influenced by Bariba.
in scheme: Lexvo - ISO 639-3 language codes
notation: ddn

Dido
type: Language
type: Concept
ISO 639-3 code: ddo
alternative label: Tsez language
definition: Tsez, also known as Dido (цезяс мец cezyas mec or цез мец cez mec in Tsez) is a Northeast Caucasian language with about 15,354 speakers (2002) spoken by the Tsez, a Muslim people in the mountainous Tsunta district of southern and western Dagestan in Russia. The name is said to derive from the Tsez word for "eagle", which is most likely a folk etymology. The name Dido is derived from the Georgian word დიდი (didi), meaning "big".
in scheme: Lexvo - ISO 639-3 language codes
notation: ddo
preferred label: Idioma tsez @es
preferred label: Língua tsez @pt
preferred label: Tsesische Sprache @de
preferred label: Tsez @fr

Dhudhuroa
type: Language
type: Concept
ISO 639-3 code: ddr
alternative label: Dhudhuroa language
definition: Dhudhuroa is an extinct Australian Aboriginal language of north-eastern Victoria. As it is no longer spoken, Dhudhuroa is primarily known today from written material collected by R. H. Mathews from Neddy Wheeler. It has gone by numerous names, including Yaitmathang, Balangamida, Theddoramittung, Tharamirttong, Theddora, Jandangara, and Gundanora.
in scheme: Lexvo - ISO 639-3 language codes
notation: ddr

Donno So Dogon
type: Language
type: Concept
ISO 639-3 code: dds
alternative label: Dogon, Donno So
in scheme: Lexvo - ISO 639-3 language codes
notation: dds

Dawera-Daweloor
type: Language
type: Concept
ISO 639-3 code: ddw
alternative label: Dawera-Daweloor language
definition: Dawera-Daweloor is an Austronesian language spoken in six villages on Dawera and Daweloor islands in South Maluku, Indonesia.
in scheme: Lexvo - ISO 639-3 language codes
notation: ddw

Dagik
type: Language
type: Concept
ISO 639-3 code: dec
alternative label: Dengebu language
definition: Dengebu, also Dagik, Dagig, Thakik, Buram, Reikha, is a Niger–Congo language in the Talodi family spoken in Kordofan, Sudan. It is 80% lexically similar with Ngile, which is also spoken by the Mesakin / Masakin people.
in scheme: Lexvo - ISO 639-3 language codes
notation: dec

Dedua
type: Language
type: Concept
ISO 639-3 code: ded
alternative label: Dedua language
definition: Dedua is a Papuan language spoken in Morobe Province, Papua New Guinea. Dialects are Dzeigoc and Fanic.
in scheme: Lexvo - ISO 639-3 language codes
notation: ded

Dewoin
type: Language
type: Concept
ISO 639-3 code: dee
alternative label: Dewoin language
definition: The Dewoin language, also known as De, Dey, or Dei, is a Kru language of the Niger–Congo language family. It is spoken primarily near the coastal areas of Montserrado County in western Liberia, including the capital Monrovia. It has a lexical similarity of .72 with the Bassa language.
in scheme: Lexvo - ISO 639-3 language codes
notation: dee

Dezfuli
type: Language
type: Concept
ISO 639-3 code: def
in scheme: Lexvo - ISO 639-3 language codes
notation: def

Galatian
type: Language
type: Concept
ISO 639-3 code: xga
alternative label: Galatian language
definition: Galatian is an extinct Celtic language once spoken in Galatia in Asia Minor (modern Turkey) from the 3rd century BC up to at least the 4th century AD, although ancient sources suggest it was still spoken in the 6th century.
in scheme: Lexvo - ISO 639-3 language codes
notation: xga
preferred label: Galate @fr
preferred label: Galatische Sprache @de
preferred label: Galato @it
preferred label: Idioma gálata @es
preferred label: Língua gálata @pt

Degema
type: Language
type: Concept
ISO 639-3 code: deg
alternative label: Degema language
definition: Degema is a Delta Edoid language of Nigeria. It is spoken in two autonomous communities on the Degema Island by about 22,000 people, going by the 1991 population census figures (including the projection figures for the two Degema-speaking communities). The two communities in which Degema is spoken are Usokun-Degema and Degema Town (Atala) in Degema Local Government Area of Rivers State of Nigeria. Each of these communities speaks a variety of Degema that is highly mutually intelligible with the other. These varieties are called by the names of the communities that speak them. They are the Usokun variety spoken in Usokun-Degema and the Degema Town (Atala) variety spoken in Degema Town. These varieties are very similar in their phonological, morphological, syntactic, and semantic properties.
in scheme: Lexvo - ISO 639-3 language codes
notation: deg

Dehwari
type: Language
type: Concept
ISO 639-3 code: deh
in scheme: Lexvo - ISO 639-3 language codes
notation: deh

Demisa
type: Language
type: Concept
ISO 639-3 code: dei
in scheme: Lexvo - ISO 639-3 language codes
notation: dei

Dek
type: Language
type: Concept
ISO 639-3 code: dek
in scheme: Lexvo - ISO 639-3 language codes
notation: dek

Delaware
type: Language
type: Concept
ISO 639-2 Bibliographical code: del
ISO 639-2 Terminological code: del
ISO 639-3 code: del
alternative label: Delaware languages
alternative label: Lingua delaware @it
alternative label: Línguas delaware @pt
definition: The Delaware languages, also known as the Lenape languages, are Munsee and Unami, two closely related languages of the Eastern Algonquian subgroup of the Algonquian language family. Munsee and Unami were spoken aboriginally by the Lenape people in the vicinity of the modern New York City area in the United States, including western Long Island, Manhattan Island, Staten Island, as well as adjacent areas on the mainland: southeastern New York State, eastern Pennsylvania, New Jersey, and coastal Delaware.
in scheme: Lexvo - ISO 639-3 language codes
notation: del
preferred label: Delaware-Sprache @de
preferred label: delaware @es

Dem
type: Language
type: Concept
ISO 639-3 code: dem
alternative label: Dem language
definition: Dem (Lem, Ndem) is a Trans–New Guinea language that forms an independent branch of that family in the classification of Malcolm Ross (2005).
in scheme: Lexvo - ISO 639-3 language codes
notation: dem

Slave
type: Language
type: Concept
ISO 639-2 Bibliographical code: den
ISO 639-2 Terminological code: den
ISO 639-3 code: den
alternative label: Esclave @fr
alternative label: Slave (Athapascan)
alternative label: Slavey @de
alternative label: Slavey language
alternative label: esclave (athapascan) @fr
definition: Slavey (; also Slave, Slavé) is an Athabaskan language spoken among the Slavey First Nations of Canada in the Northwest Territories where it also has official status. The language is written using Canadian Aboriginal syllabics or the Latin script.
in scheme: Lexvo - ISO 639-3 language codes
notation: den
preferred label: slave @es
preferred label: slavey @fr

Pidgin Delaware
type: Language
type: Concept
ISO 639-3 code: dep
alternative label: Delaware, Pidgin
in scheme: Lexvo - ISO 639-3 language codes
notation: dep

Dendi
type: Language
type: Concept
ISO 639-3 code: deq
alternative label: Dendi (Central African Republic)
in scheme: Lexvo - ISO 639-3 language codes
notation: deq

Deori
type: Language
type: Concept
ISO 639-3 code: der
alternative label: Deori language
definition: Deori is a Tibeto-Burman language spoken by the Deori people of Assam. It is one of the official languages of Arunachal Pradesh. Only one of the Deori tribes, the Dibongya, has retained the language, the others having shifted to Assamese, but among the Dibongya it is vigorous.
in scheme: Lexvo - ISO 639-3 language codes
notation: der

Desano
type: Language
type: Concept
ISO 639-3 code: des
in scheme: Lexvo - ISO 639-3 language codes
notation: des

German
type: Language
type: Concept
ISO 639-1 code: de
ISO 639-2 Bibliographical code: ger
ISO 639-2 Terminological code: deu
ISO 639-3 code: deu
alternative label: Haut-allemand moderne @fr
alternative label: Neuhochdeutsch @de
alternative label: New High German
definition: New High German (NHG) is the term used for the most recent period in the history of the German language. It is a translation of the German Neuhochdeutsch (Nhd). It includes all of the modern High German dialects since the Baroque period, but is often used as a synonym for Standard German.
in scheme: Lexvo - ISO 639-3 language codes
notation: deu
preferred label: Deutsch @de
preferred label: alemán @es
preferred label: alemão @pt
preferred label: allemand @fr
preferred label: tedesco @it

Domung
type: Language
type: Concept
ISO 639-3 code: dev
in scheme: Lexvo - ISO 639-3 language codes
notation: dev

Dengese
type: Language
type: Concept
ISO 639-3 code: dez
alternative label: Dengese language
definition: Dengese (Lengese, Ndengese) is a Bantu language of northern Kasai-Oriental Province, Democratic Republic of the Congo.
in scheme: Lexvo - ISO 639-3 language codes
notation: dez

Southern Dagaare
type: Language
type: Concept
ISO 639-3 code: dga
alternative label: Dagaare, Southern
in scheme: Lexvo - ISO 639-3 language codes
notation: dga

Budu Dogon
type: Language
type: Concept
ISO 639-3 code: dgb
alternative label: Bunoge Dogon
alternative label: Dogon, Bunoge
definition: Budu Dogon or Bunoge, also known as Korandabo, is a recently discovered Dogon language spoken in Mali. It was first reported online. The plural suffix on nouns is closest to Kolum so, suggesting it should be classified as a West Dogon language.
in scheme: Lexvo - ISO 639-3 language codes
notation: dgb

Gbin
type: Language
type: Concept
ISO 639-3 code: xgb
in scheme: Lexvo - ISO 639-3 language codes
notation: xgb

Casiguran Dumagat Agta
type: Language
type: Concept
ISO 639-3 code: dgc
alternative label: Agta, Casiguran Dumagat
in scheme: Lexvo - ISO 639-3 language codes
notation: dgc

Dagaari Dioula
type: Language
type: Concept
ISO 639-3 code: dgd
in scheme: Lexvo - ISO 639-3 language codes
notation: dgd

Degenan
type: Language
type: Concept
ISO 639-3 code: dge
in scheme: Lexvo - ISO 639-3 language codes
notation: dge

Doga
type: Language
type: Concept
ISO 639-3 code: dgg
alternative label: Doga language
definition: The Doga language is an Austronesian language spoken by about 200 people along Cape Vogel in the Milne Bay Province of Papua New Guinea.
in scheme: Lexvo - ISO 639-3 language codes
notation: dgg

Dghwede
type: Language
type: Concept
ISO 639-3 code: dgh
alternative label: Dghwede language
definition: Dghwede (also known as Hude, Johode, Traude, Dehoxde, Tghuade, Toghwede, Wa'a, Azaghvana, Zaghvana) is an Afro-Asiatic language spoken in Borno State, Nigeria in the Gwoza LGA.
in scheme: Lexvo - ISO 639-3 language codes
notation: dgh

Northern Dagara
type: Language
type: Concept
ISO 639-3 code: dgi
alternative label: Dagara, Northern
in scheme: Lexvo - ISO 639-3 language codes
notation: dgi

Dagba
type: Language
type: Concept
ISO 639-3 code: dgk
in scheme: Lexvo - ISO 639-3 language codes
notation: dgk

Gudang
type: Language
type: Concept
in scheme: Lexvo - ISO 639-3 language codes

Andaandi
type: Language
type: Concept
ISO 639-3 code: dgl
alternative label: Dongolawi
in scheme: Lexvo - ISO 639-3 language codes
notation: dgl

Dagoman
type: Language
type: Concept
ISO 639-3 code: dgn
in scheme: Lexvo - ISO 639-3 language codes
notation: dgn

Dogri
type: Language
type: Concept
ISO 639-3 code: dgo
alternative label: Dogri (individual language)
in scheme: Lexvo - ISO 639-3 language codes
notation: dgo

Dogrib
type: Language
type: Concept
ISO 639-2 Bibliographical code: dgr
ISO 639-2 Terminological code: dgr
ISO 639-3 code: dgr
alternative label: Dogrib language
alternative label: Flanc-de-chien @fr
alternative label: Língua dogrib @pt
definition: Dogrib, the English translation of the indigenous name , is a Northern Athabaskan language spoken by the First Nations Tłı̨chǫ people of the Canadian territory Northwest Territories. According to Statistics Canada in 2006, there were approximately 2,640 people who spoke Dogrib.
in scheme: Lexvo - ISO 639-3 language codes
notation: dgr
preferred label: dogrib @es

Dogoso
type: Language
type: Concept
ISO 639-3 code: dgs
alternative label: Dogoso language
definition: , Black Dogose, Dogoso (Black Dogose) is a Gur language of Burkina Faso. Other than Khe, is distant from other languages, including the neighboring Dogosé language.
in scheme: Lexvo - ISO 639-3 language codes
notation: dgs

Tongva language
type: Language
type: Concept
ISO 639-3 code: xgf
alternative label: Gabrielino-Fernandeño
definition: The Tongva language (also known as Gabrielino or Gabrieleño) is an extinct Uto-Aztecan language spoken by the Tongva, a Native American people who live in and around Los Angeles, California. Tongva is closely related to several other Takic languages, including Cahuilla and Serrano.
in scheme: Lexvo - ISO 639-3 language codes
notation: xgf
preferred label: Gabrielino-fernandeño @fr

Ndrag'ngith
type: Language
type: Concept
ISO 639-3 code: dgt
in scheme: Lexvo - ISO 639-3 language codes
notation: dgt

Degaru
type: Language
type: Concept
ISO 639-3 code: dgu
in scheme: Lexvo - ISO 639-3 language codes
notation: dgu

Daungwurrung
type: Language
type: Concept
ISO 639-3 code: dgw
in scheme: Lexvo - ISO 639-3 language codes
notation: dgw

Doghoro
type: Language
type: Concept
ISO 639-3 code: dgx
in scheme: Lexvo - ISO 639-3 language codes
notation: dgx

Daga
type: Language
type: Concept
ISO 639-3 code: dgz
alternative label: Daga language
definition: Daga (Dimuga, Nawp) is a language of Papua New Guinea.
in scheme: Lexvo - ISO 639-3 language codes
notation: dgz

Dhundari
type: Language
type: Concept
ISO 639-3 code: dhd
alternative label: Dhundari language
definition: Dhundari is an Indo-Aryan language spoken in the Dhundhar region of northeastern Rajasthan state, India. Dhundari-speaking people are found in three districts – Jaipur, Karauli, Sawai Madhopur, Dausa, and Tonk. The derivation of the name “Dhundari” is thought to be from two origins. According to the first opinion, Dhundari is believed to have drawn its name from the Dhundh or Dhundhakriti mountain, which is situated near Jobner in Jaipur District. The other opinion is that it is named after a river called Dhundh flowing through this region. Hence the name became Dhundhar.
in scheme: Lexvo - ISO 639-3 language codes
notation: dhd

Djangu
type: Language
type: Concept
ISO 639-3 code: dhg
alternative label: Dhangu
in scheme: Lexvo - ISO 639-3 language codes
notation: dhg

Dhimal
type: Language
type: Concept
ISO 639-3 code: dhi
alternative label: Dhimal language
definition: Dhimal is a Tibeto-Burman language of Nepal and India.
in scheme: Lexvo - ISO 639-3 language codes
notation: dhi

Dhalandji
type: Language
type: Concept
ISO 639-3 code: dhl
in scheme: Lexvo - ISO 639-3 language codes
notation: dhl

Zemba
type: Language
type: Concept
ISO 639-3 code: dhm
alternative label: Zemba language
definition: Zemba (Dhimba) is a Bantu language spoken mainly in Angola where the language has about 18,000 speakers, and also in Namibia with some 4,000. It is closely related to Herero, and is often considered a dialect of that language, especially as the Zemba are ethnically Herero.
in scheme: Lexvo - ISO 639-3 language codes
notation: dhm

Dhanki
type: Language
type: Concept
ISO 639-3 code: dhn
in scheme: Lexvo - ISO 639-3 language codes
notation: dhn

Dhodia
type: Language
type: Concept
ISO 639-3 code: dho
in scheme: Lexvo - ISO 639-3 language codes
notation: dho

Goreng
type: Language
type: Concept
in scheme: Lexvo - ISO 639-3 language codes

Dhargari
type: Language
type: Concept
ISO 639-3 code: dhr
in scheme: Lexvo - ISO 639-3 language codes
notation: dhr

Dhaiso
type: Language
type: Concept
ISO 639-3 code: dhs
in scheme: Lexvo - ISO 639-3 language codes
notation: dhs

Dhurga
type: Language
type: Concept
ISO 639-3 code: dhu
in scheme: Lexvo - ISO 639-3 language codes
notation: dhu

Dehu
type: Language
type: Concept
ISO 639-3 code: dhv
preferred label: Drehu
alternative label: Drehu language
definition: Drehu ([ɖehu]; also known as Dehu, Lifou, Lifu, qene drehu ) is an Austronesian language mostly spoken on Lifou Island, Loyalty Islands, New Caledonia. It has about twelve-thousand fluent speakers and the status of a French regional language. This status means that pupils can take it as an optional topic for the baccalauréat in New Caledonia itself or French mainland. It has been also taught at the Institut National des Langues et Civilisations Orientales (INALCO) in Paris since 1973 and at the since 2000. As for other Kanak languages, Drehu is now regulated by the "Académie des langues kanak", officially founded in 2007.
in scheme: Lexvo - ISO 639-3 language codes
notation: dhv

San Pedro Quiatoni Zapotec
type: Language
type: Concept
ISO 639-3 code: zpf
alternative label: Zapotec, San Pedro Quiatoni
in scheme: Lexvo - ISO 639-3 language codes
notation: zpf

Dhanwar
type: Language
type: Concept
ISO 639-3 code: dhw
alternative label: Dhanwar (Nepal)
alternative label: Dhanwar Rai language
definition: Dhanwar also known as Rai is a language spoken in parts of Nepal by an Indo-Aryan ethnic group of 50 thousand. It is an unclassified Indo-Aryan language, and is not related to the Rai languages of the Tibeto-Burman family.
in scheme: Lexvo - ISO 639-3 language codes
notation: dhw

Garingbal
type: Language
type: Concept
in scheme: Lexvo - ISO 639-3 language codes

Dhungaloo
type: Language
type: Concept
in scheme: Lexvo - ISO 639-3 language codes

Dia
type: Language
type: Concept
ISO 639-3 code: dia
alternative label: Dia language
definition: Dia (Alu, Galu, Metru) is a Torricelli language of Papua New Guinea. Sinagen is also called Galu.
in scheme: Lexvo - ISO 639-3 language codes
notation: dia

South Central Dinka
type: Language
type: Concept
ISO 639-3 code: dib
alternative label: Dinka, South Central
in scheme: Lexvo - ISO 639-3 language codes
notation: dib

Lakota Dida
type: Language
type: Concept
ISO 639-3 code: dic
alternative label: Dida, Lakota
in scheme: Lexvo - ISO 639-3 language codes
notation: dic

Didinga
type: Language
type: Concept
ISO 639-3 code: did
alternative label: Didinga language
definition: The Didinga language (’Di’dinga) is an Eastern Sudanic language spoken by the Chukudum and Lowudo peoples of the Didinga Hills of South Sudan. It is a member of the Surmic languages.
in scheme: Lexvo - ISO 639-3 language codes
notation: did

Galindan
type: Language
type: Concept
ISO 639-3 code: xgl
alternative label: Galindian language
definition: Galindian is a poorly attested extinct language, considered to be a part of the Baltic languages group. There are no extant writings in Galindian.
in scheme: Lexvo - ISO 639-3 language codes
notation: xgl
preferred label: Galindien @fr
preferred label: Lingua galindica @it

Dieri
type: Language
type: Concept
ISO 639-3 code: dif
alternative label: Diyari language
definition: Diyari or Dieri is an Australian Aboriginal language of South Australia spoken by the Diyari tribe.
in scheme: Lexvo - ISO 639-3 language codes
notation: dif
preferred label: Língua diyari @pt

Digo
type: Language
type: Concept
ISO 639-3 code: dig
alternative label: Chidigo
alternative label: Digo language
definition: Digo (Chidigo) is a Bantu language spoken primarily along the East African coast between Mombasa and Tanga by the Digo people of Kenya and Tanzania. The ethnic Digo population has been estimated at around 360,000 (Mwalonya et al. 2004), the majority of whom are presumably speakers of the language. All adult speakers of Digo are bilingual in Swahili, East Africa's lingua franca. The two languages are closely related, and Digo also has a lot of vocabulary borrowed from neighbouring Swahili dialects.
in scheme: Lexvo - ISO 639-3 language codes
notation: dig

Kumiai
type: Language
type: Concept
ISO 639-3 code: dih
alternative label: Kumeyaay language
definition: Kumeyaay (Kumiai), also known as Central Diegueño, Kamia, and Campo, is the Native American language spoken by the Kumeyaay people of southern San Diego and Imperial counties in California. Hinton (1994:28) suggested a conservative estimate of 50 surviving Kumeyaay speakers. A more liberal estimate (including speakers of Ipai and Tipai), supported by the results of the Census 2000, is 110 people in the US, including 15 persons under the age of 18.
in scheme: Lexvo - ISO 639-3 language codes
notation: dih

Dimbong
type: Language
type: Concept
ISO 639-3 code: dii
alternative label: Kaalong language
definition: Kaalong, also known as Dimbong (Mbong), is a nearly extinct Bantu language of Cameroon. Speakers have shifted to Bafia.
in scheme: Lexvo - ISO 639-3 language codes
notation: dii

Dai
type: Language
type: Concept
ISO 639-3 code: dij
in scheme: Lexvo - ISO 639-3 language codes
notation: dij

Southwestern Dinka
type: Language
type: Concept
ISO 639-3 code: dik
alternative label: Dinka, Southwestern
in scheme: Lexvo - ISO 639-3 language codes
notation: dik

Dilling
type: Language
type: Concept
ISO 639-3 code: dil
in scheme: Lexvo - ISO 639-3 language codes
notation: dil

Dime
type: Language
type: Concept
ISO 639-3 code: dim
alternative label: Dime language
definition: Dime or Dima is an Afro-Asiatic language spoken in the northern part of the Selamago district in the Southern Nations, Nationalities and Peoples Region of Ethiopia, around Mount Smith. Dime divides into at least two dialects, which include Us'a and Gerfa. It has six case suffixes, in addition to an unmarked nominative. It is overwhelmingly suffixing, but uses prefixes for demonstratives. Phonologically, it is noteworthy for having velar and uvular fricative phonemes. The basic word order is SOV (subject–object–verb), as in other Omotic languages, indeed as in all the languages of the core of the Ethiopian Language Area.
in scheme: Lexvo - ISO 639-3 language codes
notation: dim

Dinka
type: Language
type: Concept
ISO 639-2 Bibliographical code: din
ISO 639-2 Terminological code: din
ISO 639-3 code: din
alternative label: Dinka language
alternative label: Dinka-Sprache @de
alternative label: Língua dinka @pt
definition: This article is about the language, for the ethnic group see Dinka. Dinka, or , is a Nilotic dialect cluster spoken by the Dinka people, the major ethnic group of South Sudan. There are five main varieties, Ngok, Rek, Agaar, Twic / Tuic East, and Bor, which are distinct enough to require separate literary standards and thus to be considered separate languages. Jaang or Jieng is used as a general term to cover all Dinka languages. The Rek Dialect is said to be the standard and prestige dialect.
in scheme: Lexvo - ISO 639-3 language codes
notation: din
preferred label: dinca @it
preferred label: dinka @es

Dibo
type: Language
type: Concept
ISO 639-3 code: dio
alternative label: Dibo language
definition: Dibo, Ganagana, Ganagawa, is a Nupoid language spoken in Nigeria.
in scheme: Lexvo - ISO 639-3 language codes
notation: dio

Northeastern Dinka
type: Language
type: Concept
ISO 639-3 code: dip
alternative label: Dinka, Northeastern
in scheme: Lexvo - ISO 639-3 language codes
notation: dip

Dimli
type: Language
type: Concept
ISO 639-3 code: diq
alternative label: Dimli (individual language)
in scheme: Lexvo - ISO 639-3 language codes
notation: diq

Dirim
type: Language
type: Concept
ISO 639-3 code: dir
in scheme: Lexvo - ISO 639-3 language codes
notation: dir

Guwinmal
type: Language
type: Concept
in scheme: Lexvo - ISO 639-3 language codes

Dimasa
type: Language
type: Concept
ISO 639-3 code: dis
alternative label: Dimasa language
definition: Dimasa language is a Tibeto-Burman language spoken by the Dimasa people in the state of Assam in North East India.
in scheme: Lexvo - ISO 639-3 language codes
notation: dis

Dirari
type: Language
type: Concept
ISO 639-3 code: dit
in scheme: Lexvo - ISO 639-3 language codes
notation: dit

Diriku
type: Language
type: Concept
ISO 639-3 code: diu
alternative label: Gciriku language
definition: Gciriku or Dciriku (Diriku), officially Rumanyo, is a Bantu language spoken by 305,000 people along the Okavango River in Namibia, where it is a national language, in Botswana, and in Angola. It was first known in the west via the Vagciriku, who had migrated from the main Vamanyo area and spoke Rugciriku, a dialect of Rumanyo. The name Gciriku (Dciriku, Diriku) remains common in the literature, but within Namibia the name Rumanyo has been revived.
in scheme: Lexvo - ISO 639-3 language codes
notation: diu

Divehi
type: Language
type: Concept
ISO 639-1 code: dv
ISO 639-2 Bibliographical code: div
ISO 639-2 Terminological code: div
ISO 639-3 code: div
preferred label: Dhivehi
alternative label: Dhivehi language
alternative label: Idioma dhivehi @es
alternative label: Lingua maldiviana @it
alternative label: Língua divehi @pt
alternative label: Maldivian
alternative label: Maledivisch @de
alternative label: maldivien @fr
definition: Dhivehi ( Divehi) is an Indo-Aryan language predominantly spoken by about 350,000 people in the Maldives where it is the national language. It is also the first language of nearly 10,000 people in the island of Minicoy in the Union territory of Lakshadweep, India where the Mahl dialect of the Dhivehi language is spoken.
in scheme: Lexvo - ISO 639-3 language codes
notation: div
preferred label: divehi @es

Northwestern Dinka
type: Language
type: Concept
ISO 639-3 code: diw
alternative label: Dinka, Northwestern
in scheme: Lexvo - ISO 639-3 language codes
notation: diw

Garza
type: Language
type: Concept
ISO 639-3 code: xgr
alternative label: Garza language
definition: Garza is an extinct Comecrudan language of Texas and Mexico. It is known from two tribal names and twenty-one words recorded from the chief of the Garza by Berlandier in 1828 (Berlandier et al. 1828–1829, 1850: 143–144). At that time, the Garza all spoke Spanish and were acculturated. The Garza may have been the same as the Atanguaypacam tribe (of the Comecrudo) recorded in 1748. The Garza were called something like Meacknan or Miákan by the neighboring Cotoname (Gatschet 1886: 54) while they called the Cotoname Yué. Garza is Spanish for "heron".
in scheme: Lexvo - ISO 639-3 language codes
notation: xgr

Dixon Reef
type: Language
type: Concept
ISO 639-3 code: dix
in scheme: Lexvo - ISO 639-3 language codes
notation: dix

Diuwe
type: Language
type: Concept
ISO 639-3 code: diy
in scheme: Lexvo - ISO 639-3 language codes
notation: diy

Ding
type: Language
type: Concept
ISO 639-3 code: diz
alternative label: Ding language
definition: Ding (Di, Dzing) is a Bantu language spoken in the Democratic Republic of Congo.
in scheme: Lexvo - ISO 639-3 language codes
notation: diz

Djadjawurrung
type: Language
type: Concept
ISO 639-3 code: dja
in scheme: Lexvo - ISO 639-3 language codes
notation: dja

Djinba
type: Language
type: Concept
ISO 639-3 code: djb
in scheme: Lexvo - ISO 639-3 language codes
notation: djb

Dar Daju Daju
type: Language
type: Concept
ISO 639-3 code: djc
alternative label: Daju Mongo language
alternative label: Daju, Dar Daju
definition: Daju Mongo is an Eastern Sudanic language, one of three closely related languages in the area called "Daju" (the other two being the Nyala language and the Sila language. It is spoken in Chad near the Darfur border. There are three dialects, Bardangal, Eref, and Gadjira.
in scheme: Lexvo - ISO 639-3 language codes
notation: djc

Djamindjung
type: Language
type: Concept
ISO 639-3 code: djd
alternative label: Jaminjung language
definition: Jaminjung is Australian language spoken around the Victoria River in the Northern Territory of Australia. There seems to be a steady increase in the number of speakers of the language with very few people speaking the language in 1967, about 30 speakers in 1991, and between 50 to 150 speakers in 2000.
in scheme: Lexvo - ISO 639-3 language codes
notation: djd

Zarma
type: Language
type: Concept
ISO 639-3 code: dje
alternative label: Idioma zarma @es
alternative label: Língua zarma @pt
alternative label: Zarma language
preferred label: zarma @es
definition: Zarma (also spelled Djerma, Dyabarma, Dyarma, Dyerma, Adzerma, Zabarma, Zarbarma, Zarma, Zarmaci, and Zerma) is a member of the Songhay languages. It is the leading indigenous language of the southwestern lobe of the West African nation of Niger, where the Niger River flows and the capital city, Niamey, is located, and it is the second leading for that entire nation, after Hausa, which is spoken in south central Niger. In earlier decades, it was known as Djerma. With over 2 million speakers, Zarma is far and away the most widely spoken of the Songhay languages. The two other major Songhay dialects or languages are spoken upriver in the neighboring nation of Mali. They are Koyraboro Senni, centered on the city of Gao, with about 400,000 speakers, and yet further upriver from Zarma territory, Koyra Chiini, centered on the eminent ancient university city of Timbuktu, with about 200,000 speakers. According to some reports, speakers of Zarma do not understand Koyraboro Senni.
in scheme: Lexvo - ISO 639-3 language codes
notation: dje

Djangun
type: Language
type: Concept
ISO 639-3 code: djf
in scheme: Lexvo - ISO 639-3 language codes
notation: djf

Djinang
type: Language
type: Concept
ISO 639-3 code: dji
in scheme: Lexvo - ISO 639-3 language codes
notation: dji

Djeebbana
type: Language
type: Concept
ISO 639-3 code: djj
alternative label: Djeebbana language
definition: Djeebbana, also known as Ndjebbana, Gunavidji, Gunivugi, Kunibidji, or Gombudj, is a Burarran language once spoken by the Djeebbana people, who now speak English with some ability in their ancestral language. It has no close relatives.
in scheme: Lexvo - ISO 639-3 language codes
notation: djj

Nenge
type: Language
type: Concept
ISO 639-3 code: djk
alternative label: Businenge Tongo
alternative label: Eastern Maroon Creole
alternative label: Ndyuka language
definition: Ndyuka , also called Aukan, Okanisi, Ndyuka tongo, Aukaans, Businenge Tongo, Eastern Maroon Creole, or Nenge is a creole language of Suriname, spoken by the Ndyuka people. Most of the 25 to 30 thousand speakers live in the interior of the country, which is a part of the country covered with tropical rainforests. Ethnologue lists under the name Ndyuka.
in scheme: Lexvo - ISO 639-3 language codes
notation: djk
preferred label: Aukaans @de
preferred label: Ndjuka @fr
preferred label: Ndyuka @es

Unggumi
type: Language
type: Concept
ISO 639-3 code: xgu
in scheme: Lexvo - ISO 639-3 language codes
notation: xgu

Djiwarli
type: Language
type: Concept
ISO 639-3 code: djl
alternative label: Jiwarli language
definition: Jiwarli (also spelt Djwiarli, Tjiwarli) is an Australian Aboriginal language formerly spoken in Western Australia. It is one of the Mantharta languages of the large Southwest branch of the Pama–Nyungan family.
in scheme: Lexvo - ISO 639-3 language codes
notation: djl

Jamsay Dogon
type: Language
type: Concept
ISO 639-3 code: djm
alternative label: Dogon, Jamsay
alternative label: Jamsai Dogon
definition: Jam Sai (sometimes spelled Jamsay) is one of the Dogon languages spoken in Mali, and the only one spoken in Burkina Faso apart for a few villages of Tomo Kan. It is one of the plains languages spoken in Dogon villages outside the Bandiagara Escarpment (the cliffs that the Dogon ethnic group is usually associated with). It is a major language in Koro, at the south end of the escarpment, and stretches as far north as Douentza. It is not mutually intelligible with other Plains Dogon languages, but is widely known as the prestige variety due to its use as the language of radio broadcasts. Dialects are Domno tegu, Gono tegu, Bama tegu, and Guru tegu; their degree of mutual intelligibility has not been recorded. Domno is the standard dialect, and considered the purest; Guru (Koro) is the dialect of that town.
in scheme: Lexvo - ISO 639-3 language codes
notation: djm

Djauan
type: Language
type: Concept
ISO 639-3 code: djn
alternative label: Jawoyn language
definition: Jawoyn (Jawany, Djauan, Adowen, Jawan, Jawony) or Kumertuo is an endangered Gunwinyguan language spoken by elders in Arnhem Land, Australia.
in scheme: Lexvo - ISO 639-3 language codes
notation: djn

Jangkang
type: Language
type: Concept
ISO 639-3 code: djo
alternative label: Jangkang language
definition: Jangkang (Djongkang) is a Dayak language of Borneo.
in scheme: Lexvo - ISO 639-3 language codes
notation: djo

Djambarrpuyngu
type: Language
type: Concept
ISO 639-3 code: djr
in scheme: Lexvo - ISO 639-3 language codes
notation: djr

Kapriman
type: Language
type: Concept
ISO 639-3 code: dju
alternative label: Kapriman language
definition: Kapriman is a Sepik language spoken in Sandaun Province, Papua-New Guinea. Alternative names are Mugumute, Wasare.
in scheme: Lexvo - ISO 639-3 language codes
notation: dju

Djawi
type: Language
type: Concept
ISO 639-3 code: djw
alternative label: Jawi dialect
definition: Jawi is a nearly extinct dialect of the Bardi language of Western Australia, the traditional language of the Jawi people. There are no longer any known fluent speakers, but there may be some partial speakers.
in scheme: Lexvo - ISO 639-3 language codes
notation: djw

Guwa
type: Language
type: Concept
in scheme: Lexvo - ISO 639-3 language codes

Dakpakha
type: Language
type: Concept
ISO 639-3 code: dka
alternative label: Dakpa language
definition: The Dakpa language (Dzongkha: དཀ་པ་ཁ་; Wylie: Dak-pa-kha; also called "Dakpakha" and "D°akpakha") is an East Bodish language spoken by about 1,000 people in northern Trashigang District in eastern Bhutan, mainly in Chaleng, Phongmey, Yobinang, Dangpholeng and Lengkhar near Radhi. Van Driem (2001) describes Dakpa as the most divergent of Bhutan's East Bodish languages. SIL reports that Dakpa may be dialect of Brokpake, and that it been influenced by Dzalakha while Brokpake has not.
in scheme: Lexvo - ISO 639-3 language codes
notation: dka

Dakka
type: Language
type: Concept
ISO 639-3 code: dkk
in scheme: Lexvo - ISO 639-3 language codes
notation: dkk

Kuijau
type: Language
type: Concept
ISO 639-3 code: dkr
in scheme: Lexvo - ISO 639-3 language codes
notation: dkr

Southeastern Dinka
type: Language
type: Concept
ISO 639-3 code: dks
alternative label: Dinka, Southeastern
in scheme: Lexvo - ISO 639-3 language codes
notation: dks

Mazagway
type: Language
type: Concept
ISO 639-3 code: dkx
alternative label: Mazagway language
definition: Mazagway (also known as Mazagway-Hidi) is an Afro-Asiatic language spoken in Cameroon in North Province and Far North Province.
in scheme: Lexvo - ISO 639-3 language codes
notation: dkx

Harami
type: Language
type: Concept
ISO 639-3 code: xha
in scheme: Lexvo - ISO 639-3 language codes
notation: xha

Dolgan
type: Language
type: Concept
ISO 639-3 code: dlg
alternative label: Dolgan language
definition: The Dolgan language is a Turkic language with around 5,000 speakers, spoken in the Taymyr Peninsula in Russia. Its speakers are known as the Dolgans.
in scheme: Lexvo - ISO 639-3 language codes
notation: dlg
preferred label: Dolgane @fr
preferred label: Dolganische Sprache @de

Dahalik
type: Language
type: Concept
in scheme: Lexvo - ISO 639-3 language codes

Dalmatian
type: Language
type: Concept
ISO 639-3 code: dlm
alternative label: Dalmatian language
definition: Dalmatian (or Dalmatic) was a Romance language spoken in the Dalmatia region of Croatia, and as far south as Kotor in Montenegro. The name refers to a pre-Roman tribe of the Illyrian linguistic group, Dalmatae. The Ragusan dialect of Dalmatian was the official language of the Republic of Ragusa – although in later times this came to be superseded by Italian (representing the Romance language population) or Serbian/Croatian (for the slavophone population).
in scheme: Lexvo - ISO 639-3 language codes
notation: dlm
preferred label: Dalmate @fr
preferred label: Dalmatische Sprache @de
preferred label: Idioma dalmático @es
preferred label: Lingua dalmatica @it
preferred label: Língua dálmata @pt

Darlong
type: Language
type: Concept
ISO 639-3 code: dln
in scheme: Lexvo - ISO 639-3 language codes
notation: dln

Duma
type: Language
type: Concept
ISO 639-3 code: dma
in scheme: Lexvo - ISO 639-3 language codes
notation: dma

Mombo Dogon
type: Language
type: Concept
ISO 639-3 code: dmb
alternative label: Dogon, Mombo
definition: Mombo Dogon is a Dogon language spoken in Mali. Helabo and Miambo are dialects.
in scheme: Lexvo - ISO 639-3 language codes
notation: dmb

Zuojiang Zhuang
type: Language
type: Concept
ISO 639-3 code: zzj
alternative label: Zhuang, Zuojiang
in scheme: Lexvo - ISO 639-3 language codes
notation: zzj

Gavak
type: Language
type: Concept
ISO 639-3 code: dmc
alternative label: Dimir
alternative label: Dimir language
definition: Dimir, also known as Bosiken (Boskien), is a Papuan language of Madang Province, Papua New Guinea.
in scheme: Lexvo - ISO 639-3 language codes
notation: dmc

Hunnic
type: Language
type: Concept
ISO 639-3 code: xhc
alternative label: Hunnic language
in scheme: Lexvo - ISO 639-3 language codes
notation: xhc
preferred label: Hunnische Sprache @de
preferred label: Idioma huno @es
preferred label: Lingua unna @it
preferred label: Língua huna @pt

Madhi Madhi
type: Language
type: Concept
ISO 639-3 code: dmd
in scheme: Lexvo - ISO 639-3 language codes
notation: dmd

Dugwor
type: Language
type: Concept
ISO 639-3 code: dme
alternative label: Dugwor language
definition: Dugwor is an Afro-Asiatic language spoken in northern Cameroon.
in scheme: Lexvo - ISO 639-3 language codes
notation: dme

Upper Kinabatangan
type: Language
type: Concept
ISO 639-3 code: dmg
alternative label: Kinabatangan, Upper
in scheme: Lexvo - ISO 639-3 language codes
notation: dmg

Domaaki
type: Language
type: Concept
ISO 639-3 code: dmk
alternative label: Domaaki language
definition: Domaakí – also known as Dumaki or Domaá – is a language spoken by a few hundred people living in the Northern Areas of Pakistan.
in scheme: Lexvo - ISO 639-3 language codes
notation: dmk

Dameli
type: Language
type: Concept
ISO 639-3 code: dml
alternative label: Dameli language
definition: Dameli is a language spoken by approximately 5,000 people in the Domel Valley, in the Chitral District of Khyber-Pakhtunkhwa province of Pakistan.
in scheme: Lexvo - ISO 639-3 language codes
notation: dml

Dama
type: Language
type: Concept
ISO 639-3 code: dmm
in scheme: Lexvo - ISO 639-3 language codes
notation: dmm

Kemedzung
type: Language
type: Concept
ISO 639-3 code: dmo
alternative label: Kemezung language
definition: Kemezung (Dumbo, Dumbu, Dzumbo, Kumaju) is a Bantoid (Eastern Beboid) language of Cameroon. According to Ethnologue, it's 85% lexically similar to Bebe.
in scheme: Lexvo - ISO 639-3 language codes
notation: dmo
preferred label: Kemezung @de

East Damar
type: Language
type: Concept
ISO 639-3 code: dmr
alternative label: Damar, East
in scheme: Lexvo - ISO 639-3 language codes
notation: dmr

Dampelas
type: Language
type: Concept
ISO 639-3 code: dms
in scheme: Lexvo - ISO 639-3 language codes
notation: dms

Dubu
type: Language
type: Concept
ISO 639-3 code: dmu
alternative label: Tebi
in scheme: Lexvo - ISO 639-3 language codes
notation: dmu

Dumpas
type: Language
type: Concept
ISO 639-3 code: dmv
in scheme: Lexvo - ISO 639-3 language codes
notation: dmv

Mudburra
type: Language
type: Concept
in scheme: Lexvo - ISO 639-3 language codes

Dema
type: Language
type: Concept
ISO 639-3 code: dmx
in scheme: Lexvo - ISO 639-3 language codes
notation: dmx

Guevea De Humboldt Zapotec
type: Language
type: Concept
ISO 639-3 code: zpg
alternative label: Zapotec, Guevea De Humboldt
in scheme: Lexvo - ISO 639-3 language codes
notation: zpg

Demta
type: Language
type: Concept
ISO 639-3 code: dmy
alternative label: Demta language
alternative label: Sowari
definition: Demta, also known as Sowari and Muris, is a Papuan language on the north coast of Papua, Indonesia.
in scheme: Lexvo - ISO 639-3 language codes
notation: dmy

Hadrami
type: Language
type: Concept
ISO 639-3 code: xhd
alternative label: Hadramautic language
in scheme: Lexvo - ISO 639-3 language codes
notation: xhd

Upper Grand Valley Dani
type: Language
type: Concept
ISO 639-3 code: dna
alternative label: Dani, Upper Grand Valley
in scheme: Lexvo - ISO 639-3 language codes
notation: dna

Daonda
type: Language
type: Concept
ISO 639-3 code: dnd
in scheme: Lexvo - ISO 639-3 language codes
notation: dnd

Ndendeule
type: Language
type: Concept
ISO 639-3 code: dne
alternative label: Ndendeule language
definition: Ndendeule is a Bantu language of Tanzania. Speakers are mostly monolingual.
in scheme: Lexvo - ISO 639-3 language codes
notation: dne

Dungan
type: Language
type: Concept
ISO 639-3 code: dng
alternative label: Dungan language
definition: The Dungan language is a Sinitic language spoken by the Dungan of Central Asia, an ethnic group related to the Hui people of China.
in scheme: Lexvo - ISO 639-3 language codes
notation: dng
preferred label: Doungane @fr
preferred label: Dunganische Sprache @de

Lower Grand Valley Dani
type: Language
type: Concept
ISO 639-3 code: dni
alternative label: Dani, Lower Grand Valley
in scheme: Lexvo - ISO 639-3 language codes
notation: dni

Dan
type: Language
type: Concept
in scheme: Lexvo - ISO 639-3 language codes

Dengka
type: Language
type: Concept
ISO 639-3 code: dnk
in scheme: Lexvo - ISO 639-3 language codes
notation: dnk

Dzùùngoo
type: Language
type: Concept
ISO 639-3 code: dnn
in scheme: Lexvo - ISO 639-3 language codes
notation: dnn

Danaru
type: Language
type: Concept
ISO 639-3 code: dnr
in scheme: Lexvo - ISO 639-3 language codes
notation: dnr

Mid Grand Valley Dani
type: Language
type: Concept
ISO 639-3 code: dnt
alternative label: Dani, Mid Grand Valley
in scheme: Lexvo - ISO 639-3 language codes
notation: dnt

Khetrani
type: Language
type: Concept
ISO 639-3 code: xhe
alternative label: Khetrani language
definition: Khetrani or Khetranki is an Indo Indo-European language. It is spoken in north east Balochistan province in Pakistan. The population is speaking this language is 4,000.
in scheme: Lexvo - ISO 639-3 language codes
notation: xhe

Danau
type: Language
type: Concept
ISO 639-3 code: dnu
alternative label: Danau language
definition: Danau (Danaw) is a Mon–Khmer language of Burma.
in scheme: Lexvo - ISO 639-3 language codes
notation: dnu

Danu
type: Language
type: Concept
ISO 639-3 code: dnv
in scheme: Lexvo - ISO 639-3 language codes
notation: dnv

Western Dani
type: Language
type: Concept
ISO 639-3 code: dnw
alternative label: Dani, Western
alternative label: Western Dani language
definition: Western Dani, or Laani, is the most populous Papuan language in Indonesian New Guinea. The Swart Valley tribes are called Oeringoep and Timorini in literature from the 1920s, but those names are no longer used.
in scheme: Lexvo - ISO 639-3 language codes
notation: dnw

Dení
type: Language
type: Concept
ISO 639-3 code: dny
alternative label: Deni language
definition: Deni (also Dení, Dani) is an Arawan language spoken in Brazil. Deni is very similar to the other languages of the Arawan language family, but is especially similar to the Jamamadi language.
in scheme: Lexvo - ISO 639-3 language codes
notation: dny

Dom
type: Language
type: Concept
ISO 639-3 code: doa
in scheme: Lexvo - ISO 639-3 language codes
notation: doa

Dobu
type: Language
type: Concept
ISO 639-3 code: dob
in scheme: Lexvo - ISO 639-3 language codes
notation: dob

Northern Dong
type: Language
type: Concept
ISO 639-3 code: doc
alternative label: Dong, Northern
in scheme: Lexvo - ISO 639-3 language codes
notation: doc

Doe
type: Language
type: Concept
ISO 639-3 code: doe
in scheme: Lexvo - ISO 639-3 language codes
notation: doe

Domu
type: Language
type: Concept
ISO 639-3 code: dof
in scheme: Lexvo - ISO 639-3 language codes
notation: dof

Dong
type: Language
type: Concept
ISO 639-3 code: doh
alternative label: Donga language
definition: Dong, or Donga, is a poorly documented language of Nigeria. Though clearly Niger–Congo, is difficult to classify; Blench proposes that it is one of the Dakoid languages, closest to Gaa.
in scheme: Lexvo - ISO 639-3 language codes
notation: doh

Dogri
type: Language
type: Concept
ISO 639-2 Bibliographical code: doi
ISO 639-2 Terminological code: doi
ISO 639-3 code: doi
alternative label: Dogri (macrolanguage)
alternative label: Dogri language
alternative label: Idioma dogri @es
alternative label: Língua dogri @pt
definition: Dogri (डोगरी or ڈوگرى) is an Indo-Aryan language spoken by about five million people in India and Pakistan, chiefly in the Jammu region of Jammu and Kashmir, Himachal Pradesh, but also in northern Punjab, other parts of Jammu and Kashmir, and elsewhere. Dogri speakers are called Dogras, and the Dogri-speaking region is called Duggar. Dogri is a member of the Western Pahari Group of languages. The language is referred to as Pahari (पहाड़ी or پھاڑی) in Pakistan and Pakistani-administered parts of Kashmir. Unusually for an Indo-European language, Dogri is tonal, a trait it shares with other Western Pahari languages and Punjabi.
in scheme: Lexvo - ISO 639-3 language codes
notation: doi
preferred label: dogri @es

Xhosa
type: Language
type: Concept
ISO 639-1 code: xh
ISO 639-2 Bibliographical code: xho
ISO 639-2 Terminological code: xho
ISO 639-3 code: xho
alternative label: Idioma xhosa @es
alternative label: IsiXhosa @de
alternative label: Lingua xhosa @it
alternative label: Língua xhosa @pt
alternative label: Xhosa language
definition: Xhosa (, Xhosa: ) is one of the official languages of South Africa. Xhosa is spoken by approximately 7.9 million people, or about 18% of the South African population. Like most Bantu languages, Xhosa is a tonal language, that is, the same sequence of consonants and vowels can have different meanings when said with a rising or falling or high or low intonation. One of the most distinctive features of the language is the prominence of click consonants; the word "Xhosa" begins with a click.
in scheme: Lexvo - ISO 639-3 language codes
notation: xho
preferred label: xhosa @es
preferred label: xosa @it

Dondo
type: Language
type: Concept
ISO 639-3 code: dok
in scheme: Lexvo - ISO 639-3 language codes
notation: dok

Doso
type: Language
type: Concept
ISO 639-3 code: dol
alternative label: Doso language
definition: Doso is an unclassified language of New Guinea. It is spoken near Kamula but does not appear to be related to it; not enough is known to tell if it may be related to other languages in the area.
in scheme: Lexvo - ISO 639-3 language codes
notation: dol

Toura
type: Language
type: Concept
ISO 639-3 code: don
alternative label: Toura (Papua New Guinea)
in scheme: Lexvo - ISO 639-3 language codes
notation: don

Dongo
type: Language
type: Concept
ISO 639-3 code: doo
alternative label: Dongo language
definition: Dongo (Donga, Dongo Ko) is a Ubangian language spoken in DRC Congo.
in scheme: Lexvo - ISO 639-3 language codes
notation: doo

Lukpa
type: Language
type: Concept
ISO 639-3 code: dop
alternative label: Lukpa language
definition: Lukpa (Legba, Logba) is a Gur language spoken in Benin and Togo.
in scheme: Lexvo - ISO 639-3 language codes
notation: dop
preferred label: Lokpa @fr

Dominican Sign Language
type: Language
type: Concept
ISO 639-3 code: doq
in scheme: Lexvo - ISO 639-3 language codes
notation: doq

Dori'o
type: Language
type: Concept
ISO 639-3 code: dor
alternative label: Dori'o language
definition: Dori'o (also known as Kwarekwareo) is an Oceanic language of the Solomon Islands.
in scheme: Lexvo - ISO 639-3 language codes
notation: dor

Dogosé
type: Language
type: Concept
ISO 639-3 code: dos
alternative label: Doghose language
definition: Dogosé, or Doghose, is a Gur language of Burkina Faso.
in scheme: Lexvo - ISO 639-3 language codes
notation: dos

Dass
type: Language
type: Concept
ISO 639-3 code: dot
alternative label: Dass language
definition: Dass (also known as Barawa) is an Afro-Asiatic language spoken in Bauchi State and Plateau State, Nigeria.
in scheme: Lexvo - ISO 639-3 language codes
notation: dot

Dombe
type: Language
type: Concept
ISO 639-3 code: dov
in scheme: Lexvo - ISO 639-3 language codes
notation: dov

Doyayo
type: Language
type: Concept
ISO 639-3 code: dow
alternative label: Doyayo language
definition: The Dowayo language (Doyayo) is a member of the Duru branch of Savanna languages.
in scheme: Lexvo - ISO 639-3 language codes
notation: dow

Bussa
type: Language
type: Concept
ISO 639-3 code: dox
alternative label: Bussa language
definition: Bussa (also known as Muusiye, Dobase, Doopace, Dopaasunte, Lohu, Mashile, Mashelle, Masholle, Mosiye, Musiye, Gobeze, Gowase, Goraze, Orase) is an East Cushitic language spoken in the Dirashe special woreda of the Southern Nations, Nationalities, and People's Region located in southern Ethiopia. The people themselves, numbering 19,628 according to the 2007 census, call their language Mossittaata. Two varieties can be distinguished: North and West Bussa.
in scheme: Lexvo - ISO 639-3 language codes
notation: dox

Dompo
type: Language
type: Concept
ISO 639-3 code: doy
in scheme: Lexvo - ISO 639-3 language codes
notation: doy

Dorze
type: Language
type: Concept
ISO 639-3 code: doz
alternative label: Dorze language
definition: Dorze is an Afro-Asiatic language spoken in the Gamo Gofa Zone of Ethiopia. Alemayehu Abebe reports that while performing preliminary fieldwork in 1992, he found 14 kebeles in Chencha woreda with Dorze speakers.
in scheme: Lexvo - ISO 639-3 language codes
notation: doz
preferred label: Dorzé @fr

Papar
type: Language
type: Concept
ISO 639-3 code: dpp
in scheme: Lexvo - ISO 639-3 language codes
notation: dpp

Dair
type: Language
type: Concept
ISO 639-3 code: drb
in scheme: Lexvo - ISO 639-3 language codes
notation: drb

Minderico
type: Language
type: Concept
ISO 639-3 code: drc
alternative label: Minderico language
definition: Minderico, also known as Piação do Ninhou (the language of Minde), was originally a sociolect or a secret language spoken by textile producers and traders in the freguesia (civil parish) of Minde (Alcanena, Portugal). After this initial phase (18th century), Minderico began to expand its vocabulary continuously and creatively. This expansion was (and continues to be) intimately related to the socio-cultural experiences of the inhabitants of Minde. For example, names and nicknames of well-known persons from Minde and the neighbouring areas were used as lexemes to express physical or psychological characteristics, as these characteristics were salient for those persons. This method of lexical formation can be explained by the fact that Minde, due to its geographical isolation, is a small and close knit community, where everyone knows one another. Therefore, using names of persons as a means to express the characteristics associated to them was immediately understood amongst members of the speech community; this was not an obstacle to effective communication.
in scheme: Lexvo - ISO 639-3 language codes
notation: drc

Darmiya
type: Language
type: Concept
ISO 639-3 code: drd
in scheme: Lexvo - ISO 639-3 language codes
notation: drd

Dolpo
type: Language
type: Concept
ISO 639-3 code: dre
in scheme: Lexvo - ISO 639-3 language codes
notation: dre

Rungus
type: Language
type: Concept
ISO 639-3 code: drg
in scheme: Lexvo - ISO 639-3 language codes
notation: drg

C'lela
type: Language
type: Concept
ISO 639-3 code: dri
alternative label: Lela language
definition: Lela or C’lela (Chilela) is a Kainji language of Nigeria. It is known as Dakarkari in Hausa.
in scheme: Lexvo - ISO 639-3 language codes
notation: dri

Paakantyi
type: Language
type: Concept
ISO 639-3 code: drl
alternative label: Darling language
definition: The Darling language is an Australian aboriginal language spoken at the base of the Darling River in New South Wales. Other names for the language include Kula, Baagandji, and Southern Baagandji. The Darling People are now, after British settlement, nearly extinct. Only five elders are left speaking the language, and only several more are ethnically related. However, a dialect called Bagundji is widely understood. Other dialects are Kula and Wiljakali. It could be extinct.
in scheme: Lexvo - ISO 639-3 language codes
notation: drl

West Damar
type: Language
type: Concept
ISO 639-3 code: drn
alternative label: Damar, West
alternative label: West Damar language
definition: West Damar, or North Damar, is an Austronesian language of the Maluku Islands of Indonesia.
in scheme: Lexvo - ISO 639-3 language codes
notation: drn

Daro-Matu Melanau
type: Language
type: Concept
ISO 639-3 code: dro
alternative label: Melanau, Daro-Matu
in scheme: Lexvo - ISO 639-3 language codes
notation: dro

Dura
type: Language
type: Concept
ISO 639-3 code: drq
alternative label: Dura language
definition: Dura is a critically endangered language of Nepal, and the ethnic group that has historically spoken it. It has been classified in the West Bodish branch of Tibetan languages, though more recent work separates it out as an independent branch of Tibeto-Burman. Many of the Dura have switched to speaking Nepali, and the Dura language has sometimes been thought to be extinct. Some of the people who have switched to Nepali for their daily speech still use Dura only for saying prayers.
in scheme: Lexvo - ISO 639-3 language codes
notation: drq

Dororo
type: Language
type: Concept
ISO 639-3 code: drr
alternative label: Dororo language
definition: Dororo or Doriri is an extinct language that was once spoken in New Georgia (Solomon Islands). Dororo might have been a dialect of the extinct Kazukuro language.
in scheme: Lexvo - ISO 639-3 language codes
notation: drr

Gedeo
type: Language
type: Concept
ISO 639-3 code: drs
alternative label: Gedeo language
definition: Gedeo is the name of a Highland East Cushitic language of the Afro-Asiatic family spoken in south central Ethiopia. Alternate names for the language include Derasa, Deresa, Darassa, Geddeo, Derasanya, Darasa. It is spoken by the Gedeo people, who live in the highland area, southwest of Dila and east of Lake Abaya.
in scheme: Lexvo - ISO 639-3 language codes
notation: drs

Drents
type: Language
type: Concept
ISO 639-3 code: drt
alternative label: Drèents
definition: Drèents (also Dreins, Dreints, Drents, Drints; ) is a collective term for the dialects spoken in Drenthe, a province of the Netherlands. The dialects, which are still spoken by half the population of Drenthe, are Dutch Low Saxon variants.
in scheme: Lexvo - ISO 639-3 language codes
notation: drt

Rukai
type: Language
type: Concept
ISO 639-3 code: dru
alternative label: Rukai language
definition: Rukai is the mother tongue of the Rukai, one indigenous people of Taiwan (see Taiwanese aborigines). It is a divergent Formosan language of the Austronesian languages language family. There are some 10,000 speakers, some monolingual. There are several dialects, of which Mantauran, Tona, and Maga are divergent.
in scheme: Lexvo - ISO 639-3 language codes
notation: dru
preferred label: Idioma rukai @es
preferred label: Lingua Rukai @it

Hernican
type: Language
type: Concept
ISO 639-3 code: xhr
in scheme: Lexvo - ISO 639-3 language codes
notation: xhr

Darai
type: Language
type: Concept
ISO 639-3 code: dry
in scheme: Lexvo - ISO 639-3 language codes
notation: dry

Lower Sorbian
type: Language
type: Concept
ISO 639-2 Bibliographical code: dsb
ISO 639-2 Terminological code: dsb
ISO 639-3 code: dsb
alternative label: Baixo sorábio @pt
alternative label: Bas-sorabe @fr
alternative label: Lingua lusaziana inferiore @it
alternative label: Lower Sorbian language
alternative label: Niedersorbische Sprache @de
alternative label: Sorbian, Lower
alternative label: sorbio inferior @es
definition: Lower Sorbian is a Slavic minority language spoken in eastern Germany in the historical province of Lower Lusatia, today part of Brandenburg. It is one of the two literary Sorbian languages, the other being Upper Sorbian.
in scheme: Lexvo - ISO 639-3 language codes
notation: dsb
preferred label: Bajo sorabo @es
preferred label: Niedersorbisch @de
preferred label: bas-sorabe @fr
preferred label: basso sorabo @it
preferred label: sérvio baixo @pt

Dutch Sign Language
type: Language
type: Concept
ISO 639-3 code: dse
definition: Dutch Sign Language (Nederlandse Gebarentaal or NGT; Sign Language of the Netherlands or SLN) is the sign language used by deaf people in the Netherlands and is not officially recognized. As of 1995, more and more schools for the deaf in The Netherlands teach Nederlands met Gebaren or NmG. This uses the same grammar as Dutch spoken language, in contrast to NGT.
in scheme: Lexvo - ISO 639-3 language codes
notation: dse
preferred label: Língua de sinais neerlandesa @pt

Daasanach
type: Language
type: Concept
ISO 639-3 code: dsh
alternative label: Daasanach language
definition: Daasanach (also known as Dasenech, Daasanech, Dathanaik, Dathanaic, Dathanik, Dhaasanac, Gheleba, Geleba, Geleb, Gelebinya, Gallab, Galuba, Gelab, Gelubba, Dama, Marille, Merile, Merille, Morille, Reshiat, Russia) is an Afro-Asiatic language spoken by the Daasanach in Ethiopia and Kenya whose homeland is along the Lower Omo River and on the shores of Lake Turkana.
in scheme: Lexvo - ISO 639-3 language codes
notation: dsh

Disa
type: Language
type: Concept
ISO 639-3 code: dsi
in scheme: Lexvo - ISO 639-3 language codes
notation: dsi

Danish Sign Language
type: Language
type: Concept
ISO 639-3 code: dsl
definition: Danish Sign Language (DSL) is the sign language used in Denmark.
in scheme: Lexvo - ISO 639-3 language codes
notation: dsl
preferred label: Língua de sinais dinamarquesa @pt

Dusner
type: Language
type: Concept
ISO 639-3 code: dsn
alternative label: Dusner language
definition: Dusner is spoken in the Wandamen Bay area Cenderawasih Bay in the province of Papua, Indonesia. Dusner is highly endangered, and has been reported to have just three remaining speakers.
in scheme: Lexvo - ISO 639-3 language codes
notation: dsn

Hattic
type: Language
type: Concept
ISO 639-3 code: xht
alternative label: Hattic language
definition: Hattic was a language spoken by the Hattians in Asia Minor between the 3rd and the 2nd millennia BC. Scholars call this language Hattic to distinguish it from the Hittite language--the Indo-European language of the Hittite Empire.
in scheme: Lexvo - ISO 639-3 language codes
notation: xht
preferred label: Hattische Sprache @de
preferred label: Idioma hatti @es
preferred label: Língua hatita @pt

Desiya
type: Language
type: Concept
ISO 639-3 code: dso
in scheme: Lexvo - ISO 639-3 language codes
notation: dso

Tadaksahak
type: Language
type: Concept
ISO 639-3 code: dsq
alternative label: Tadaksahak language
definition: The Dawsahak language, Tadaksahak (also Daoussahak and other spellings) is a Songhay language spoken by the pastoralist Idaksahak of the Ménaka area of Mali. Its phonology, verb morphology, and vocabulary has been strongly influenced by the neighboring Tuareg languages, Tamasheq and Tamajaq.
in scheme: Lexvo - ISO 639-3 language codes
notation: dsq

Daur
type: Language
type: Concept
ISO 639-3 code: dta
alternative label: Daur language
definition: The Daur or Dagur language is a Mongolic language primarily spoken by members of the Daur ethnic group.
in scheme: Lexvo - ISO 639-3 language codes
notation: dta

Labuk-Kinabatangan Kadazan
type: Language
type: Concept
ISO 639-3 code: dtb
alternative label: Kadazan, Labuk-Kinabatangan
in scheme: Lexvo - ISO 639-3 language codes
notation: dtb

Ditidaht
type: Language
type: Concept
ISO 639-3 code: dtd
alternative label: Ditidaht language
definition: Ditidaht (also Nitinaht, Nitinat, Southern Nootkan) is a South Wakashan (Nootkan) language spoken on the southern part of Vancouver Island. Nitinaht is related to the other South Wakashan languages, Makah and the neighboring Nuu-chah-nulth.
in scheme: Lexvo - ISO 639-3 language codes
notation: dtd
preferred label: Nitinaht @fr

Adithinngithigh
type: Language
type: Concept
ISO 639-3 code: dth
in scheme: Lexvo - ISO 639-3 language codes
notation: dth

Ana Dogon
type: Language
type: Concept
ISO 639-3 code: dti
alternative label: Ana Tinga Dogon
alternative label: Dogon, Ana Tinga
definition: Ana Dogon, or Ana Tiŋa, is a recently discovered Dogon language spoken in Mali. It was first reported online by Roger Blench.
in scheme: Lexvo - ISO 639-3 language codes
notation: dti

Tene Kan Dogon
type: Language
type: Concept
ISO 639-3 code: dtk
alternative label: Dogon, Tene Kan
in scheme: Lexvo - ISO 639-3 language codes
notation: dtk

Tomo Kan Dogon
type: Language
type: Concept
ISO 639-3 code: dtm
alternative label: Dogon, Tomo Kan
in scheme: Lexvo - ISO 639-3 language codes
notation: dtm

Tommo So Dogon
type: Language
type: Concept
ISO 639-3 code: dto
alternative label: Dogon, Tommo So
in scheme: Lexvo - ISO 639-3 language codes
notation: dto

Central Dusun
type: Language
type: Concept
ISO 639-3 code: dtp
alternative label: Dusun language
alternative label: Dusun, Central
definition: Dusun (Dusun:Boros Dusun),is the language spoken by the Dusun people of Sabah, Malaysia.
in scheme: Lexvo - ISO 639-3 language codes
notation: dtp
preferred label: Língua dusun @pt

Lotud
type: Language
type: Concept
ISO 639-3 code: dtr
in scheme: Lexvo - ISO 639-3 language codes
notation: dtr

Toro So Dogon
type: Language
type: Concept
ISO 639-3 code: dts
alternative label: Dogon, Toro So
in scheme: Lexvo - ISO 639-3 language codes
notation: dts

Toro Tegu Dogon
type: Language
type: Concept
ISO 639-3 code: dtt
alternative label: Dogon, Toro Tegu
alternative label: Toro-tegu Dogon
definition: The Toro language, Tɔrɔ tegu Mountain speech, is a Dogon language spoken in Mali. It is closest to the prestige variety of Dogon, Jamsay tegu, though speakers deny they are related and understand little of it. (They understand nothing of the Dogon languages on the escarpment or plateau.) Hochstetler report difficulties in comprehension between Tɔrɔ tegu and one of the western Plains Dogon languages, Tomo kan.
in scheme: Lexvo - ISO 639-3 language codes
notation: dtt

Hurrian
type: Language
type: Concept
ISO 639-3 code: xhu
alternative label: Hurrian language
definition: Hurrian is a conventional name for the language of the Hurrians (Khurrites), a people who entered northern Mesopotamia around 2300 BC and had mostly vanished by 1000 BC. Hurrian was the language of the Mitanni kingdom in northern Mesopotamia, and was likely spoken at least initially in Hurrian settlements in Syria. It is generally believed that the speakers of this language originally came from the Armenian mountains and spread over southeast Anatolia and northern Mesopotamia at the beginning of the 2nd millennium BC.
in scheme: Lexvo - ISO 639-3 language codes
notation: xhu
preferred label: Hourrites#Langue @fr
preferred label: Hurritische Sprache @de
preferred label: Idioma hurrita @es
preferred label: Lingua hurrita @it

Tebul Dogon
type: Language
type: Concept
ISO 639-3 code: dtu
alternative label: Dogon, Tebul Ure
alternative label: Tebul Ure Dogon
definition: The Tebul language, Tebul Ure, is a Dogon language spoken in Mali by the Tebul U (Tebul people). It was first reported under this name online by Roger Blench, who reports that it appears to be the same as a language called Oru Yille in the literature. That name is an error; it means two words in the Tebul language.
in scheme: Lexvo - ISO 639-3 language codes
notation: dtu

Dotyali
type: Language
type: Concept
ISO 639-3 code: dty
in scheme: Lexvo - ISO 639-3 language codes
notation: dty

Douala
type: Language
type: Concept
ISO 639-2 Bibliographical code: dua
ISO 639-2 Terminological code: dua
ISO 639-3 code: dua
alternative label: Duala language
alternative label: Língua duala @pt
alternative label: douala @fr
definition: Duala (also spelled Douala, Diwala, Dwela, Dualla, and Dwala) is the language spoken by the Duala and Mungo peoples of Cameroon. The language belonges to the Bantu language family, and a subgroup of it called the Sawabantu languages. The song "Soul Makossa", as well as pop songs that repeated its lyrics, internationally popularized the Duala word for "(I) dance", "makossa".
in scheme: Lexvo - ISO 639-3 language codes
notation: dua
preferred label: Duala
preferred label: duala @es

Dubli
type: Language
type: Concept
ISO 639-3 code: dub
in scheme: Lexvo - ISO 639-3 language codes
notation: dub

Duna
type: Language
type: Concept
ISO 639-3 code: duc
alternative label: Duna language
definition: Duna (Yuna) is a Papuan language of Papua New Guinea.
in scheme: Lexvo - ISO 639-3 language codes
notation: duc

Hun-Saare
type: Language
type: Concept
ISO 639-3 code: dud
alternative label: Duka language
definition: Duka, or Saare, is a Kainji language of Nigeria. The eastern and western dialects are known as Hun and Saare in the literature, but speakers use Saare for both.
in scheme: Lexvo - ISO 639-3 language codes
notation: dud

Umiray Dumaget Agta
type: Language
type: Concept
ISO 639-3 code: due
alternative label: Agta, Umiray Dumaget
in scheme: Lexvo - ISO 639-3 language codes
notation: due

Drubea
type: Language
type: Concept
ISO 639-3 code: duf
alternative label: Dumbea
alternative label: Ndrumbea language
definition: Ndrumbea, variously spelled Ndumbea, Dubea, Drubea and Païta, is a New Caledonian language that gave its name to the capital of New Caledonia, Nouméa, and the neighboring town of Dumbéa. It has been displaced to villages outside the capital, with fewer than a thousand speakers remaining. Gordon (1995) estimates that there may only be two or three hundred. The Dubea are the people; the language has been called Naa Dubea (or more precisely ) "language of Dubea".
in scheme: Lexvo - ISO 639-3 language codes
notation: duf

Duruma
type: Language
type: Concept
ISO 639-3 code: dug
alternative label: Chiduruma
in scheme: Lexvo - ISO 639-3 language codes
notation: dug

Dungra Bhil
type: Language
type: Concept
ISO 639-3 code: duh
in scheme: Lexvo - ISO 639-3 language codes
notation: duh

Dumun
type: Language
type: Concept
ISO 639-3 code: dui
in scheme: Lexvo - ISO 639-3 language codes
notation: dui

Dhuwal
type: Language
type: Concept
ISO 639-3 code: duj
alternative label: Dhuwal language
definition: Dhuwal (also called Duala, Dual, or Wulamba) is an Australian Aboriginal language. In 1983, it was spoken by about 500 people in Australia's Northern Territory. Now it is spoken by about 3,650 individuals according to Ethnologue.
in scheme: Lexvo - ISO 639-3 language codes
notation: duj

Uyajitaya
type: Language
type: Concept
ISO 639-3 code: duk
in scheme: Lexvo - ISO 639-3 language codes
notation: duk

Alabat Island Agta
type: Language
type: Concept
ISO 639-3 code: dul
alternative label: Agta, Alabat Island
in scheme: Lexvo - ISO 639-3 language codes
notation: dul

Middle Dutch
type: Language
type: Concept
ISO 639-2 Bibliographical code: dum
ISO 639-2 Terminological code: dum
ISO 639-3 code: dum
alternative label: Dutch, Middle (ca. 1050-1350)
alternative label: Dutch, Middle (ca.1050-1350)
alternative label: Middle Dutch (ca. 1050-1350)
alternative label: Olandese medio @it
alternative label: moyen néerlandais @fr
alternative label: néerlandais moyen (ca. 1050-1350) @fr
definition: Middle Dutch is a collective name for a number of closely related West Germanic dialects (whose ancestor was Old Dutch) which were spoken and written between 1150 and 1500. There was at that time as yet no overarching standard language, but they were all mutually intelligible.
in scheme: Lexvo - ISO 639-3 language codes
notation: dum
preferred label: Mittelniederländisch @de
preferred label: Moyen néerlandais @fr
preferred label: holandês médio @pt
preferred label: neerlandés medieval @es
preferred label: olandese medio @it

Khua
type: Language
type: Concept
ISO 639-3 code: xhv
in scheme: Lexvo - ISO 639-3 language codes
notation: xhv

Dusun Deyah
type: Language
type: Concept
ISO 639-3 code: dun
in scheme: Lexvo - ISO 639-3 language codes
notation: dun

Dupaninan Agta
type: Language
type: Concept
ISO 639-3 code: duo
alternative label: Agta, Dupaninan
in scheme: Lexvo - ISO 639-3 language codes
notation: duo

Duano
type: Language
type: Concept
ISO 639-3 code: dup
in scheme: Lexvo - ISO 639-3 language codes
notation: dup

Dusun Malang
type: Language
type: Concept
ISO 639-3 code: duq
in scheme: Lexvo - ISO 639-3 language codes
notation: duq

Dii
type: Language
type: Concept
ISO 639-3 code: dur
alternative label: Dii language
definition: The Dii language is a member of the Duru branch of Savanna languages. Yag Dii is the ethnonym.
in scheme: Lexvo - ISO 639-3 language codes
notation: dur

Dumi
type: Language
type: Concept
ISO 639-3 code: dus
alternative label: Dumi language
definition: Dumi is a Kiranti language spoken in the area around the Tap and Rava rivers and their confluence in Khotang district, Nepal.
in scheme: Lexvo - ISO 639-3 language codes
notation: dus

Drung
type: Language
type: Concept
ISO 639-3 code: duu
alternative label: Derung language
definition: Derung, Dulong or Trung is a Tibeto-Burman language of the Derung people of China. The Derung have no written language. It is believed that the Derung and Nu (Anung) people are of the same origin and speak somewhat the same language. They share the same kinship terminology as well as other cultural features.
in scheme: Lexvo - ISO 639-3 language codes
notation: duu

Xiandao
type: Language
type: Concept
ISO 639-3 code: xia
in scheme: Lexvo - ISO 639-3 language codes
notation: xia

Duvle
type: Language
type: Concept
ISO 639-3 code: duv
alternative label: Duvle language
definition: Duvle (Sikwari) is a Lakes Plain language of Irian Jaya, Indonesia.
in scheme: Lexvo - ISO 639-3 language codes
notation: duv

Dusun Witu
type: Language
type: Concept
ISO 639-3 code: duw
in scheme: Lexvo - ISO 639-3 language codes
notation: duw

Duungooma
type: Language
type: Concept
ISO 639-3 code: dux
in scheme: Lexvo - ISO 639-3 language codes
notation: dux

Dicamay Agta
type: Language
type: Concept
ISO 639-3 code: duy
alternative label: Agta, Dicamay
in scheme: Lexvo - ISO 639-3 language codes
notation: duy

Duli
type: Language
type: Concept
ISO 639-3 code: duz
in scheme: Lexvo - ISO 639-3 language codes
notation: duz

Duau
type: Language
type: Concept
ISO 639-3 code: dva
in scheme: Lexvo - ISO 639-3 language codes
notation: dva

Totomachapan Zapotec
type: Language
type: Concept
ISO 639-3 code: zph
alternative label: Zapotec, Totomachapan
in scheme: Lexvo - ISO 639-3 language codes
notation: zph

Diri
type: Language
type: Concept
ISO 639-3 code: dwa
alternative label: Diri language
definition: Diri is an Afro-Asiatic language spoken in Bauchi State, Nigeria.
in scheme: Lexvo - ISO 639-3 language codes
notation: dwa

Iberian
type: Language
type: Concept
ISO 639-3 code: xib
alternative label: Iberian language
definition: The Iberian language was the language of a people identified by Greek and Roman sources who lived in the eastern and southeastern regions of the Iberian peninsula. The ancient Iberians can be identified as a rather nebulous local culture between the 7th and 1st century BC. The Iberian language, as the other paleohispanic languages, except Basque, became extinct by the 1st to 2nd centuries AD, after being gradually replaced by Latin. Iberian is speculated to be a language isolate, but while its different scripts have been deciphered to various extents, the language itself remains largely unknown.
in scheme: Lexvo - ISO 639-3 language codes
notation: xib
preferred label: Iberische Sprache @de
preferred label: Ibère @fr
preferred label: Idioma ibero @es

Dawro
type: Language
type: Concept
ISO 639-3 code: dwr
in scheme: Lexvo - ISO 639-3 language codes
notation: dwr

Dutton World Speedwords
type: Language
type: Concept
ISO 639-3 code: dws
in scheme: Lexvo - ISO 639-3 language codes
notation: dws

Dawawa
type: Language
type: Concept
ISO 639-3 code: dww
in scheme: Lexvo - ISO 639-3 language codes
notation: dww

Dyan
type: Language
type: Concept
ISO 639-3 code: dya
alternative label: Dyan language
definition: Dyan (Dan, Dian, Dya, Dyane, Dyanu) is a Gur language of Burkina Faso. Zanga is either a divergent dialect or a closely related language.
in scheme: Lexvo - ISO 639-3 language codes
notation: dya

Dyaberdyaber
type: Language
type: Concept
ISO 639-3 code: dyb
alternative label: Djabirr-Djabirr language
definition: Dyaberdyaber (Jabirr-Jabirr) is a Western Nyulnyulan language formerly spoken on the coast south of Beagle Bay in Western Australia.
in scheme: Lexvo - ISO 639-3 language codes
notation: dyb

Dyugun
type: Language
type: Concept
ISO 639-3 code: dyd
alternative label: Djugun language
definition: Jukun or Djugun is an Australian Aboriginal language of Western Australia. There are no longer any fluent speakers of Jukun, but some people may remember it to some degree.
in scheme: Lexvo - ISO 639-3 language codes
notation: dyd

Villa Viciosa Agta
type: Language
type: Concept
ISO 639-3 code: dyg
alternative label: Agta, Villa Viciosa
in scheme: Lexvo - ISO 639-3 language codes
notation: dyg

Djimini Senoufo
type: Language
type: Concept
ISO 639-3 code: dyi
alternative label: Djimini language
alternative label: Senoufo, Djimini
definition: Djimini (Jinmini) is a southern Senufo of Ivory Coast. Blacksmiths among the Djimini once spoke Tonjon, a Mande language.
in scheme: Lexvo - ISO 639-3 language codes
notation: dyi
preferred label: Dschimini @de

Yanda Dogon
type: Language
type: Concept
ISO 639-3 code: dym
alternative label: Dogon, Yanda Dom
alternative label: Yanda Dom Dogon
definition: Yanda Dogon is a Dogon language spoken in Mali. It is reported to be lexically similar to Nanga, which is only known from one report from 1953.
in scheme: Lexvo - ISO 639-3 language codes
notation: dym

Dyangadi
type: Language
type: Concept
ISO 639-3 code: dyn
in scheme: Lexvo - ISO 639-3 language codes
notation: dyn

Jola-Fonyi
type: Language
type: Concept
ISO 639-3 code: dyo
alternative label: Jola-Fonyi language
definition: Jola or Diola, also called Jola-Fonyi, is a language spoken by half a million people in the Casamance region of Senegal, and neighboring countries. The French spelling is Diola and Diola Fogny. Jola people themselves say that a person is ajoola and they speak joola.
in scheme: Lexvo - ISO 639-3 language codes
notation: dyo
preferred label: diola-fogny @fr
preferred label: jola-fony @it
preferred label: jola-fonyi @es

Dyula
type: Language
type: Concept
ISO 639-2 Bibliographical code: dyu
ISO 639-2 Terminological code: dyu
ISO 639-3 code: dyu
alternative label: Dyula language
alternative label: Dyula-Sprache @de
alternative label: Idioma diula @es
alternative label: Lingua dioula @it
alternative label: Língua dioula @pt
alternative label: dioula @fr
alternative label: diúla @pt
definition: Jula (Dyula, Dioula) is a Mande language spoken in Burkina Faso, Côte dIvoire and Mali. It is one of the Manding languages, and is most closely related to Bambara, being mutually intelligible with Bambara as well as Malinke. It is a trade language in West Africa and is spoken by millions of people, either as a first or second language. It is written in the Arabic script and the Latin script, as well as in the indigenous NKo alphabet.
in scheme: Lexvo - ISO 639-3 language codes
notation: dyu
preferred label: Dioula @de
preferred label: diula @es

Dyaabugay
type: Language
type: Concept
ISO 639-3 code: dyy
alternative label: Djabugay language
definition: Djabugay (many other names; see below) is a nearly extinct Australian Aboriginal language once spoken by Djabugay people.
in scheme: Lexvo - ISO 639-3 language codes
notation: dyy

Tunzu
type: Language
type: Concept
ISO 639-3 code: dza
in scheme: Lexvo - ISO 639-3 language codes
notation: dza

Língua xiri
type: Language
type: Concept
ISO 639-3 code: xii
alternative label: Xiri language
definition: Xiri or Xirikwa, in Afrikaans orthography Gri or Griqua (ethnonym Xirigowap, also called "Cape Hottentot"), is a Khoe language of South Africa. It is related to Nama. Xiri was once spoken along the entire coast of South Africa from Namibia to Lesotho, but it is now moribund, with less than a hundred scattered speakers left.
in scheme: Lexvo - ISO 639-3 language codes
notation: xii
preferred label: Xiri

Daza
type: Language
type: Concept
ISO 639-3 code: dzd
alternative label: Dazawa language
definition: Daza (also known as Dazawa) is an Afro-Asiatic language of unclear affiliation spoken in a few villages of Darazo LGA, Bauchi State, Nigeria.
in scheme: Lexvo - ISO 639-3 language codes
notation: dzd

Djiwarli
type: Language
type: Concept
in scheme: Lexvo - ISO 639-3 language codes

Dazaga
type: Language
type: Concept
ISO 639-3 code: dzg
alternative label: Dazaga language
definition: The Daza language, Dazaga, also known as Goran (Arabic قرعان), is a language spoken in the Djurab desert region of Chad by the Daza people, and is part of the Saharan branch of the Nilo-Saharan language family. It is said to have about 312,000 speakers. It is closely associated with the Tedaga language, spoken by the Teda, the other Toubou people.
in scheme: Lexvo - ISO 639-3 language codes
notation: dzg
preferred label: dazaga @es

Dzalakha
type: Language
type: Concept
ISO 639-3 code: dzl
alternative label: Dzala language
definition: The Dzala language, also called Dzalakha or Dzalamat, is a member of the Tibeto-Burman language family spoken in eastern Bhutan, in Lhuntse and Trashiyangtse Districts.
in scheme: Lexvo - ISO 639-3 language codes
notation: dzl

Dzando
type: Language
type: Concept
ISO 639-3 code: dzn
in scheme: Lexvo - ISO 639-3 language codes
notation: dzn

Dzongkha
type: Language
type: Concept
ISO 639-1 code: dz
ISO 639-2 Bibliographical code: dzo
ISO 639-2 Terminological code: dzo
ISO 639-3 code: dzo
alternative label: Bhutanisch @de
alternative label: Idioma dzongkha @es
alternative label: Lingua dzongkha @it
alternative label: Língua butanesa @pt
preferred label: dzongkha @es
definition: Dzongkha (; Wylie: rdzong-kha, Jong-kă), occasionally Ngalopkha, is the national language of Bhutan. The word "dzongkha" means the language (kha) spoken in the dzong, – dzong being the fortress-like monasteries established throughout Bhutan by Shabdrung Ngawang Namgyal in the 17th century.
in scheme: Lexvo - ISO 639-3 language codes
notation: dzo
preferred label: dzonga @pt

Karenggapa
type: Language
type: Concept
in scheme: Lexvo - ISO 639-3 language codes

Ebughu
type: Language
type: Concept
ISO 639-3 code: ebg
alternative label: Ebughu language
in scheme: Lexvo - ISO 639-3 language codes
notation: ebg

Eastern Bontok
type: Language
type: Concept
ISO 639-3 code: ebk
alternative label: Bontok, Eastern
in scheme: Lexvo - ISO 639-3 language codes
notation: ebk

Teke-Ebo
type: Language
type: Concept
ISO 639-3 code: ebo
in scheme: Lexvo - ISO 639-3 language codes
notation: ebo

Ebrié
type: Language
type: Concept
ISO 639-3 code: ebr
alternative label: Ebrié language
definition: Ebrié, or Cama (Caman, Kyama, Tchaman, Tsama, Tyama), is spoken in Ivory Coast and Ghana. It is a Potou language of the Kwa branch of the Niger–Congo family of languages.
in scheme: Lexvo - ISO 639-3 language codes
notation: ebr
preferred label: Tchaman @fr
preferred label: Tschaman @de

Embu
type: Language
type: Concept
ISO 639-3 code: ebu
alternative label: Embu language
alternative label: Kiembu
definition: Kîembu is a Bantu language of Kenya and spoken by the Aembu (sg. Muembu) or Embu people. ISO 639-3 code is ebu.
in scheme: Lexvo - ISO 639-3 language codes
notation: ebu
preferred label: embu @es
preferred label: kiembu @fr

Eteocretan
type: Language
type: Concept
ISO 639-3 code: ecr
in scheme: Lexvo - ISO 639-3 language codes
notation: ecr

Illyrian
type: Language
type: Concept
ISO 639-3 code: xil
alternative label: Illyrian languages
definition: The Illyrian languages are a group of Indo-European languages that were spoken in the western part of the Balkans in former times by groups identified as Illyrians: Ardiaei, Delmatae, Pannonii, Autariates, Taulanti (see List of Illyrian tribes). Some sound-changes from Proto-Indo-European to Illyrian and other language features are deduced from what remains of the Illyrian languages, but because there are no examples of ancient Illyrian literature surviving (aside from the Messapian writings if they can be considered Illyrian), it is difficult to clarify its place within the Indo-European language family. Because of the uncertainty, most sources provisionally place Illyrian on its own branch of Indo-European, though its relation to other languages, ancient and modern, continues to be studied.
in scheme: Lexvo - ISO 639-3 language codes
notation: xil
preferred label: Illyrische Sprache @de
preferred label: Lenguas ilirias @es
preferred label: Línguas ilírias @pt

Ecuadorian Sign Language
type: Language
type: Concept
ISO 639-3 code: ecs
definition: Ecuadorian Sign Language is the deaf sign language of Ecuador.
in scheme: Lexvo - ISO 639-3 language codes
notation: ecs
preferred label: Língua de Sinais do Equador @pt

Eteocypriot
type: Language
type: Concept
ISO 639-3 code: ecy
alternative label: Eteocypriot language
definition: Eteocypriot was a pre-Indo-European language spoken in Iron Age Cyprus. The name means "true" or "original Cyprian" parallel to Eteocretan, both of which names are used by modern scholarship to mean the pre-Greek languages of those places. Eteocypriot was written in the Cypriot syllabary, a syllabic script derived from Linear A (via the Cypro-Minoan variant Linear C). The language was under pressure from Arcadocypriot Greek from ca. the 10th century BC and finally became extinct in c. the 4th century BC.
in scheme: Lexvo - ISO 639-3 language codes
notation: ecy
preferred label: Eteocipriota @it
preferred label: Eteokyprische Sprache @de
preferred label: Idioma eteochipriota @es
preferred label: Língua eteocipriota @pt
preferred label: Étéocypriote @fr

E
type: Language
type: Concept
ISO 639-3 code: eee
alternative label: e language
definition: E (, ) is a Tai–Chinese mixed language. It is spoken by about 30,000 people, most of whom are classified as Zhuang by the Chinese government, living in the villages of Yongle and Sanfang Districts, Rongshui Miao Autonomous County, Guangxi. The speakers also refer to their language as Kjang E (Edmondso 1992:138).
in scheme: Lexvo - ISO 639-3 language codes
notation: eee
preferred label: Idioma e @es

Efai
type: Language
type: Concept
ISO 639-3 code: efa
in scheme: Lexvo - ISO 639-3 language codes
notation: efa

Efe
type: Language
type: Concept
ISO 639-3 code: efe
in scheme: Lexvo - ISO 639-3 language codes
notation: efe

Efik
type: Language
type: Concept
ISO 639-2 Bibliographical code: efi
ISO 639-2 Terminological code: efi
ISO 639-3 code: efi
alternative label: Efik language
definition: Efik (proper), also known as Riverain Ibibio, is the native language of the Efik people of Nigeria, where it is a national language. It is the official language of the Cross River State in Nigeria.
in scheme: Lexvo - ISO 639-3 language codes
notation: efi
preferred label: efik @es
preferred label: efique @pt

Ega
type: Language
type: Concept
ISO 639-3 code: ega
alternative label: Ega language
definition: Ega, also known as Egwa and Diés, is a language of uncertain affiliation within the Niger–Congo language family spoken Ivory Coast. It does not appear to belong to any of the traditional branches of Niger–Congo. Though traditionally assumed to be one of the Kwa languages, Roger Blench now classifies it as a separate branch of the Atlantic–Congo family, though perhaps not far from Kwa and the Volta–Niger languages.
in scheme: Lexvo - ISO 639-3 language codes
notation: ega

Emilian
type: Language
type: Concept
ISO 639-3 code: egl
alternative label: Emilian language
definition: The term Emilian refers to a group of local languages, popularly also called dialects, which are part of the Gallo-Italic group, and are spoken in the historical region of Emilia. Although commonly referred to as an Italian dialect (even by its speakers), it does not descend from the Italian language.
in scheme: Lexvo - ISO 639-3 language codes
notation: egl
preferred label: Dialecte émilien @fr
preferred label: Dialetto emiliano @it
preferred label: Emilianisch @de

Eggon
type: Language
type: Concept
ISO 639-3 code: ego
alternative label: Eggon language
definition: Eggon (also Egon, Ero, Mo Egon, Hill Mada, or Mada Eggon) is one of the Benue–Congo languages spoken in Nigeria. Eggon Taken from the introduction to "A dictionary of Eggon", edited by Roger Blench (in preparation) The Eggon language is spoken by a large number of people in Nassarawa State in Central Nigeria. These represent the modern Local Government Areas of Akwanga, Lafia and Nassarawa-Eggon. The main towns of the Eggon people are Akwanga, Nassarawa-Eggon, Kagbu and Wana. They stretch as far south as Lafia and west of Akwanga as far as the railway line. They are bordered on the north by the Mada and to the south by the Migili and the Doma.
in scheme: Lexvo - ISO 639-3 language codes
notation: ego

Egyptian
type: Language
type: Concept
ISO 639-2 Bibliographical code: egy
ISO 639-2 Terminological code: egy
ISO 639-3 code: egy
alternative label: Ancient Egyptian
alternative label: Egyptian (Ancient)
alternative label: egípcio clássico @pt
alternative label: égyptien ancien @fr
in scheme: Lexvo - ISO 639-3 language codes
notation: egy
preferred label: egipcio antiguo @es
preferred label: egiziano antico @it
preferred label: egípcio arcaico @pt
preferred label: Ägyptisch @de
preferred label: égyptien @fr

Ehueun
type: Language
type: Concept
ISO 639-3 code: ehu
in scheme: Lexvo - ISO 639-3 language codes
notation: ehu

Eipomek
type: Language
type: Concept
ISO 639-3 code: eip
in scheme: Lexvo - ISO 639-3 language codes
notation: eip

Eitiep
type: Language
type: Concept
ISO 639-3 code: eit
in scheme: Lexvo - ISO 639-3 language codes
notation: eit

Askopan
type: Language
type: Concept
ISO 639-3 code: eiv
alternative label: Askopan language
definition: Eivo Askopan is an East Papuan of Bougainville, an island to the east of New Guinea.
in scheme: Lexvo - ISO 639-3 language codes
notation: eiv

Ejamat
type: Language
type: Concept
ISO 639-3 code: eja
in scheme: Lexvo - ISO 639-3 language codes
notation: eja

Xinca
type: Language
type: Concept
ISO 639-3 code: xin
alternative label: Xinca language
definition: The Xinca language (Szinca) is a Mesoamerican language spoken by the indigenous Xinca people from communities in the southern portion of Guatemala, near its border with El Salvador and in the mountainous region to the north. The language is generally classed as a language isolate with no demonstrated affiliations with other language families, although a relationship with Lenca has been proposed.
in scheme: Lexvo - ISO 639-3 language codes
notation: xin
preferred label: Lenguas xincas @es
preferred label: Língua xinca @pt
preferred label: Xinca-Sprachen @de

Ekajuk
type: Language
type: Concept
ISO 639-2 Bibliographical code: eka
ISO 639-2 Terminological code: eka
ISO 639-3 code: eka
alternative label: Ekajuk language
definition: Ekajuk, also known as Akajo and Akajuk, is an Ekoid language (of the Niger–Congo family) spoken by thousands of people (30,000 according to a 1986 estimate) in the Cross River State and some surrounding regions of Nigeria.
in scheme: Lexvo - ISO 639-3 language codes
notation: eka
preferred label: ekajuk @es
preferred label: ekajuka @it

Eastern Karnic
type: Language
type: Concept
alternative label: Karnic, Eastern
in scheme: Lexvo - ISO 639-3 language codes

Ekit
type: Language
type: Concept
ISO 639-3 code: eke
alternative label: Eket language
definition: Ekit (Eket) is an Ibibio-Efik language of Nigeria.
in scheme: Lexvo - ISO 639-3 language codes
notation: eke

Ekari
type: Language
type: Concept
ISO 639-3 code: ekg
alternative label: Ekari language
definition: Ekari (also Ekagi, Kapauku) is a Trans–New Guinea language spoken by about 100,000 people in the Paniai lakes region of the Indonesian province of Papua, including the villages of Mapia and Moanamani. This makes it the second-most populous Papuan language in Indonesian New Guinea after Western Dani. Language use is vigorous. Documentation is quite limited.
in scheme: Lexvo - ISO 639-3 language codes
notation: ekg

Eki
type: Language
type: Concept
ISO 639-3 code: eki
in scheme: Lexvo - ISO 639-3 language codes
notation: eki

Standard Estonian
type: Language
type: Concept
ISO 639-3 code: ekk
alternative label: Estonian, Standard
in scheme: Lexvo - ISO 639-3 language codes
notation: ekk

Kol
type: Language
type: Concept
ISO 639-3 code: ekl
alternative label: Kol (Bangladesh)
in scheme: Lexvo - ISO 639-3 language codes
notation: ekl

Elip
type: Language
type: Concept
ISO 639-3 code: ekm
in scheme: Lexvo - ISO 639-3 language codes
notation: ekm

Koti
type: Language
type: Concept
ISO 639-3 code: eko
alternative label: Koti language
definition: The Koti language, or Ekoti (pronounced ), is a Bantu language spoken in Mozambique by about 64,200 people, the Koti people (Akoti). Koti is spoken on Koti Island and is also the major language of Angoche, the capital of the district with the same name in the province of Nampula.
in scheme: Lexvo - ISO 639-3 language codes
notation: eko
preferred label: Ekoti @fr

Ekpeye
type: Language
type: Concept
ISO 639-3 code: ekp
in scheme: Lexvo - ISO 639-3 language codes
notation: ekp

Yace
type: Language
type: Concept
ISO 639-3 code: ekr
in scheme: Lexvo - ISO 639-3 language codes
notation: ekr

Eastern Kayah
type: Language
type: Concept
ISO 639-3 code: eky
alternative label: Kayah, Eastern
in scheme: Lexvo - ISO 639-3 language codes
notation: eky

Elepi
type: Language
type: Concept
ISO 639-3 code: ele
in scheme: Lexvo - ISO 639-3 language codes
notation: ele

El Hugeirat
type: Language
type: Concept
ISO 639-3 code: elh
in scheme: Lexvo - ISO 639-3 language codes
notation: elh

Nding
type: Language
type: Concept
ISO 639-3 code: eli
alternative label: Nding language
definition: Nding is an extinct Niger–Congo language in the Talodi family of Kordofan, Sudan.
in scheme: Lexvo - ISO 639-3 language codes
notation: eli

Xipináwa
type: Language
type: Concept
ISO 639-3 code: xip
in scheme: Lexvo - ISO 639-3 language codes
notation: xip

Elkei
type: Language
type: Concept
ISO 639-3 code: elk
alternative label: Elkei language
definition: Elkei (Olkoi) is a Torricelli language of Papua New Guinea.
in scheme: Lexvo - ISO 639-3 language codes
notation: elk

Greek
type: Language
type: Concept
ISO 639-1 code: el
ISO 639-2 Bibliographical code: gre
ISO 639-2 Terminological code: ell
ISO 639-3 code: ell
alternative label: Grec moderne @fr
alternative label: Greek, Modern (1453-)
alternative label: Grego moderno @pt
alternative label: Griego moderno @es
alternative label: Lingua greca moderna @it
alternative label: Modern Greek
alternative label: Modern Greek (1453-)
alternative label: Neugriechische Sprache @de
alternative label: grec moderne (après 1453) @fr
definition: Modern Greek ( or , "Neo-Hellenic", historically and colloquially, also known as , "Romaic" or "Roman") refers to the varieties of the Greek language spoken in the modern era. The beginning of the "modern" period of the language is often symbolically assigned to the fall of the Byzantine Empire in 1453, even though that date marks no clear linguistic boundary and many characteristic modern features of the language had been present centuries earlier - from the fourth to the fifteenth century AD. During most of the period, the language existed in a situation of diglossia (due in part to the dark ages), with regional spoken dialects existing side by side with learned, archaic written forms. Most notably, during much of the 19th and 20th centuries, it was known in the competing varieties of popular Demotic and learned Katharevousa. Today, standard modern Greek, based on Demotic, is the official language of both Greece and Cyprus. Greek is spoken today by approximately 12-15 million people, mainly in Greece and Cyprus, but also by minority and immigrant communities in many other countries.
in scheme: Lexvo - ISO 639-3 language codes
notation: ell
preferred label: Griechisch @de
preferred label: grec @fr
preferred label: greco @it
preferred label: grego @pt
preferred label: griego @es

Eleme
type: Language
type: Concept
ISO 639-3 code: elm
alternative label: Eleme language
definition: Eleme is an Ogoni language of Nigeria.
in scheme: Lexvo - ISO 639-3 language codes
notation: elm

El Molo
type: Language
type: Concept
ISO 639-3 code: elo
alternative label: El Molo language
definition: El Molo is a nearly extinct Afro-Asiatic language spoken in Kenya on the southeastern shore of Lake Turkana. It may be extinct as all speakers in 1994 were over 50. El Molo was thought to be extinct in the middle part of the 20th century, but a few speakers were found in the latter half of that century.
in scheme: Lexvo - ISO 639-3 language codes
notation: elo

Elu
type: Language
type: Concept
ISO 639-3 code: elu
in scheme: Lexvo - ISO 639-3 language codes
notation: elu

Elamite
type: Language
type: Concept
ISO 639-2 Bibliographical code: elx
ISO 639-2 Terminological code: elx
ISO 639-3 code: elx
alternative label: Elamische Sprache @de
alternative label: Elamite language
alternative label: Idioma elamita @es
alternative label: Lingua elamitica @it
alternative label: Língua elamita @pt
alternative label: élamite @fr
definition: Elamite is an extinct language spoken by the ancient Elamites. Elamite was the primary language in present day Iran from 2800–550 BCE. The last written records in Elamite appear about the time of the conquest of the Persian Empire by Alexander the Great.
in scheme: Lexvo - ISO 639-3 language codes
notation: elx
preferred label: Elamisch @de
preferred label: elamita @es
preferred label: elamite @pt
preferred label: elamitico @it
preferred label: Élamite @fr

Emai-Iuleha-Ora
type: Language
type: Concept
ISO 639-3 code: ema
alternative label: Ivbiosakon language
definition: Ivbiosakon is an Edoid language of Edo State, Nigeria. The dialect names Ora and Emai are also used for the language.
in scheme: Lexvo - ISO 639-3 language codes
notation: ema
preferred label: Ivbiosakon @de

Xiriâna
type: Language
type: Concept
ISO 639-3 code: xir
alternative label: Shiriana language
definition: Shiriana (Xiriâna, Chiriana) is an unclassified Upper Amazon Arawakan language once spoken by the Shiriana people of Roraima, Brazil.
in scheme: Lexvo - ISO 639-3 language codes
notation: xir

Embaloh
type: Language
type: Concept
ISO 639-3 code: emb
alternative label: Embaloh language
definition: Mbalo (Embaloh) is an Austronesian (Dayak) language of Borneo. Apart from Taman, it is not close to other languages, and its classification has long been controversial. Adelaar and Himmelmann (2005) propose that it was especially close to Buginese. However, it is frequently left as an isolate within (Nuclear) Malayo-Polynesian, a position supported by a 2008 lexicostatistical study.
in scheme: Lexvo - ISO 639-3 language codes
notation: emb

Emerillon
type: Language
type: Concept
ISO 639-3 code: eme
alternative label: Emerillon language
definition: Emerillon (alternate names Emerilon, Emerion, Mereo, Melejo, Mereyo, Teco) is a Tupi–Guarani language spoken in French Guiana on the rivers Camopi and Tampok.
in scheme: Lexvo - ISO 639-3 language codes
notation: eme
preferred label: Émérillon @fr

Eastern Meohang
type: Language
type: Concept
ISO 639-3 code: emg
alternative label: Meohang, Eastern
in scheme: Lexvo - ISO 639-3 language codes
notation: emg

Mussau-Emira
type: Language
type: Concept
ISO 639-3 code: emi
alternative label: Mussau-Emira language
definition: The Mussau-Emira language is spoken on the islands of Mussau and Emirau in the St. Matthias Islands in the Bismarck Archipelago.
in scheme: Lexvo - ISO 639-3 language codes
notation: emi

Eastern Maninkakan
type: Language
type: Concept
ISO 639-3 code: emk
alternative label: Maninkakan, Eastern
in scheme: Lexvo - ISO 639-3 language codes
notation: emk

Mamulique
type: Language
type: Concept
ISO 639-3 code: emm
alternative label: Mamulique language
definition: Mamulique is an extinct Comecrudan language of Mexico.
in scheme: Lexvo - ISO 639-3 language codes
notation: emm

Eman
type: Language
type: Concept
ISO 639-3 code: emn
in scheme: Lexvo - ISO 639-3 language codes
notation: emn

Emok
type: Language
type: Concept
ISO 639-3 code: emo
in scheme: Lexvo - ISO 639-3 language codes
notation: emo

Northern Emberá
type: Language
type: Concept
ISO 639-3 code: emp
alternative label: Emberá, Northern
alternative label: Northern Embera language
definition: Northern Emberá, also known as West Embera and Cholo, is the largest Embera language. It is spoken largely in Colombia, but is also the principal language of the Darien Gap in Panama.
in scheme: Lexvo - ISO 639-3 language codes
notation: emp

Alutiiq language
type: Language
type: Concept
ISO 639-3 code: ems
alternative label: Pacific Gulf Yupik
alternative label: Yupik, Pacific Gulf
definition: The Alutiiq language (also called Sugpiak, Sugpiaq, Pacific Gulf Yupik, Chugach, Koniag-Chugach, Suk, Sugcestun) is a close relative to the Central Alaskan Yup'ik language spoken in the western and southwestern Alaska, but is considered a distinct language. It has two major dialects: * Koniag Alutiiq: spoken on the upper part of the Alaska Peninsula and on Kodiak Island; was also spoken on Afognak Island before it was deserted in the wake of the 1964 Good Friday Earthquake. * Chugach Alutiiq: spoken on the Kenai Peninsula and in Prince William Sound.
in scheme: Lexvo - ISO 639-3 language codes
notation: ems
preferred label: Alutiiq @de
preferred label: Idioma alutiiq @es
preferred label: Língua alutiiq @pt

Eastern Muria
type: Language
type: Concept
ISO 639-3 code: emu
alternative label: Muria, Eastern
in scheme: Lexvo - ISO 639-3 language codes
notation: emu

Harappan language
type: Language
type: Concept
ISO 639-3 code: xiv
alternative label: Indus Valley Language
definition: The Harappan language ( the Indus or Mohenjo-Daro language) is the unknown language or languages of the Bronze Age (2nd millennium BCE) Harappan civilization (Indus Valley Civilization, or IVC). The language being unattested in any readable contemporary source, hypotheses regarding its nature are reduced to purported loanwords and substratum influence, notably the substratum in Vedic Sanskrit and a few terms recorded in Sumerian cuneiform (such as Meluhha), in conjunction with analyses of the undeciphered Indus script.
in scheme: Lexvo - ISO 639-3 language codes
notation: xiv
preferred label: Idioma harapano @es

Emplawas
type: Language
type: Concept
ISO 639-3 code: emw
in scheme: Lexvo - ISO 639-3 language codes
notation: emw

Erromintxela
type: Language
type: Concept
ISO 639-3 code: emx
alternative label: Erromintxela language
definition: Erromintxela is the distinctive language of a group of Roma living in the Basque Country, who also go by the name Erromintxela. It is sometimes called Basque Caló or Errumantxela in English; caló vasco, romaní vasco, or errominchela in Spanish; and euskado-rromani or euskado-romani in French. Although detailed accounts of the language date to the end of the 19th century, linguistic research only began in the 1990s.
in scheme: Lexvo - ISO 639-3 language codes
notation: emx

Epigraphic Mayan
type: Language
type: Concept
ISO 639-3 code: emy
alternative label: Mayan, Epigraphic
in scheme: Lexvo - ISO 639-3 language codes
notation: emy

Apali
type: Language
type: Concept
ISO 639-3 code: ena
alternative label: Apali language
definition: Apali (Apal) is a Papuan language of Madang Province, Papua New Guinea. Aki (Aci) is a dialect.
in scheme: Lexvo - ISO 639-3 language codes
notation: ena

Markweeta
type: Language
type: Concept
ISO 639-3 code: enb
alternative label: Markweta language
definition: Markweta (Markweeta) is a Kalenjin language of Kenya. The regional terms Endo and Sambirir (or the clan name Talai) have been used for northern and southern Markweta, but they are not distinct dialects.
in scheme: Lexvo - ISO 639-3 language codes
notation: enb

En
type: Language
type: Concept
ISO 639-3 code: enc
alternative label: En language
definition: En (autonym: aiɲ53; also known as Nùng Vên) is a Kra language spoken in Vietnam. Before its discovery in 1998, En language was undistinguished from Nùng, which is a Central Tai language closely related to Zhuang. In the late 1990s, Vietnamese linguist Hoàng Văn Ma had first recognized that it was not a Tai language, ultimately leading to field work distinguishing En as a separate language. Researchers have determined En to be most closely related to the Buyang language.
in scheme: Lexvo - ISO 639-3 language codes
notation: enc

Ende
type: Language
type: Concept
ISO 639-3 code: end
in scheme: Lexvo - ISO 639-3 language codes
notation: end

Forest Enets
type: Language
type: Concept
ISO 639-3 code: enf
alternative label: Enets, Forest
in scheme: Lexvo - ISO 639-3 language codes
notation: enf

English
type: Language
type: Concept
ISO 639-1 code: en
ISO 639-2 Bibliographical code: eng
ISO 639-2 Terminological code: eng
ISO 639-3 code: eng
alternative label: Englische Sprache @de
alternative label: English language
alternative label: Idioma inglés @es
alternative label: Lingua inglese @it
alternative label: Língua inglesa @pt
alternative label: anglais @fr
definition: English is a West Germanic language that arose in the Anglo-Saxon kingdoms of England and spread into what was to become south-east Scotland under the influence of the Anglian medieval kingdom of Northumbria. Following the extensive influence of Great Britain and the United Kingdom from the 18th century, via the British Empire, and of the United States since the mid-20th century, it has been widely dispersed around the world, becoming the leading language of international discourse and the lingua franca in many regions. It is widely learned as a second language and used as an official language of the European Union and many Commonwealth countries, as well as in many world organisations. It is the third most natively spoken language in the world, after Mandarin Chinese and Spanish.
in scheme: Lexvo - ISO 639-3 language codes
notation: eng
preferred label: Anglais @fr
preferred label: Englisch @de
preferred label: inglese @it
preferred label: inglés @es
preferred label: inglês @pt

Tundra Enets
type: Language
type: Concept
ISO 639-3 code: enh
alternative label: Enets, Tundra
in scheme: Lexvo - ISO 639-3 language codes
notation: enh

Middle English
type: Language
type: Concept
ISO 639-2 Bibliographical code: enm
ISO 639-2 Terminological code: enm
ISO 639-3 code: enm
alternative label: English, Middle (1100-1500)
alternative label: Inglês médio @pt
alternative label: Medio inglese @it
alternative label: Middle English (1100-1500)
alternative label: Mittelenglische Sprache @de
alternative label: Moyen anglais @fr
alternative label: anglais moyen (1100-1500) @fr
alternative label: inglés medieval @es
alternative label: inglês medieval @pt
definition: Middle English is the period in the history of the English language between the High and Late Middle Ages, or roughly during the four centuries between the late 11th and the late 15th century.
in scheme: Lexvo - ISO 639-3 language codes
notation: enm
preferred label: Inglés medio @es
preferred label: Mittelenglisch @de
preferred label: inglese medio @it
preferred label: inglês médio @pt
preferred label: moyen anglais @fr

Engenni
type: Language
type: Concept
ISO 639-3 code: enn
in scheme: Lexvo - ISO 639-3 language codes
notation: enn

Xipaya
type: Language
type: Concept
ISO 639-3 code: xiy
alternative label: Xipaya language
definition: Xipaya (or Shipaja or Xipaia) is an endangered language spoken in the Pará region of Brazil.
in scheme: Lexvo - ISO 639-3 language codes
notation: xiy
preferred label: Língua xipaia @pt

Enggano
type: Language
type: Concept
ISO 639-3 code: eno
alternative label: Enggano language
definition: The Enggano language, or Engganese, is the language of Enggano Island off the southwestern coast of Sumatra.
in scheme: Lexvo - ISO 639-3 language codes
notation: eno

Enga
type: Language
type: Concept
ISO 639-3 code: enq
alternative label: Enga language
definition: Enga (also Caga, Tsaga, Tchaga) is a language of the East New Guinea Highlands that is spoken by approximately 180,000 people in Enga Province, Papua New Guinea. It has the largest body of speakers of any native language in New Guinea.
in scheme: Lexvo - ISO 639-3 language codes
notation: enq
preferred label: Lingua Enga @it

Emem
type: Language
type: Concept
ISO 639-3 code: enr
alternative label: Emumu
in scheme: Lexvo - ISO 639-3 language codes
notation: enr

Enu
type: Language
type: Concept
ISO 639-3 code: enu
in scheme: Lexvo - ISO 639-3 language codes
notation: enu

Enwan
type: Language
type: Concept
ISO 639-3 code: env
alternative label: Enwan (Edu State)
in scheme: Lexvo - ISO 639-3 language codes
notation: env

Enwan
type: Language
type: Concept
ISO 639-3 code: enw
alternative label: Enwan (Akwa Ibom State)
in scheme: Lexvo - ISO 639-3 language codes
notation: enw

Beti
type: Language
type: Concept
ISO 639-3 code: eot
alternative label: Beti (Côte d'Ivoire)
alternative label: Eotile language
definition: Eotile, or Beti, is a nearly extinct Tano language of Ivory Coast. Speakers are shifting to Anyin, with remaining Eotile speakers heavily influenced by that language. The last speaker of "pure" Eotile is reported to have died in 1993.
in scheme: Lexvo - ISO 639-3 language codes
notation: eot

Epie
type: Language
type: Concept
ISO 639-3 code: epi
alternative label: Epie language
definition: Epie (or Epie-Atissa) is a language spoken in Nigeria by the Epie-Atissa clan.
in scheme: Lexvo - ISO 639-3 language codes
notation: epi

Esperanto
type: Language
type: Concept
ISO 639-1 code: eo
ISO 639-2 Bibliographical code: epo
ISO 639-2 Terminological code: epo
ISO 639-3 code: epo
alternative label: Espéranto @fr
alternative label: Lingua esperanto @it
in scheme: Lexvo - ISO 639-3 language codes
notation: epo
preferred label: esperanto @es
preferred label: espéranto @fr

Eravallan
type: Language
type: Concept
ISO 639-3 code: era
in scheme: Lexvo - ISO 639-3 language codes
notation: era

Sie
type: Language
type: Concept
ISO 639-3 code: erg
alternative label: Erromanga language
definition: Erromangan or Sye is the primary language spoken on the island Erromango in the Tafea region of the Vanuatu islands. The other Erromanga languages are either moribund or extinct. Although the island is quite large (887 km²), the total number of speakers of Erromango is estimated at around 1900.
in scheme: Lexvo - ISO 639-3 language codes
notation: erg

Santa María Quiegolani Zapotec
type: Language
type: Concept
ISO 639-3 code: zpi
alternative label: Zapotec, Santa María Quiegolani
in scheme: Lexvo - ISO 639-3 language codes
notation: zpi

Eruwa
type: Language
type: Concept
ISO 639-3 code: erh
in scheme: Lexvo - ISO 639-3 language codes
notation: erh

Minjungbal
type: Language
type: Concept
in scheme: Lexvo - ISO 639-3 language codes

Ogea
type: Language
type: Concept
ISO 639-3 code: eri
alternative label: Ogea language
definition: Ogea or Erima is a Papuan language spoken by approximately 2210 people living in an area 18 kilometers south of the town of Madang, in the Madang Province of Papua New Guinea.
in scheme: Lexvo - ISO 639-3 language codes
notation: eri

South Efate
type: Language
type: Concept
ISO 639-3 code: erk
alternative label: Efate, South
alternative label: South Efate language
definition: The South Efate language is a Nuclear Southern Oceanic language of the Malayo-Polynesian language family, spoken on the island of Efate in central Vanuatu. , there are approximately 6,000 speakers who live in coastal villages from Pango to Eton. The language's grammar has been described by Nick Thieberger, who is working on a book of stories and . The field recordings have been archived with Paradisec.
in scheme: Lexvo - ISO 639-3 language codes
notation: erk
preferred label: Éfaté du Sud @fr

Horpa
type: Language
type: Concept
ISO 639-3 code: ero
alternative label: Horpa language
definition: Horpa, or Ergong, is a Jiarongic language, or languages, of China. Ethnologue 16 lists Shangzhai Horpa (sTodsde) as a distinct language, with additional splits pending for the 17th edition.
in scheme: Lexvo - ISO 639-3 language codes
notation: ero

Erre
type: Language
type: Concept
ISO 639-3 code: err
alternative label: Erre language
definition: Erre or Arri is an extinct Australian Aboriginal language.
in scheme: Lexvo - ISO 639-3 language codes
notation: err

Ersu
type: Language
type: Concept
ISO 639-3 code: ers
alternative label: Ersu language
definition: Ersu (, Ersu; also called Duoxu or Erhsu) is a Qiangic language of the Sino-Tibetan language family. It is spoken by about 9,000 people in China; other sources claim the existence of 20,000 speakers, with some 500 monolingual Ersu speakers.
in scheme: Lexvo - ISO 639-3 language codes
notation: ers

Jaitmatang
type: Language
type: Concept
in scheme: Lexvo - ISO 639-3 language codes

Eritai
type: Language
type: Concept
ISO 639-3 code: ert
in scheme: Lexvo - ISO 639-3 language codes
notation: ert

Erokwanas
type: Language
type: Concept
ISO 639-3 code: erw
in scheme: Lexvo - ISO 639-3 language codes
notation: erw

Ese’ejja
type: Language
type: Concept
ISO 639-3 code: ese
alternative label: Ese Ejja
in scheme: Lexvo - ISO 639-3 language codes
notation: ese
preferred label: Ese 'ejja @fr

Eshtehardi
type: Language
type: Concept
ISO 639-3 code: esh
in scheme: Lexvo - ISO 639-3 language codes
notation: esh

North Alaskan Inupiatun
type: Language
type: Concept
ISO 639-3 code: esi
alternative label: Inupiatun, North Alaskan
in scheme: Lexvo - ISO 639-3 language codes
notation: esi

Kalkoti
type: Language
type: Concept
ISO 639-3 code: xka
in scheme: Lexvo - ISO 639-3 language codes
notation: xka

Northwest Alaska Inupiatun
type: Language
type: Concept
ISO 639-3 code: esk
alternative label: Inupiatun, Northwest Alaska
in scheme: Lexvo - ISO 639-3 language codes
notation: esk

Egypt Sign Language
type: Language
type: Concept
ISO 639-3 code: esl
in scheme: Lexvo - ISO 639-3 language codes
notation: esl

Esuma
type: Language
type: Concept
ISO 639-3 code: esm
in scheme: Lexvo - ISO 639-3 language codes
notation: esm

Salvadoran Sign Language
type: Language
type: Concept
ISO 639-3 code: esn
definition: Salvadoran Sign language is a language used by the deaf community in El Salvador. Its main purpose is to provide education. There are three distinct forms of sign language. American Sign Language was brought over to El Salvador from the United States by missionaries who set up small communal schools for the deaf. The government has also created a school for the deaf, teaching by means of their own modified Salvadoran Sign Language. The third type of sign language used is a combination of American Sign Language and Salvadoran Sign language. Most deaf understand and rely upon both. Their own unique Salvidoran Sign language is based on their language and is most useful in regular encounters; however, American Sign Language is often relied on within education due to the larger and more specific vocabulary. This is the reason that the deaf community within El Salvador sometimes relies upon both ASL and SSL in a combined form.
in scheme: Lexvo - ISO 639-3 language codes
notation: esn

Estonian Sign Language
type: Language
type: Concept
ISO 639-3 code: eso
definition: Estonian Sign Language (ESL, ) is the national sign language of Estonia. In 1998 there were about 4,500 signers out of a deaf population of 2000 and a hearing-impaired population ten times that number. It is widespread in the cities of Tallinn and Pärnu among deaf ethnic Estonians; deaf Russian Estonians in Tallinn use Russian Sign Language, Russians outside Tallinn tend to use a Russian–Estonian Sign Language pidgin, or may be bilingual. In its formative stages, Estonian Sign Language was influenced by Russian and Finnish Sign Language; for example, the ESL sign for butterfly developed from the Finnish sign for bird. There are several dialects, the most archaic of which is the Pärnu variety.
in scheme: Lexvo - ISO 639-3 language codes
notation: eso
preferred label: Língua de sinais estoniana @pt

Esselen
type: Language
type: Concept
ISO 639-3 code: esq
alternative label: Esselen language
definition: Esselen (Esselen: Huelel) is a language isolate that was spoken by the Esselen Native Americans on the Central Coast of California, south of Monterey.
in scheme: Lexvo - ISO 639-3 language codes
notation: esq
preferred label: Idioma esselen @es

Central Siberian Yupik
type: Language
type: Concept
ISO 639-3 code: ess
alternative label: Central Siberian Yupik language
alternative label: Yupik, Central Siberian
definition: Siberian Yupik (also known as Central Siberian Yupik, Bering Strait Yupik, Yuit, Yoit, "St. Lawrence Island Yupik" and in Russia "Chaplinski Yupik" or Yuk) is one of the four Yupik languages: * Central Siberian Yupik, * Naukan Siberian Yupik, * Central Alaskan Yupik, * Pacific Gulf Yupik. Central Siberian Yupik belongs to the Eskimo–Aleut language family. It the largest Yupik idiom spoken in Siberia, and it is spoken also on St. Lawrence Island. Its speakers, the Siberian Yupik people, are an indigenous people who reside along the coast of the Chukchi Peninsula in the Russian Far East and on St. Lawrence Island in the Alaska villages of Savoonga and Gambell.
in scheme: Lexvo - ISO 639-3 language codes
notation: ess

Northern Nago
type: Language
type: Concept
ISO 639-3 code: xkb
alternative label: Nago, Northern
in scheme: Lexvo - ISO 639-3 language codes
notation: xkb

Estonian
type: Language
type: Concept
ISO 639-1 code: et
ISO 639-2 Bibliographical code: est
ISO 639-2 Terminological code: est
ISO 639-3 code: est
alternative label: Estnische Sprache @de
alternative label: Estonian language
alternative label: Estonien @fr
alternative label: Idioma estonio @es
alternative label: Lingua estone @it
alternative label: Língua estónia @pt
alternative label: estoniano @pt
definition: Estonian (eesti keel; ) is the official language of Estonia, spoken by about 1.1 million people in Estonia and tens of thousands in various émigré communities. It is a Uralic language and is closely related to Finnish.
in scheme: Lexvo - ISO 639-3 language codes
notation: est
preferred label: Estnisch @de
preferred label: estone @it
preferred label: estonien @fr
preferred label: estonio @es
preferred label: estónio @pt

Central Yupik
type: Language
type: Concept
ISO 639-3 code: esu
alternative label: Central Alaskan Yup'ik language
alternative label: Yupik, Central
definition: Central Alaskan Yupik or just Yupik (also called Yupik, Central Yupik, or indigenously Yugtun) is one of the languages of Yupik family, in turn a member of the Eskimo–Aleut language group, spoken in western and southwestern Alaska. Both in ethnic population and in number of speakers, Central Alaskan Yupik is the largest of the languages spoken by Alaska Natives. As of 2010 it was also the second largest language in the United States in terms of numbers of speakers. Central Alaskan Yupik lies geographically and linguistically between Alutiiq and Central Siberian Yupik. The use of the apostrophe in Central Alaskan Yupik, as opposed to Siberian Yupik, denotes a long p. The word Yupik represents not only the language but also the name for the people themselves (yuk, person, and pik, real.) Of a total population of more than 23,000 people, more than 14,000 are speakers of the language. Children still grow up speaking Yupik as their first language in 17 of 68 Yup'ik villages, those mainly located on the lower Kuskokwim River, on Nelson Island, and along the coast between the Kuskokwim River and Nelson Island.
in scheme: Lexvo - ISO 639-3 language codes
notation: esu

Etebi
type: Language
type: Concept
ISO 639-3 code: etb
in scheme: Lexvo - ISO 639-3 language codes
notation: etb

Etchemin
type: Language
type: Concept
ISO 639-3 code: etc
alternative label: Etchemin language
definition: Etchemin was a language of the Algonquian language family, spoken in early colonial times on the coast of Maine. The word Etchemin is a French alteration of an Algonquian word for "canoe".
in scheme: Lexvo - ISO 639-3 language codes
notation: etc

Ethiopian Sign Language
type: Language
type: Concept
ISO 639-3 code: eth
in scheme: Lexvo - ISO 639-3 language codes
notation: eth

Eton
type: Language
type: Concept
ISO 639-3 code: etn
alternative label: Eton (Vanuatu)
in scheme: Lexvo - ISO 639-3 language codes
notation: etn

Eton
type: Language
type: Concept
ISO 639-3 code: eto
alternative label: Eton (Cameroon)
alternative label: Eton language
definition: Eton, or Iton, is a Bantu language spoken by the Eton people of Cameroon. The exact number of Eton speakers is unknown, although Ethnologue cites 52,000 speakers based on a 1982 estimate by SIL. It is mutually intelligible with Ewondo, a fact which may have delayed its study for some time.
in scheme: Lexvo - ISO 639-3 language codes
notation: eto

Edolo
type: Language
type: Concept
ISO 639-3 code: etr
in scheme: Lexvo - ISO 639-3 language codes
notation: etr

Kho'ini
type: Language
type: Concept
ISO 639-3 code: xkc
alternative label: Kho'ini dialect
definition: Khoini (alternatives: Xoini, Xoini, Khoeini, or Di) is a Tatic dialect or language spoken in northwestern Iran, and is one of many Western Iranian languages. It is spoken in the village of Xoin and surrounding areas, about southwest of Zanjan city in northern Iran. The Xoini verbal system follows the general pattern found in other Tati dialects. However, the dialect has its own special characteristics such as continuous present which is formed by the past stem, a preverb shift, and the use of connective sounds. The dialect is in danger of extinction.
in scheme: Lexvo - ISO 639-3 language codes
notation: xkc

Yekhee
type: Language
type: Concept
ISO 639-3 code: ets
alternative label: Yekhee language
definition: Yekhee is an Edoid language spoken in Edo State, Nigeria. Not all speakers recognize the name "Yekhee"; some use the district name Etsako.
in scheme: Lexvo - ISO 639-3 language codes
notation: ets

Etruscan
type: Language
type: Concept
ISO 639-3 code: ett
alternative label: Etruscan language
definition: The Etruscan language was spoken and written by the Etruscan civilization, in what is present-day Italy, in the ancient region of Etruria (modern Tuscany plus western Umbria and northern Latium) and in parts of Lombardy, Veneto, and Emilia-Romagna (where the Etruscans were displaced by Gauls). Etruscan was superseded completely by Latin, leaving only a few documents and some loanwords in Latin, such as persona (from Etruscan φersu), and some place-names, such as Roma.
in scheme: Lexvo - ISO 639-3 language codes
notation: ett
preferred label: Etruskische Sprache @de
preferred label: Idioma etrusco @es
preferred label: Lingua etrusca @it
preferred label: Língua etrusca @pt
preferred label: Étrusque @fr

Ejagham
type: Language
type: Concept
ISO 639-3 code: etu
alternative label: Ekoi language
definition: The Ekoi language, also known as Ejagham, is an Ekoid language (Niger–Congo family) of Nigeria and Cameroon.
in scheme: Lexvo - ISO 639-3 language codes
notation: etu

Eten
type: Language
type: Concept
ISO 639-3 code: etx
alternative label: Eten language
definition: Eten (Iten) is a Plateau language of Nigeria.
in scheme: Lexvo - ISO 639-3 language codes
notation: etx

Semimi
type: Language
type: Concept
ISO 639-3 code: etz
alternative label: Semimi language
definition: Semimi, or Etna Bay, is a Papuan language spoken in Papua province of Indonesia.
in scheme: Lexvo - ISO 639-3 language codes
notation: etz

Basque
type: Language
type: Concept
ISO 639-1 code: eu
ISO 639-2 Bibliographical code: baq
ISO 639-2 Terminological code: eus
ISO 639-3 code: eus
alternative label: Baskische Sprache @de
alternative label: Basque language
alternative label: Euskera @es
alternative label: Lingua basca @it
alternative label: Língua basca @pt
alternative label: basque @fr
definition: Basque (endonym: , ) is the ancestral language of the Basque people, who inhabit the Basque Country, a region spanning an area in northeastern Spain and southwestern France. It is spoken by 25.7% of Basques in all territories (665,800 out of 2,589,600).
in scheme: Lexvo - ISO 639-3 language codes
notation: eus
preferred label: Baskisch @de
preferred label: basco @it
preferred label: vasco @es

Even
type: Language
type: Concept
ISO 639-3 code: eve
alternative label: Even language
definition: The Even language (also known as Lamut, Ewen, Eben, Orich, Ilqan; , earlier also ) is a Tungusic language spoken by the Evens in Siberia. It is spoken by widely scattered communities of reindeer herders from Kamchatka and the Sea of Okhotsk in the east to the River Lena in the west, and from the Arctic coast in the north to the River Aldan in the south. It is an endangered language, with only some 7,000 speakers (Russian census, 2002). Dialects are Arman, Indigirka, Kamchatka, Kolyma-Omolon, Okhotsk, Ola, Tompon, Upper Kolyma, Sakkyryr, Lamunkhin.
in scheme: Lexvo - ISO 639-3 language codes
notation: eve
preferred label: Ewenische Sprache @de
preferred label: Idioma even @es
preferred label: Lingua evena @it
preferred label: Língua even @pt
preferred label: Évène @fr

Uvbie
type: Language
type: Concept
ISO 639-3 code: evh
in scheme: Lexvo - ISO 639-3 language codes
notation: evh

Evenki
type: Language
type: Concept
ISO 639-3 code: evn
alternative label: Evenki language
definition: Evenki (also known as Ewenki, Ewenke, Owenke, Solon, Suolun, and Tungus or Tunguz in older works) is the largest member of the northern group of Tungusic languages, a group which also includes Even, Negidal, and (the more closely related) Oroqen language. It is spoken by Evenks in Russia, Mongolia, and People's Republic of China.
in scheme: Lexvo - ISO 639-3 language codes
notation: evn
preferred label: Ewenkische Sprache @de
preferred label: Idioma evenki @es
preferred label: Lingua Evenchi @it
preferred label: Língua evenki @pt

Ewe
type: Language
type: Concept
ISO 639-1 code: ee
ISO 639-2 Bibliographical code: ewe
ISO 639-2 Terminological code: ewe
ISO 639-3 code: ewe
alternative label: Ewe language
alternative label: Ewe-Sprache @de
alternative label: Idioma ewé @es
alternative label: Lingua ewe @it
alternative label: Língua ewe @pt
alternative label: eve @pt
definition: Ewe (Èʋe or Èʋegbe ) is a Niger–Congo language spoken in Ghana, Togo and Benin by approximately three million people. Ewe is part of a cluster of related languages commonly called Gbe, spoken in southeastern Ghana, Togo, and parts of Benin. Other Gbe languages include Fon, Gen, Phla Phera, and Aja. Like other Gbe languages, Ewe is a tonal language.
in scheme: Lexvo - ISO 639-3 language codes
notation: ewe
preferred label: ewe @es
preferred label: éwé @fr

Ewondo
type: Language
type: Concept
ISO 639-2 Bibliographical code: ewo
ISO 639-2 Terminological code: ewo
ISO 639-3 code: ewo
alternative label: Ewondo language
alternative label: éwondo @fr
definition: Ewondo is the language of the Ewondo people of Cameroon. The language had 577,700 native speakers in 1982. Ewondo is a trade language. Dialects include Badjia (Bakjo), Bafeuk, Bamvele (Mvele, Yezum, Yesoum), Bane, Beti, Enoah, Evouzok, Fong, Mbida-Bani, Mvete, Mvog-Niengue, Omvang, Yabekolo (Yebekolo), Yabeka, and Yabekanga. Ewondo speakers live primarily in Cameroon's Centre Region and the northern part of the Océan division in the South Region.
in scheme: Lexvo - ISO 639-3 language codes
notation: ewo
preferred label: ewondo @es

Mendalam Kayan
type: Language
type: Concept
ISO 639-3 code: xkd
alternative label: Kayan, Mendalam
in scheme: Lexvo - ISO 639-3 language codes
notation: xkd

Extremaduran
type: Language
type: Concept
ISO 639-3 code: ext
alternative label: Extremaduran dialect
alternative label: Extremaduran language
definition: Extremaduran (autonym: estremeñu, ) is a Romance language, spoken by several hundred thousand people in Spain, in an area covering the north-western part of the autonomous community of Extremadura and adjoining areas in the province of Salamanca. It should not be confused with the Spanish dialects spoken in most of Extremadura, though it is difficult to establish the boundary between the two languages. Most common people in Spain are not aware of its existence and consider it just a dialect of Spanish.
in scheme: Lexvo - ISO 639-3 language codes
notation: ext
preferred label: Estremenho @pt
preferred label: Estrémègne @fr
preferred label: Extremadurische Sprache @de
preferred label: Idioma extremeño @es
preferred label: Lingua estremadurana @it

Eyak
type: Language
type: Concept
ISO 639-3 code: eya
alternative label: Eyak language
definition: Eyak is an extinct Na-Dené language historically spoken by the Eyak people, indigenous to southcentral Alaska, near the mouth of the Copper River.
in scheme: Lexvo - ISO 639-3 language codes
notation: eya
preferred label: Idioma eyak @es
preferred label: Língua eyak @pt

Keiyo
type: Language
type: Concept
ISO 639-3 code: eyo
alternative label: Keiyo language
definition: Keiyo (Elgeyo) is a Kalenjin language of Kenya.
in scheme: Lexvo - ISO 639-3 language codes
notation: eyo

Ezaa
type: Language
type: Concept
in scheme: Lexvo - ISO 639-3 language codes

Uzekwe
type: Language
type: Concept
ISO 639-3 code: eze
in scheme: Lexvo - ISO 639-3 language codes
notation: eze

Fasu
type: Language
type: Concept
ISO 639-3 code: faa
alternative label: Fasu language
definition: The Fasu language of New Guinea is not closely related to other languages, but forms a possible branch of the Trans–New Guinea (TNG) family. Wurm and Hattori (1981) considered its three principal dialects, Fasu, Some, and Namumi, to be three languages, which they called the West Kutubuan family, but Ethnologue (2009) considers it a single language. It is not close to the two East Kutubuan languages.
in scheme: Lexvo - ISO 639-3 language codes
notation: faa

Fa D'ambu
type: Language
type: Concept
ISO 639-3 code: fab
alternative label: Annobonese language
definition: The Annobonese language, known to its speakers as Fá dAmbô or Fa dAmbu, is spoken by 2,500 in the Annobon and Bioko Islands off the coast of Equatorial Guinea, mostly by people of mixed African, Spanish, and Portuguese descent.
in scheme: Lexvo - ISO 639-3 language codes
notation: fab
preferred label: Annobonesische Sprache @de
preferred label: Criollo annobonense @es
preferred label: Fá d'Ambô @fr

Wagi
type: Language
type: Concept
ISO 639-3 code: fad
in scheme: Lexvo - ISO 639-3 language codes
notation: fad

Kereho
type: Language
type: Concept
ISO 639-3 code: xke
alternative label: Krio Dayak language
definition: The Krio Dayak or Keriu is a Kayan language of the Krio Dayak people in West Kalimantan, Indonesia.
in scheme: Lexvo - ISO 639-3 language codes
notation: xke

Fagani
type: Language
type: Concept
ISO 639-3 code: faf
alternative label: Fagani language
definition: The Fagani language is a member of the family of San Cristobal languages, and is spoken in the northwest part of the island of Makira, formerly known as San Cristobal in the Solomon Islands.
in scheme: Lexvo - ISO 639-3 language codes
notation: faf

Finongan
type: Language
type: Concept
ISO 639-3 code: fag
in scheme: Lexvo - ISO 639-3 language codes
notation: fag

Baissa Fali
type: Language
type: Concept
ISO 639-3 code: fah
alternative label: Fali language of Baissa
alternative label: Fali, Baissa
definition: Fali is a moribund language of southern Taraba State, Nigeria. It had few speakers as of 1992. It is of uncertain affiliation within the Niger–Congo language family, clearly within the Benue–Congo languages but otherwise unclassified.
in scheme: Lexvo - ISO 639-3 language codes
notation: fah

Faiwol
type: Language
type: Concept
ISO 639-3 code: fai
in scheme: Lexvo - ISO 639-3 language codes
notation: fai

Faita
type: Language
type: Concept
ISO 639-3 code: faj
alternative label: Faita language
definition: Faita is a divergent and nearly extinct Madang language of the Adelbert Range of Papua New Guinea. It was once placed in the now-defunct Brahman branch of Madang.
in scheme: Lexvo - ISO 639-3 language codes
notation: faj

Fang
type: Language
type: Concept
ISO 639-3 code: fak
alternative label: Fang (Cameroon)
alternative label: Fang language
definition: Fang is a Bantoid language of Cameroon. It is traditionally classified as a Western Beboid language, but that has not been demonstrated to be a valid family.
in scheme: Lexvo - ISO 639-3 language codes
notation: fak

South Fali
type: Language
type: Concept
ISO 639-3 code: fal
alternative label: Fali, South
in scheme: Lexvo - ISO 639-3 language codes
notation: fal

Fam
type: Language
type: Concept
ISO 639-3 code: fam
alternative label: Fam language
definition: Fam is a Bantoid language of Nigeria, with a couple thousand speakers in Cameroon. It is either among or related to the Mambiloid languages.
in scheme: Lexvo - ISO 639-3 language codes
notation: fam

Fang
type: Language
type: Concept
ISO 639-2 Bibliographical code: fan
ISO 639-2 Terminological code: fan
ISO 639-3 code: fan
alternative label: Fang (Equatorial Guinea)
alternative label: Fang language
alternative label: Idioma fang @es
alternative label: Língua fang @pt
alternative label: Pangwe-Sprache @de
preferred label: fang @es
definition: Fang is the dominant Bantu language of Gabon and Equatorial Guinea. It is related to the Bulu and Ewondo languages of southern Cameroon. Fang is spoken in northern Gabon, southern Cameroon, and throughout Equatorial Guinea. Shakira used this language in her song, "Waka Waka (This Time For Africa).".
in scheme: Lexvo - ISO 639-3 language codes
notation: fan
preferred label: fangue @pt

Faroese
type: Language
type: Concept
ISO 639-1 code: fo
ISO 639-2 Bibliographical code: fao
ISO 639-2 Terminological code: fao
ISO 639-3 code: fao
in scheme: Lexvo - ISO 639-3 language codes
notation: fao
preferred label: Färöisch @de
preferred label: faroese @it
preferred label: feroés @es
preferred label: feroês @pt
preferred label: féroïen @fr

Palor
type: Language
type: Concept
ISO 639-3 code: fap
in scheme: Lexvo - ISO 639-3 language codes
notation: fap

Khengkha
type: Language
type: Concept
ISO 639-3 code: xkf
alternative label: Kheng language
definition: Khengkha, also called the Kheng language, is a member of the Tibeto-Burman language family spoken in the Zhemgang, Trongsa and Mongar districts of south central Bhutan. There are about 40,000 speakers of Khengkha.
in scheme: Lexvo - ISO 639-3 language codes
notation: xkf

Fataleka
type: Language
type: Concept
ISO 639-3 code: far
in scheme: Lexvo - ISO 639-3 language codes
notation: far

Persian
type: Language
type: Concept
ISO 639-1 code: fa
ISO 639-2 Bibliographical code: per
ISO 639-2 Terminological code: fas
ISO 639-3 code: fas
alternative label: Idioma persa @es
alternative label: Lingua persiana @it
alternative label: Língua persa @pt
alternative label: Persian language
alternative label: Persische Sprache @de
alternative label: persan @fr
definition: Persian (, ) is an Iranian language within the Indo-Iranian branch of the Indo-European languages. It is primarily spoken in Iran, Afghanistan, Tajikistan and countries which historically came under Persian influence. The Persian language is classified as a continuation of Middle Persian, the official religious and literary language of Sassanid Persia, itself a continuation of Old Persian, the language of the Persian Empire in the Achaemenid era. Persian is a pluricentric language and its grammar is similar to that of many contemporary European languages.
in scheme: Lexvo - ISO 639-3 language codes
notation: fas
preferred label: Persan @fr
preferred label: Persisch @de
preferred label: persa @es
preferred label: persiano @it

Fanti
type: Language
type: Concept
ISO 639-2 Bibliographical code: fat
ISO 639-2 Terminological code: fat
ISO 639-3 code: fat
alternative label: Fante dialect
alternative label: Fanti-Sprache @de
alternative label: Língua fanti @pt
definition: Fante (Mfantse, Fanti) is one of the three formal languages (literary dialects) of the Akan language. It is the major local language spoken in the Central and Western Regions of Ghana as well as in settlements in other regions from mid to southern Ghana. One of such communities is Fante New Town in Kumasi, in the Ashanti Region of Ghana. Fante is the common language of communication among the several Kingdoms of the Fante people, though each has its own (sub)dialect: Agona, Anomabo, Abura, Gomua, Oguaa, Ahanta. Many Fantes are bilingual. Notable speakers include Dr. Kwame Nkrumah, John Atta Mills, Maya Angelou, Roman Catholic Cardinal Peter Turkson, and Kofi Annan.
in scheme: Lexvo - ISO 639-3 language codes
notation: fat
preferred label: Fante @de
preferred label: fanti @es

Fayu
type: Language
type: Concept
ISO 639-3 code: fau
alternative label: Fayu language
definition: Fayu, also known as Sehudate, is a Lakes Plain language of Irian Jaya, Indonesia spoken by about 350 people.
in scheme: Lexvo - ISO 639-3 language codes
notation: fau

Fala
type: Language
type: Concept
ISO 639-3 code: fax
alternative label: Fala language
definition: Fala ("Speech") is a Romance language commonly classified in the Portuguese-Galician subgroup, with some traits from Leonese, spoken in Spain by about 10,500 people, of whom 5,500 live in a valley of the northwestern part of Extremadura near the border with Portugal. The speakers of Fala live in the towns of Valverde del Fresno (Valverdi du Fresnu), Eljas (As Ellas) and San Martín de Trevejo (Sa Martín de Trebellu).
in scheme: Lexvo - ISO 639-3 language codes
notation: fax
preferred label: A Fala @de
preferred label: Fala da Estremadura @pt
preferred label: Lingua fala @it

Davani dialect
type: Language
type: Concept
ISO 639-3 code: fay
alternative label: Fars, Southwestern
alternative label: Southwestern Fars
definition: The Davani dialect (Davani: devani; , UniPers: Davâni) is a southwestern Iranian language or southwestern dialect of Fars, spoken in the village of Davan, 12 kilometers north of Kazerun city in Southern Iran. The number of speakers was estimated around 1000 in 2004.
in scheme: Lexvo - ISO 639-3 language codes
notation: fay

Northwestern Fars
type: Language
type: Concept
ISO 639-3 code: faz
alternative label: Fars, Northwestern
in scheme: Lexvo - ISO 639-3 language codes
notation: faz

West Albay Bikol
type: Language
type: Concept
ISO 639-3 code: fbl
alternative label: Bikol, West Albay
in scheme: Lexvo - ISO 639-3 language codes
notation: fbl

Quebec Sign Language
type: Language
type: Concept
ISO 639-3 code: fcs
definition: Quebec Sign Language, known in French as Langue des signes québécoise (LSQ), is a sign language used in Canada. Most LSQ users are located in Quebec, but a few are scattered in major cities in the rest of the country.
in scheme: Lexvo - ISO 639-3 language codes
notation: fcs
preferred label: Langue des signes québécoise @fr
preferred label: Língua de Sinais Quebequiana @pt

Feroge
type: Language
type: Concept
ISO 639-3 code: fer
alternative label: Kaligi language
definition: Feroge (Feroghe), endonym Kaligi, is a Ubangian language of South Sudan.
in scheme: Lexvo - ISO 639-3 language codes
notation: fer

Quiavicuzas Zapotec
type: Language
type: Concept
ISO 639-3 code: zpj
alternative label: Zapotec, Quiavicuzas
in scheme: Lexvo - ISO 639-3 language codes
notation: zpj

Foia Foia
type: Language
type: Concept
ISO 639-3 code: ffi
in scheme: Lexvo - ISO 639-3 language codes
notation: ffi

Kagoro
type: Language
type: Concept
ISO 639-3 code: xkg
in scheme: Lexvo - ISO 639-3 language codes
notation: xkg

Maasina Fulfulde
type: Language
type: Concept
ISO 639-3 code: ffm
alternative label: Fulfulde, Maasina
definition: Maasina Fulfulde (or Maasinankoore in the language itself) is a Fula language spoken primarily as a first language by Fula people and associated groups in the Inner Niger Delta area traditionally known as Macina in the center of what is now the West African state of Mali. It is also spoken elsewhere in Mali, parts of Cote d'Ivoire and Northern Ghana.
in scheme: Lexvo - ISO 639-3 language codes
notation: ffm

Fongoro
type: Language
type: Concept
ISO 639-3 code: fgr
alternative label: Fongoro language
definition: Fongoro is a minor Central Sudanic language of Chad and formerly of Sudan. It may be one of the Vale languages.
in scheme: Lexvo - ISO 639-3 language codes
notation: fgr

Nobiin
type: Language
type: Concept
ISO 639-3 code: fia
alternative label: Nobiin language
definition: Nobiin is a Northern Nubian language of the Nilo-Saharan phylum. ‘Nobiin’ is the genitive form of Nòòbíí ‘Nubian" and literally means ‘(language) of the Nubians". Another term used is Noban tamen, meaning ‘the Nubian language’.
in scheme: Lexvo - ISO 639-3 language codes
notation: fia

Fyer
type: Language
type: Concept
ISO 639-3 code: fie
alternative label: Fyer language
definition: Fyer (also known as Fier) is a West Chadic language spoken in Plateau State, Nigeria.
in scheme: Lexvo - ISO 639-3 language codes
notation: fie

Fijian
type: Language
type: Concept
ISO 639-1 code: fj
ISO 639-2 Bibliographical code: fij
ISO 639-2 Terminological code: fij
ISO 639-3 code: fij
alternative label: Fidjien @fr
alternative label: Fidschianisch @de
alternative label: Fijian language
alternative label: Idioma fiyiano @es
alternative label: Lingua figiana @it
alternative label: Língua fidjiana @pt
definition: Fijian is an Austronesian language of the Malayo-Polynesian family spoken in Fiji. It has 450,000 first-language speakers, which is less than half the population of Fiji, but another 200,000 speak it as a second language. The 1997 Constitution established Fijian as an official language of Fiji, along with English and Hindustani , and there is discussion about establishing it as the "national language", though English and Hindustani would remain official. Fijian is a VOS language. It has prepositions.
in scheme: Lexvo - ISO 639-3 language codes
notation: fij
preferred label: Fidschi @de
preferred label: fidjiano @es
preferred label: fidjien @fr
preferred label: figiano @it
preferred label: fijiano @pt

Filipino
type: Language
type: Concept
ISO 639-2 Bibliographical code: fil
ISO 639-2 Terminological code: fil
ISO 639-3 code: fil
alternative label: Filipino language
alternative label: Idioma filipino @es
alternative label: Lingua filippina @it
alternative label: Língua filipina @pt
alternative label: Pilipino
definition: Filipino is a prestige register of the Tagalog language and the name under which Tagalog is designated the national language and one of two official languages of the Philippines, the other being English. Tagalog is the first language of a third of the population of the Philippines. It is centered around Manila but is known almost universally throughout the country.
in scheme: Lexvo - ISO 639-3 language codes
notation: fil
preferred label: filipino @es
preferred label: filippino @it

Finnish
type: Language
type: Concept
ISO 639-1 code: fi
ISO 639-2 Bibliographical code: fin
ISO 639-2 Terminological code: fin
ISO 639-3 code: fin
alternative label: Finnische Sprache @de
alternative label: Finnish language
alternative label: Idioma finés @es
alternative label: Lingua finlandese @it
alternative label: Língua finlandesa @pt
alternative label: finnois @fr
definition: Finnish (, or suomen kieli) is the language spoken by the majority of the population in Finland (92% ) and by ethnic Finns outside Finland. It is one of the two official languages of Finland and an official minority language in Sweden. In Sweden, both standard Finnish and Meänkieli, a Finnish dialect, are spoken. The Kven language, a Finnish dialect, is spoken in Northern Norway.
in scheme: Lexvo - ISO 639-3 language codes
notation: fin
preferred label: Finnisch @de
preferred label: Finnois @fr
preferred label: finlandese @it
preferred label: finlandês @pt
preferred label: finés @es

Karahawyana
type: Language
type: Concept
ISO 639-3 code: xkh
alternative label: Karahawyana language
definition: Karahawyana is a language spoken by about 40 individuals near Waiwai, Amazonas, Brazil. Some Karahawyana speakers live with the Wai-Wai and others near the Hixkaryana and speak those languages respectively. It is nearly extinct.
in scheme: Lexvo - ISO 639-3 language codes
notation: xkh
preferred label: Idioma karahawyana @es

Fipa
type: Language
type: Concept
ISO 639-3 code: fip
alternative label: Fipa language
definition: Fipa (Fipa: Ichifipa) is a Bantu language of Tanzania. It is spoken by the Fipa people, who live on the Ufipa plateau in the Rukwa Region of South West Tanzania between Lake Tanganyika and Lake Rukwa. The ethnic group of the Fipa people is larger than the group of Fipa language speakers. On the Tanzanian side, people who speak Mambwe-Lungu may identify as Fipa and consider their language to be a dialect of Fipa. Lungu and Mambwe are also spoken in Zambia where they are considered languages and their speakers are considered to be ethnic groups in their own right, although linguists consider Lungu and Mambwe to be dialects of a single language. There are three dialects: Milanzi (also referred to as IchiSukuuma), Kwa (Ichikwa) and Nkansi.
in scheme: Lexvo - ISO 639-3 language codes
notation: fip

Firan
type: Language
type: Concept
ISO 639-3 code: fir
in scheme: Lexvo - ISO 639-3 language codes
notation: fir

Idioma meänkieli
type: Language
type: Concept
ISO 639-3 code: fit
alternative label: Finnish, Tornedalen
alternative label: Tornedalen Finnish
definition: Meänkieli (lit. "our language") is the name used in Sweden for Finnish dialects spoken in the northernmost parts of the country, around the valley of the Torne River.
in scheme: Lexvo - ISO 639-3 language codes
notation: fit
preferred label: Língua meänkieli @pt
preferred label: Meänkieli

Fiwaga
type: Language
type: Concept
ISO 639-3 code: fiw
alternative label: Fiwaga language
definition: Fiwaga (Fimaga, Fiwage) is a Papuan language of Papua New Guinea.
in scheme: Lexvo - ISO 639-3 language codes
notation: fiw

Kirya-Konzəl
type: Language
type: Concept
ISO 639-3 code: fkk
alternative label: Kirya-Konzəl language
definition: Kirya-Konzəl is a recently documented Chadic language of Nigeria, though it was first attested in 1931. The varieties, Fali of Kirya (Kirya) and Fali of Mijilu (Konzəl), are very close.
in scheme: Lexvo - ISO 639-3 language codes
notation: fkk

Kven Finnish
type: Language
type: Concept
ISO 639-3 code: fkv
alternative label: Finnish, Kven
alternative label: Kven language
definition: The Kven language is a Finnic language spoken in northern Norway by the Kven people. For political and historical reasons, it received the status of a minority language in 2005 within the framework of the European Charter for Regional or Minority Languages. Linguistically, however, it is seen as a mutually intelligible dialect of the Finnish language, and grouped together with the Peräpohjola dialects such as Meänkieli, spoken in Torne Valley in Sweden.
in scheme: Lexvo - ISO 639-3 language codes
notation: fkv
preferred label: Idioma kven @es
preferred label: Kven @pt
preferred label: Kvenische Sprache @de
preferred label: Kvène @fr

Kalispel-Pend d'Oreille
type: Language
type: Concept
ISO 639-3 code: fla
in scheme: Lexvo - ISO 639-3 language codes
notation: fla

Foau
type: Language
type: Concept
ISO 639-3 code: flh
alternative label: Foau language
definition: Foau or Doa is a Lakes Plain language of Irian Jaya, Indonesia.
in scheme: Lexvo - ISO 639-3 language codes
notation: flh

Fali
type: Language
type: Concept
ISO 639-3 code: fli
alternative label: Fali languages
definition: Fali, or Fali of Mubi after the local city, is an Afro-Asiatic dialect cluster spoken in Nigeria in Adamawa State in the Mubi and Michika LGAs. It is one of several languages in the area that go by the generic name Fali.
in scheme: Lexvo - ISO 639-3 language codes
notation: fli

North Fali
type: Language
type: Concept
ISO 639-3 code: fll
alternative label: Fali, North
in scheme: Lexvo - ISO 639-3 language codes
notation: fll

Flinders Island
type: Language
type: Concept
ISO 639-3 code: fln
alternative label: Yalgawarra language
definition: The Flinders Island language, Yalgawarra, is an extinct language of Australia. It is not close to any other.
in scheme: Lexvo - ISO 639-3 language codes
notation: fln

Fuliiru
type: Language
type: Concept
ISO 639-3 code: flr
alternative label: Furiiru language
definition: The Furiiru language is the language spoken by the Fuliiru (plural Bafuliiru) people, also known as the Fuliru or Fulero, who live north and west of the town of Uvira in Uvira Territory, South Kivu province in the far eastern part of the Democratic Republic of the Congo. They numbered an estimated 300,000 in 1999.
in scheme: Lexvo - ISO 639-3 language codes
notation: flr
preferred label: Bafuliru @fr

Kenyan Sign Language
type: Language
type: Concept
ISO 639-3 code: xki
definition: Kenyan Sign Language (English: KSL, Swahili: LAK) is the language of the Deaf community in Kenya, used throughout the country by over half the country's estimated Deaf population of 600,000.
in scheme: Lexvo - ISO 639-3 language codes
notation: xki
preferred label: Língua Gestual Queniana @pt

Tsotsitaal
type: Language
type: Concept
ISO 639-3 code: fly
in scheme: Lexvo - ISO 639-3 language codes
notation: fly

Fe'fe'
type: Language
type: Concept
ISO 639-3 code: fmp
alternative label: Fe'fe' language
definition: Fefe or Feefee, also known as Nufi and Bafang, is a Southern Bantoid language spoken in Cameroon, around the town of Bafang.
in scheme: Lexvo - ISO 639-3 language codes
notation: fmp
preferred label: Nufi @fr

Far Western Muria
type: Language
type: Concept
ISO 639-3 code: fmu
alternative label: Muria, Far Western
in scheme: Lexvo - ISO 639-3 language codes
notation: fmu

Fanagalo
type: Language
type: Concept
ISO 639-3 code: fng
definition: Fanagalo Fanakalo is a pidgin (simplified language) based primarily on Zulu, with English and a small Afrikaans input. It is used as a lingua franca, mainly in the gold, diamond, coal and copper mining industries in South Africa and to a lesser extent in the Democratic Republic of the Congo, Namibia, Zambia, and Zimbabwe. Although it is used as a second language only, the number of speakers was estimated as "several hundred thousand" in 1975. As with India, once the British went, English became the lingua franca enabling different tribes in the same country to communicate with each other, and Fanagalo use declined.
in scheme: Lexvo - ISO 639-3 language codes
notation: fng
preferred label: Fanakalo @de
preferred label: Língua fanagalo @pt

Fania
type: Language
type: Concept
ISO 639-3 code: fni
in scheme: Lexvo - ISO 639-3 language codes
notation: fni

Foodo
type: Language
type: Concept
ISO 639-3 code: fod
alternative label: Foodo language
definition: Foodo is a Guang language spoken by 25,000 in Benin, with a thousand in Ghana, where they originated.
in scheme: Lexvo - ISO 639-3 language codes
notation: fod

Foi
type: Language
type: Concept
ISO 639-3 code: foi
alternative label: Foi language
definition: Foi (Foe) is a Papuan language of Papua New Guinea. Dialects are Ifigi, Kafa, Kutubu, Mubi.
in scheme: Lexvo - ISO 639-3 language codes
notation: foi

Foma
type: Language
type: Concept
ISO 639-3 code: fom
in scheme: Lexvo - ISO 639-3 language codes
notation: fom

Fon
type: Language
type: Concept
ISO 639-2 Bibliographical code: fon
ISO 639-2 Terminological code: fon
ISO 639-3 code: fon
in scheme: Lexvo - ISO 639-3 language codes
notation: fon
preferred label: Fon-Sprache @de
preferred label: fom @pt
preferred label: fon @es

Fore
type: Language
type: Concept
ISO 639-3 code: for
alternative label: Fore language
definition: Fore (Foré) is a Papuan language spoken in the Goroka District of Eastern Highlands Province, Papua New Guinea.
in scheme: Lexvo - ISO 639-3 language codes
notation: for

Siraya
type: Language
type: Concept
ISO 639-3 code: fos
alternative label: Siraya language
definition: Siraya is a Formosan language spoken until the end of the 19th century by the indigenous Siraya people of Taiwan. Dialects of Siraya included Taivoa and Makatao.
in scheme: Lexvo - ISO 639-3 language codes
notation: fos
preferred label: Lingua Siraya @it

Kajali
type: Language
type: Concept
ISO 639-3 code: xkj
in scheme: Lexvo - ISO 639-3 language codes
notation: xkj

Fernando Po Creole English
type: Language
type: Concept
ISO 639-3 code: fpe
alternative label: Creole English, Fernando Po
in scheme: Lexvo - ISO 639-3 language codes
notation: fpe

Fas
type: Language
type: Concept
ISO 639-3 code: fqs
alternative label: Fas language
definition: Fas ( Momu, Bembi) is the eponymous language of the small Fas language family of Papua New Guinea.
in scheme: Lexvo - ISO 639-3 language codes
notation: fqs

French
type: Language
type: Concept
ISO 639-1 code: fr
ISO 639-2 Bibliographical code: fre
ISO 639-2 Terminological code: fra
ISO 639-3 code: fra
alternative label: Französische Sprache @de
alternative label: Français @fr
alternative label: French language
alternative label: Idioma francés @es
alternative label: Lingua francese @it
alternative label: Língua francesa @pt
definition: French ( or ) is a Romance language spoken as a first language in France, the Romandy region in Switzerland, Wallonia and Brussels in Belgium, Monaco, the province of Quebec and the Acadia region in Canada, and by various communities elsewhere. Second-language speakers of French are distributed throughout many parts of the world, the largest numbers of which reside in Francophone Africa. In Africa, French is most commonly spoken in Gabon (where 80% report fluency) and 110 million native speakers and 190 million second language speakers. French is the second-most studied foreign language in the world, after English.
in scheme: Lexvo - ISO 639-3 language codes
notation: fra
preferred label: Französisch @de
preferred label: francese @it
preferred label: francés @es
preferred label: francês @pt
preferred label: français @fr

Cajun French
type: Language
type: Concept
ISO 639-3 code: frc
alternative label: French, Cajun
definition: Cajun French (sometimes called Louisiana Regional French , Tulane University.) is a variety or dialects of the French language spoken primarily in Louisiana, specifically in the southern and southwestern parishes.
in scheme: Lexvo - ISO 639-3 language codes
notation: frc
preferred label: Cajun @de
preferred label: Francese cajun @it
preferred label: Francés cajún @es
preferred label: Français cadien @fr

Fordata
type: Language
type: Concept
ISO 639-3 code: frd
in scheme: Lexvo - ISO 639-3 language codes
notation: frd

Frankish
type: Language
type: Concept
ISO 639-3 code: frk
alternative label: Old Frankish
definition: :Not to be confused with Old French. Old Frankish is an extinct West Germanic language, once spoken by the Franks. It is the parent language of all Low Franconian languages, of which Dutch is the best known. Frankish was spoken in areas covering modern Low Countries and adjacent parts of France and Germany between the 4th and 8th century AD.
in scheme: Lexvo - ISO 639-3 language codes
notation: frk
preferred label: Altfränkisch @de
preferred label: Francique @fr
preferred label: Frâncico @pt

Middle French
type: Language
type: Concept
ISO 639-2 Bibliographical code: frm
ISO 639-2 Terminological code: frm
ISO 639-3 code: frm
alternative label: French, Middle (ca. 1400-1600)
alternative label: French, Middle (ca.1400-1600)
alternative label: Middle French (ca. 1400-1600)
alternative label: Mittelfranzösische Sprache @de
alternative label: francese medio @it
alternative label: francés medieval @es
alternative label: francês medieval @pt
alternative label: français moyen (1400-1600) @fr
alternative label: moyen français @fr
definition: Middle French is a historical division of the French language that covers the period from (roughly) 1340 to 1611. It is a period of transition during which: * the French language becomes clearly distinguished from the other competing Oïl languages, which are sometimes subsumed within the concept of Old French (ancien français) * the French language is imposed as the official language of the kingdom of France in place of Latin and other Oïl and Occitan languages * the literary development of French prepares the vocabulary and grammar for the Classical French (français classique) spoken in the 17th and 18th centuries.
in scheme: Lexvo - ISO 639-3 language codes
notation: frm
preferred label: Francese medio @it
preferred label: Francés medio @es
preferred label: Mittelfranzösisch @de
preferred label: Moyen français @fr
preferred label: francês médio @pt

Kaco'
type: Language
type: Concept
ISO 639-3 code: xkk
in scheme: Lexvo - ISO 639-3 language codes
notation: xkk

Old French
type: Language
type: Concept
ISO 639-2 Bibliographical code: fro
ISO 639-2 Terminological code: fro
ISO 639-3 code: fro
alternative label: Altfranzösische Sprache @de
alternative label: Ancien français @fr
alternative label: Antico francese @it
alternative label: Francés antiguo @es
alternative label: French, Old (842-ca. 1400)
alternative label: French, Old (842-ca.1400)
alternative label: Old French (842-ca. 1400)
alternative label: francês arcaico @pt
alternative label: français ancien (842-ca.1400) @fr
definition: Old French (franceis, françois, romanz; Modern French ) was the Romance dialect continuum spoken in territories that span roughly the northern half of modern France and parts of modern Belgium and Switzerland from the 9th century to the 14th century. It was then known as the langue doïl (oïl language) to distinguish it from the langue doc (Occitan language, also then called Provençal), whose territory bordered that of Old French to the south. The Norman dialect was also spread to England, Ireland, the Kingdom of Sicily and the Principality of Antioch in the Levant.
in scheme: Lexvo - ISO 639-3 language codes
notation: fro
preferred label: Altfranzösisch @de
preferred label: Francês antigo @pt
preferred label: ancien français @fr
preferred label: francese antico @it
preferred label: francés antiguo @es

Arpitan
type: Language
type: Concept
ISO 639-3 code: frp
alternative label: Francoprovençal
in scheme: Lexvo - ISO 639-3 language codes
notation: frp

Forak
type: Language
type: Concept
ISO 639-3 code: frq
in scheme: Lexvo - ISO 639-3 language codes
notation: frq

Northern Frisian
type: Language
type: Concept
ISO 639-2 Bibliographical code: frr
ISO 639-2 Terminological code: frr
ISO 639-3 code: frr
alternative label: Dialetto frisone settentrionale @it
alternative label: Frisian, Northern
alternative label: Frison septentrional @fr
alternative label: Nordfriesische Sprache @de
alternative label: North Frisian language
alternative label: frison septentrional @fr
definition: North Frisian is a minority language of Germany, spoken by about 10,000 people in North Frisia. The language is part of the larger group of the West Germanic Frisian languages.
in scheme: Lexvo - ISO 639-3 language codes
notation: frr
preferred label: Nordfriesisch @de
preferred label: frison du Nord @fr
preferred label: frisone settentrionale @it
preferred label: frisón septentrional @es
preferred label: frísio setentrional @pt

Eastern Frisian
type: Language
type: Concept
ISO 639-2 Bibliographical code: frs
ISO 639-2 Terminological code: frs
ISO 639-3 code: frs
alternative label: East Frisian Low Saxon
alternative label: Frisian, Eastern
alternative label: Ostfriesisches Platt @de
alternative label: frisão oriental @pt
definition: East Frisian Low Saxon is a West Low German dialect spoken in the East Frisian peninsula of northwestern Lower Saxony. It is used quite frequently in everyday speech there. About half of the East Frisian population in the coastal region uses Platdüütsk. A number of individuals, despite not being active speakers of Low Saxon, are able to understand it to some extent. However, both active and passive language skills are in a state of decrease.
in scheme: Lexvo - ISO 639-3 language codes
notation: frs
preferred label: Ostfriesisch @de
preferred label: frison oriental @fr
preferred label: frisone orientale @it
preferred label: frisón oriental @es
preferred label: frísio oriental @pt

Fortsenal
type: Language
type: Concept
ISO 639-3 code: frt
alternative label: Kiai language
definition: The Kiai language is a vernacular of a native people in the highlands of the central Espiritu Santo Island, Sanma Province, Republic of Vanuatu.
in scheme: Lexvo - ISO 639-3 language codes
notation: frt
preferred label: Idioma de kiai @es

Western Frisian
type: Language
type: Concept
ISO 639-1 code: fy
ISO 639-2 Bibliographical code: fry
ISO 639-2 Terminological code: fry
ISO 639-3 code: fry
alternative label: Dialetto frisone occidentale @it
alternative label: Frisian, Western
alternative label: Frison occidental @fr
alternative label: West Frisian language
alternative label: Westfriesische Sprache @de
alternative label: frison occidental @fr
alternative label: frísico ocidental @pt
definition: West Frisian (Frysk, []) is a language spoken mostly in the province of Friesland (Fryslân) in the north of the Netherlands. West Frisian is the name by which this language is usually known outside the Netherlands, to distinguish it from the closely related Frisian languages of Saterland Frisian and North Frisian, which are spoken in Germany. Within the Netherlands however, the West Frisian language is the language of the province of Friesland and is almost always called simply "Frisian": Fries in Dutch, and Frysk in Frisian; Westfries (literally: West Frisian) is the Dutch name of the West Frisian dialect of the Dutch language, spoken in West Friesland, a region in the province of North Holland.
in scheme: Lexvo - ISO 639-3 language codes
notation: fry
preferred label: Westfriesisch @de
preferred label: frison @fr
preferred label: frisone occidentale @it
preferred label: frisón occidental @es
preferred label: frísio ocidental @pt

Mainstream Kenyah
type: Language
type: Concept
ISO 639-3 code: xkl
in scheme: Lexvo - ISO 639-3 language codes
notation: xkl

Finnish Sign Language
type: Language
type: Concept
ISO 639-3 code: fse
definition: Finnish Sign Language (suomalainen viittomakieli in Finnish) is the sign language most commonly used in Finland. There are 5000 (estimate) Finnish deaf who have Finnish Sign Language as a mother tongue. Linguistically Finnish Sign Language is closest to Swedish Sign Language, from which it began to separate as an independent language in the middle of the 19th century.
in scheme: Lexvo - ISO 639-3 language codes
notation: fse
preferred label: Lingua dei segni finlandese @it
preferred label: Língua de sinais finlandesa @pt

French Sign Language
type: Language
type: Concept
ISO 639-3 code: fsl
definition: French Sign Language (langue des signes française or LSF) is the sign language of the deaf in the nation of France. According to Ethnologue, it has 50,000 to 100,000 native signers.
in scheme: Lexvo - ISO 639-3 language codes
notation: fsl
preferred label: Langue des signes française @de
preferred label: Lengua de señas francesa @es
preferred label: Língua francesa de sinais @pt

finlandssvenskt teckenspråk
type: Language
type: Concept
ISO 639-3 code: fss
alternative label: Finland-Swedish Sign Language
alternative label: suomenruotsalainen viittomakieli
in scheme: Lexvo - ISO 639-3 language codes
notation: fss

Adamawa Fulfulde
type: Language
type: Concept
ISO 639-3 code: fub
alternative label: Fulfulde, Adamawa
in scheme: Lexvo - ISO 639-3 language codes
notation: fub

Lingua pulaar
type: Language
type: Concept
ISO 639-3 code: fuc
alternative label: Pulaar language
definition: Pulaar is a Fula language spoken primarily as a first language by Fula people and Tukolor (or Toorobe) in the Senegal River valley area traditionally known as Futa Tooro, and further south and east. Pulaar speakers, known as Haalpulaar'en live in Senegal, Mauritania, Gambia, Guinea-Bissau and western Mali.
in scheme: Lexvo - ISO 639-3 language codes
notation: fuc
preferred label: Pulaar

East Futuna
type: Language
type: Concept
ISO 639-3 code: fud
alternative label: Futuna, East
alternative label: Futunan language
definition: Futunan or Futunian is the Polynesian language spoken on Futuna (and Alofi). The term East-Futunan is also used to distinguish it from the related West-Futunan (Futuna-Aniwan) spoken on the outlier islands of Futuna and Aniwa in Vanuatu.
in scheme: Lexvo - ISO 639-3 language codes
notation: fud
preferred label: Futunien @fr
preferred label: Futunische Sprache @de
preferred label: Lingua futuniana @it

Borgu Fulfulde
type: Language
type: Concept
ISO 639-3 code: fue
alternative label: Fulfulde, Borgu
in scheme: Lexvo - ISO 639-3 language codes
notation: fue

Kayan River Kayan
type: Language
type: Concept
ISO 639-3 code: xkn
alternative label: Kayan, Kayan River
in scheme: Lexvo - ISO 639-3 language codes
notation: xkn

Pular
type: Language
type: Concept
ISO 639-3 code: fuf
alternative label: Pular language
definition: Pular is a Fula language spoken primarily by Fula people in the Fouta Jalon area in Guinea. It is also spoken in parts of Guinea Bissau, Sierra Leone, and Senegal. There are a small number of speakers in Mali. Pular is spoken by 2.5 million Guineans, about 28% of the national population. This makes Pular the most widely spoken indigenous language in the country. Substantial numbers of Pular speakers have migrated to other countries in West Africa, notably Senegal.
in scheme: Lexvo - ISO 639-3 language codes
notation: fuf

Western Niger Fulfulde
type: Language
type: Concept
ISO 639-3 code: fuh
alternative label: Fulfulde, Western Niger
in scheme: Lexvo - ISO 639-3 language codes
notation: fuh

Bagirmi Fulfulde
type: Language
type: Concept
ISO 639-3 code: fui
alternative label: Fulfulde, Bagirmi
in scheme: Lexvo - ISO 639-3 language codes
notation: fui

Ko
type: Language
type: Concept
ISO 639-3 code: fuj
alternative label: Fungor language
definition: The Fungor language, Ko (Kau) or Nyaro, is a Niger–Congo language of the Heiban family spoken in Kordofan, Sudan.
in scheme: Lexvo - ISO 639-3 language codes
notation: fuj

Fulah
type: Language
type: Concept
ISO 639-1 code: ff
ISO 639-2 Bibliographical code: ful
ISO 639-2 Terminological code: ful
ISO 639-3 code: ful
alternative label: Fula language
alternative label: Fulfulde @de
alternative label: Idioma fula @es
alternative label: Lingua fula @it
alternative label: Língua fula @pt
alternative label: Peul @fr
definition: The Fula or Fulani language ( ; ) is a language of West Africa. Like the neighbouring languages Serer and Wolof, it belongs to the Senegambian branch of the Niger–Congo language family. It is spoken as a first language by the Fula people (Fula or Fulani people) and related groups (such as the Tukulor in the Senegal River Valley) from Senegambia and Guinea to Cameroon and Sudan. It is also spoken as a second language by peoples in various areas of the region.
in scheme: Lexvo - ISO 639-3 language codes
notation: ful
preferred label: Ful @de
preferred label: fula @es
preferred label: fulah @it
preferred label: peul @fr

Fum
type: Language
type: Concept
ISO 639-3 code: fum
in scheme: Lexvo - ISO 639-3 language codes
notation: fum

Fulniô
type: Language
type: Concept
ISO 639-3 code: fun
alternative label: Fulniô language
definition: Fulniô, or Yatê, is a language isolate of Brazil, and the only indigenous language remaining in the northeastern part of that country. The two dialects, Fulniô and Yatê, are very close. The Fulniô dialect is used primarily during a three-month religious retreat.
in scheme: Lexvo - ISO 639-3 language codes
notation: fun
preferred label: Idioma fulniô-yatê @es

Central-Eastern Niger Fulfulde
type: Language
type: Concept
ISO 639-3 code: fuq
alternative label: Fulfulde, Central-Eastern Niger
in scheme: Lexvo - ISO 639-3 language codes
notation: fuq

Kiorr
type: Language
type: Concept
ISO 639-3 code: xko
in scheme: Lexvo - ISO 639-3 language codes
notation: xko

Friulian
type: Language
type: Concept
ISO 639-2 Bibliographical code: fur
ISO 639-2 Terminological code: fur
ISO 639-3 code: fur
alternative label: Frioulan @fr
alternative label: Friulan language
alternative label: Furlanische Sprache @de
alternative label: Idioma friulano @es
alternative label: Lingua friulana @it
alternative label: Língua friulana @pt
definition: Friulan ( or affectionately marilenghe in Friulan, friulano in Italian) (also Eastern Ladin), is a Romance language belonging to the Rhaeto-Romance family, spoken in the Friuli region of northeastern Italy. Friulan has around 800,000 speakers, the vast majority of whom also speak Italian. It is sometimes called Eastern Ladin, since it shares the same roots as Ladin, although over the centuries it has diverged under the influence of surrounding languages, including German, Italian, Venetian, and Slovene. Documents in Friulan are attested from the 11th century, and poetry and literature dating as far back as 1300. By the 20th century, there was a revival of interest in the language, which has continued to this day.
in scheme: Lexvo - ISO 639-3 language codes
notation: fur
preferred label: Friulisch @de
preferred label: frioulan @fr
preferred label: friulano @es

Futuna-Aniwa
type: Language
type: Concept
ISO 639-3 code: fut
alternative label: Futuna-Aniwa language
definition: Futuna-Aniwa is the Polynesian language spoken on the outlier islands of Futuna and Aniwa in Vanuatu. It is also occasionally called West-Futunan to distinguish it from East-Futunan spoken on Futuna and Alofi in Wallis and Futuna.
in scheme: Lexvo - ISO 639-3 language codes
notation: fut
preferred label: Futuna-aniwa @fr

Furu
type: Language
type: Concept
ISO 639-3 code: fuu
alternative label: Furu language
definition: Furu is a Central Sudanic language of the Democratic Republic of the Congo. Ethnologue has it as one of the Kara languages, but Blench (2000) lists it as a Kresh language.
in scheme: Lexvo - ISO 639-3 language codes
notation: fuu

Nigerian Fulfulde
type: Language
type: Concept
ISO 639-3 code: fuv
alternative label: Fulfulde, Nigerian
in scheme: Lexvo - ISO 639-3 language codes
notation: fuv

Fuyug
type: Language
type: Concept
ISO 639-3 code: fuy
alternative label: Fuyug language
definition: Fuyug (Fuyuge, Fuyughe, Mafufu) is a language of Papua New Guinea.
in scheme: Lexvo - ISO 639-3 language codes
notation: fuy

Fur
type: Language
type: Concept
ISO 639-3 code: fvr
in scheme: Lexvo - ISO 639-3 language codes
notation: fvr

Tlacolulita Zapotec
type: Language
type: Concept
ISO 639-3 code: zpk
alternative label: Zapotec, Tlacolulita
in scheme: Lexvo - ISO 639-3 language codes
notation: zpk

Fwâi
type: Language
type: Concept
ISO 639-3 code: fwa
in scheme: Lexvo - ISO 639-3 language codes
notation: fwa

Kabatei
type: Language
type: Concept
ISO 639-3 code: xkp
in scheme: Lexvo - ISO 639-3 language codes
notation: xkp

Fwe
type: Language
type: Concept
ISO 639-3 code: fwe
alternative label: Fwe language
definition: Fwe, or Chifwe, is a Bantu language spoken by 10,000 people along the Okavango River in Namibia. It is closely related to Kuhane, and is one of several Bantu languages of the Okavango which have click consonants.
in scheme: Lexvo - ISO 639-3 language codes
notation: fwe

Ga
type: Language
type: Concept
ISO 639-2 Bibliographical code: gaa
ISO 639-2 Terminological code: gaa
ISO 639-3 code: gaa
alternative label: Ga language
alternative label: Ga-Sprache @de
alternative label: Lingua ga @it
preferred label: ga @es
definition: The Ga language is a Kwa language spoken in Ghana, in and around the capital Accra. It has a phonemic distinction between 3 vowel lengths.
in scheme: Lexvo - ISO 639-3 language codes
notation: gaa

Gabri
type: Language
type: Concept
ISO 639-3 code: gab
alternative label: Gabri language
definition: Gabri, sometimes disambiguated from related languages also called "Gabri" as Southern Gabri, is an East Chadic language spoken in the Tandjilé Region of Chad.
in scheme: Lexvo - ISO 639-3 language codes
notation: gab

Mixed Great Andamanese
type: Language
type: Concept
ISO 639-3 code: gac
alternative label: Great Andamanese, Mixed
in scheme: Lexvo - ISO 639-3 language codes
notation: gac

Gaddang
type: Language
type: Concept
ISO 639-3 code: gad
alternative label: Gaddang language
definition: The Gaddang language (also Gaddang or Cagayan) is spoken by up to 30,000 speakers (the Gaddang people) in the Philippines, in the northeastern provinces of Nueva Vizcaya and Isabela and by overseas immigrants in countries located Asia, Australia, Canada, Europe, in the Middle East, UK and the U.S.A.. Most of the speakers can also speak Ilocano, the lingua franca of Northern Luzon. Gaddang is derived from . It is closely related to Ibanag, Itawis, Agta, Atta, Yogad, Isneg and Malaweg.
in scheme: Lexvo - ISO 639-3 language codes
notation: gad

Guarequena
type: Language
type: Concept
ISO 639-3 code: gae
alternative label: Warekena language
definition: Guarequena (Warekena) is an Arawakan language of Brazil and Venezuela. It is one of several languages which goes by the generic name Baré.
in scheme: Lexvo - ISO 639-3 language codes
notation: gae

Gende
type: Language
type: Concept
ISO 639-3 code: gaf
alternative label: Gende language
definition: Gende (Gendeka, Gene; also Bundi) is a Papuan language spoken in Madang Province, Papua New Guinea.
in scheme: Lexvo - ISO 639-3 language codes
notation: gaf

Koroni
type: Language
type: Concept
ISO 639-3 code: xkq
in scheme: Lexvo - ISO 639-3 language codes
notation: xkq

Gagauz
type: Language
type: Concept
ISO 639-3 code: gag
alternative label: Gagauz language
definition: The Gagauz language (Gagauz dili) is a Turkic language spoken by the Gagauz people and the official language of the autonomous Moldovan region of Gagauzia. Gagauz has two dialects: Bulgar Gagauzi and Maritime Gagauzi. It should be noted that Gagauz is classified as a distinctly different language than Balkan Gagauz Turkish.
in scheme: Lexvo - ISO 639-3 language codes
notation: gag
preferred label: Gagaouze @fr
preferred label: Gagausische Sprache @de
preferred label: Idioma gagauzo @es
preferred label: Lingua gagauza @it
preferred label: Língua gagaúza @pt

Alekano
type: Language
type: Concept
ISO 639-3 code: gah
alternative label: Alekano language
definition: Alekano, or Gahuku (Gahuku-Gama), is a Papuan language spoken in the northern district of Goroka Eastern Highlands of Papua New Guinea. There are about 25,000 speakers.
in scheme: Lexvo - ISO 639-3 language codes
notation: gah

Borei
type: Language
type: Concept
ISO 639-3 code: gai
alternative label: Mbore language
definition: Mbore (Borei, Mborei) Gamei (Gamai) is a Ramu language of Papua New Guinea.
in scheme: Lexvo - ISO 639-3 language codes
notation: gai

Gadsup
type: Language
type: Concept
ISO 639-3 code: gaj
alternative label: Gadsup language
definition: Gadsup is a Kainantu language spoken by the people of the same name in Papua New Guinea.
in scheme: Lexvo - ISO 639-3 language codes
notation: gaj

Gamkonora
type: Language
type: Concept
ISO 639-3 code: gak
alternative label: Gamkorona language
definition: Gamkorona is a Papuan Halmahera language of Indonesia.
in scheme: Lexvo - ISO 639-3 language codes
notation: gak

Galoli
type: Language
type: Concept
ISO 639-3 code: gal
alternative label: Galolen
alternative label: Galoli language
definition: Galoli (also known as Galole) is an ethnic group in East Timor with a population of about 50,000, primarily along the northern coast of the district of Manatuto. To the west lies the Mambai ethnic group. There is an old colony on the southern coast of Wetar island, the Talo, who speak a mutually intelligible language.
in scheme: Lexvo - ISO 639-3 language codes
notation: gal
preferred label: Língua galóli @pt

Kandawo
type: Language
type: Concept
ISO 639-3 code: gam
in scheme: Lexvo - ISO 639-3 language codes
notation: gam

Xakriabá
type: Language
type: Concept
ISO 639-3 code: xkr
alternative label: Xakriabá language
definition: Xakriabá (also written Chakriaba, Chikriaba, Shacriaba) is an extinct Ge language formerly spoken in Minas Gerais, Brazil by the Xakriabá people, who today speak Portuguese.
in scheme: Lexvo - ISO 639-3 language codes
notation: xkr

Gan Chinese
type: Language
type: Concept
ISO 639-3 code: gan
alternative label: Chinese, Gan
alternative label: Gan language
definition: Gàn (; Gan: Gon ua), alternatively Jiangxinese ( Jiāngxī huà; Gan: Kongsi ua) is spoken as the native language by around 50 million people in the Jiangxi province of China, as well as important population in surrounding regions such as Hunan, Hubei, Anhui and Fujian. Gan is a member of the Sinitic languages of the Sino-Tibetan language family and Hakka is the closest language to Gan in terms of phonetics.
in scheme: Lexvo - ISO 639-3 language codes
notation: gan
preferred label: Chino gan @es
preferred label: Chinês gan @pt
preferred label: Gan @de
preferred label: Lingua gan @it

Gants
type: Language
type: Concept
ISO 639-3 code: gao
in scheme: Lexvo - ISO 639-3 language codes
notation: gao

Gal
type: Language
type: Concept
ISO 639-3 code: gap
in scheme: Lexvo - ISO 639-3 language codes
notation: gap

Gata'
type: Language
type: Concept
ISO 639-3 code: gaq
alternative label: Gataq language
definition: The Gataq language, also known as is a language spoken by the Didayi people of India.
in scheme: Lexvo - ISO 639-3 language codes
notation: gaq

Galeya
type: Language
type: Concept
ISO 639-3 code: gar
in scheme: Lexvo - ISO 639-3 language codes
notation: gar

Adiwasi Garasia
type: Language
type: Concept
ISO 639-3 code: gas
alternative label: Garasia, Adiwasi
in scheme: Lexvo - ISO 639-3 language codes
notation: gas

Kenati
type: Language
type: Concept
ISO 639-3 code: gat
alternative label: Kenati language
definition: Kenati is a poorly documented Papuan language spoken by only about 950 people (as of 1990) in Papua New Guinea. It is also known as Aziana, Ganati, Kenathi. Specifically, it is spoken in 3 villages located in the Eastern Highlands Province, Wonenara District of Papua New Guinea.
in scheme: Lexvo - ISO 639-3 language codes
notation: gat

Mudhili Gadaba
type: Language
type: Concept
ISO 639-3 code: gau
alternative label: Gadaba, Mudhili
in scheme: Lexvo - ISO 639-3 language codes
notation: gau

Nobonob
type: Language
type: Concept
ISO 639-3 code: gaw
alternative label: Nobonob language
definition: Nobonob (Nobanob, Nobnob), also known as Butelkud-Guntabak or Garuh, is a Papuan language of Papua New Guinea. The language expanding slightly. Ari (Ati, A’i) is a dialect.
in scheme: Lexvo - ISO 639-3 language codes
notation: gaw

Borana language
type: Language
type: Concept
ISO 639-3 code: gax
alternative label: Borana-Arsi-Guji Oromo
alternative label: Oromo, Borana-Arsi-Guji
definition: Borana is a variety of Oromo spoken in Southern Ethiopia and northern Kenya by the Borana people. Günther Schlee also notes that it is the native language of a number of related peoples, such as the Sakuye.
in scheme: Lexvo - ISO 639-3 language codes
notation: gax
preferred label: Borana @fr

Gayo
type: Language
type: Concept
ISO 639-2 Bibliographical code: gay
ISO 639-2 Terminological code: gay
ISO 639-3 code: gay
alternative label: Gayo language
definition: Gayo Language is the spoken language of about 180,000 people (1989) in the mountain region of North Sumatra around Takengon, Gayo Lues, Bener Meriah, Southeast Aceh, Genteng, and Lokop. It is classified as belonging to the Western Malayo-Polynesian branch of the Austronesian languages, but is not closely related to other languages.
in scheme: Lexvo - ISO 639-3 language codes
notation: gay
preferred label: gayo @es

Kumbewaha
type: Language
type: Concept
ISO 639-3 code: xks
in scheme: Lexvo - ISO 639-3 language codes
notation: xks

West Central Oromo
type: Language
type: Concept
ISO 639-3 code: gaz
alternative label: Oromo, West Central
in scheme: Lexvo - ISO 639-3 language codes
notation: gaz

Gbaya
type: Language
type: Concept
ISO 639-2 Bibliographical code: gba
ISO 639-2 Terminological code: gba
ISO 639-3 code: gba
alternative label: Gbaya (Central African Republic)
in scheme: Lexvo - ISO 639-3 language codes
notation: gba
preferred label: Gbaya-Sprache @de
preferred label: gbaia @pt
preferred label: gbaya @es

Kaytetye
type: Language
type: Concept
ISO 639-3 code: gbb
in scheme: Lexvo - ISO 639-3 language codes
notation: gbb

Karadjeri
type: Language
type: Concept
ISO 639-3 code: gbd
alternative label: Garadjari language
definition: Garadjari (many other spellings; see below) is an Australian Aboriginal language.
in scheme: Lexvo - ISO 639-3 language codes
notation: gbd

Niksek
type: Language
type: Concept
ISO 639-3 code: gbe
in scheme: Lexvo - ISO 639-3 language codes
notation: gbe

Gaikundi
type: Language
type: Concept
ISO 639-3 code: gbf
in scheme: Lexvo - ISO 639-3 language codes
notation: gbf

Gbanziri
type: Language
type: Concept
ISO 639-3 code: gbg
in scheme: Lexvo - ISO 639-3 language codes
notation: gbg

Kantosi
type: Language
type: Concept
ISO 639-3 code: xkt
in scheme: Lexvo - ISO 639-3 language codes
notation: xkt

Defi Gbe
type: Language
type: Concept
ISO 639-3 code: gbh
alternative label: Gbe, Defi
in scheme: Lexvo - ISO 639-3 language codes
notation: gbh

Galela
type: Language
type: Concept
ISO 639-3 code: gbi
alternative label: Galela language
definition: Galela is the most populous Papuan language spoken west of New Guinea, with some 80,000 speakers, or 95,000 if Loloda (85% intelligibility) is counted as a dialect. Other dialects are Kadai (41,000), Morotai (24,000), Kadina (10,000), and Sopi (4,000).
in scheme: Lexvo - ISO 639-3 language codes
notation: gbi

Bodo Gadaba
type: Language
type: Concept
ISO 639-3 code: gbj
alternative label: Gadaba, Bodo
alternative label: Gutob language
definition: The Gutob or Bodo Gadaba language is a Munda language of India, with the greatest concentrations of speakers being found in Koraput district of Orissa and Visakhapatnam district of Andhra Pradesh. It is also known simply as the Gadaba language, but it is different from the Dravidian Gadaba language. Other names for the Bodo Gadaba language include Gadba, Gutop, Gudwa, Godwa, Gadwa, and Boi Gadaba.
in scheme: Lexvo - ISO 639-3 language codes
notation: gbj
preferred label: Língua gadaba @pt

Gaddi
type: Language
type: Concept
ISO 639-3 code: gbk
in scheme: Lexvo - ISO 639-3 language codes
notation: gbk

Gamit
type: Language
type: Concept
ISO 639-3 code: gbl
in scheme: Lexvo - ISO 639-3 language codes
notation: gbl

Garhwali
type: Language
type: Concept
ISO 639-3 code: gbm
alternative label: Garhwali language
definition: The Garhwali language is a Central Pahari language belonging to the Northern Zone of Indo-Aryan languages. It is primarily spoken by the Garhwali people who are from the north-western Garhwal Division of the northern Indian state of Uttarakhand in the Indian Himalayas.
in scheme: Lexvo - ISO 639-3 language codes
notation: gbm

Mo'da
type: Language
type: Concept
ISO 639-3 code: gbn
in scheme: Lexvo - ISO 639-3 language codes
notation: gbn

Kaamba
type: Language
type: Concept
ISO 639-3 code: xku
in scheme: Lexvo - ISO 639-3 language codes
notation: xku

Northern Grebo
type: Language
type: Concept
ISO 639-3 code: gbo
alternative label: Grebo, Northern
in scheme: Lexvo - ISO 639-3 language codes
notation: gbo

Gbaya-Bossangoa
type: Language
type: Concept
ISO 639-3 code: gbp
in scheme: Lexvo - ISO 639-3 language codes
notation: gbp

Gbaya-Bozoum
type: Language
type: Concept
ISO 639-3 code: gbq
in scheme: Lexvo - ISO 639-3 language codes
notation: gbq

Gbagyi
type: Language
type: Concept
ISO 639-3 code: gbr
in scheme: Lexvo - ISO 639-3 language codes
notation: gbr

Gbesi Gbe
type: Language
type: Concept
ISO 639-3 code: gbs
alternative label: Gbe, Gbesi
in scheme: Lexvo - ISO 639-3 language codes
notation: gbs

Gagadu
type: Language
type: Concept
ISO 639-3 code: gbu
alternative label: Gaagudju language
definition: Gaagudju (also spelt Gagadu, Gaguju, and Kakadu) is an extinct Australian Aboriginal language formerly spoken in Arnhem Land, northern Australia, in the environs of Kakadu National Park. Its last speaker, Big Bill Neidjie, died on 23 May 2002. Classification Gaagudju has traditionally been classified with the Gunwinyguan languages. However, in 1997 Nicholas Evans proposed an Arnhem Land family that includes Gaagudju.
in scheme: Lexvo - ISO 639-3 language codes
notation: gbu
preferred label: Gaagudju @fr
preferred label: Kakadu @de

Gbanu
type: Language
type: Concept
ISO 639-3 code: gbv
alternative label: Gbanu language
definition: Gbanu (Banu, Gbanou) is a Gbaya language of the Central African Republic. The people do not consider themselves to be Gbaya, and it is not clear how distinct Gbanu is from the Gbaya language (or languages).
in scheme: Lexvo - ISO 639-3 language codes
notation: gbv

Kgalagadi
type: Language
type: Concept
ISO 639-3 code: xkv
alternative label: Kgalagadi language
definition: SheKgalagari (pronounced or ) is one of the languages spoken in Botswana, along the South African border and in Namibia. SheKgalagari is spoken by about people. SheKgalagari is the autoglottonym or name of the language used by its native speakers as defined by the United Nations, Kgalagadi is the heteroglottonym.
in scheme: Lexvo - ISO 639-3 language codes
notation: xkv

Gabi-Gabi
type: Language
type: Concept
in scheme: Lexvo - ISO 639-3 language codes

Eastern Xwla Gbe
type: Language
type: Concept
ISO 639-3 code: gbx
alternative label: Gbe, Eastern Xwla
in scheme: Lexvo - ISO 639-3 language codes
notation: gbx

Gbari
type: Language
type: Concept
ISO 639-3 code: gby
in scheme: Lexvo - ISO 639-3 language codes
notation: gby

Dari
type: Language
type: Concept
ISO 639-3 code: gbz
alternative label: Dari, Zoroastrian
alternative label: Zoroastrian Dari
definition: Dari is a Northwestern Iranian ethnolect spoken as a first language by an estimated 8,000 to 15,000 Zoroastrians in and around the cities of Yazd and Kerman in central Iran. The ethnolect is often overlooked by linguists because the region is predominantly Muslim and because Dari is primarily spoken (rarely written).
in scheme: Lexvo - ISO 639-3 language codes
notation: gbz

Mali
type: Language
type: Concept
ISO 639-3 code: gcc
alternative label: Mali language
definition: Mali or Gaktai is a Papuan language spoken in East New Britain Province on the island of New Britain, Papua New Guinea.
in scheme: Lexvo - ISO 639-3 language codes
notation: gcc

Ganggalida
type: Language
type: Concept
ISO 639-3 code: gcd
in scheme: Lexvo - ISO 639-3 language codes
notation: gcd

Galice
type: Language
type: Concept
ISO 639-3 code: gce
in scheme: Lexvo - ISO 639-3 language codes
notation: gce

Guadeloupean Creole French
type: Language
type: Concept
ISO 639-3 code: gcf
alternative label: Creole French, Guadeloupean
in scheme: Lexvo - ISO 639-3 language codes
notation: gcf

Grenadian Creole
type: Language
type: Concept
ISO 639-3 code: gcl
alternative label: Creole English, Grenadian
alternative label: Grenadian Creole English
definition: Grenadian Creole, is a term that may refer to either Grenadian Creole English or Grenadian Creole French.
in scheme: Lexvo - ISO 639-3 language codes
notation: gcl

Gaina
type: Language
type: Concept
ISO 639-3 code: gcn
in scheme: Lexvo - ISO 639-3 language codes
notation: gcn

French Guiana Creole
type: Language
type: Concept
ISO 639-3 code: gcr
alternative label: Creole French, Guianese
alternative label: Guianese Creole French
definition: French Guiana Creole is a French-lexified creole language spoken in French Guiana, and to a lesser degree, in Suriname and Guyana. It resembles Antillean Creole, but there are some lexical and grammatical differences between them. Antilleans can generally understand French Guiana Creole, though the notable differences between the créole of French Guiana and the créoles of the Caribbean may cause some instances of confusion. The diffences consist of more French and Brazilian Portuguese influences (due to the proximity of Brazil and Portuguese presence in the country for several years.) There are also words of Amerindian and African origin. There are Guianese communities in Suriname and Guyana who continue to speak French Guiana Creole.
in scheme: Lexvo - ISO 639-3 language codes
notation: gcr
preferred label: Créole guyanais @fr

Kembra
type: Language
type: Concept
ISO 639-3 code: xkw
alternative label: Kembra language
in scheme: Lexvo - ISO 639-3 language codes
notation: xkw

Colonia Tovar German
type: Language
type: Concept
ISO 639-3 code: gct
alternative label: Colonia Tovar dialect
alternative label: German, Colonia Tovar
definition: Alemán Coloniero, spoken in Colonia Tovar, Venezuela, is a dialect that belongs to the Low Alemannic branch of German.
in scheme: Lexvo - ISO 639-3 language codes
notation: gct
preferred label: Alemán Coloniero @de
preferred label: Alemán coloniero @es

Gade Lohar
type: Language
type: Concept
ISO 639-3 code: gda
alternative label: Lohar, Gade
in scheme: Lexvo - ISO 639-3 language codes
notation: gda

Pottangi Ollar Gadaba
type: Language
type: Concept
ISO 639-3 code: gdb
alternative label: Gadaba, Pottangi Ollar
in scheme: Lexvo - ISO 639-3 language codes
notation: gdb

Gugu Badhun
type: Language
type: Concept
ISO 639-3 code: gdc
in scheme: Lexvo - ISO 639-3 language codes
notation: gdc

Gedaged
type: Language
type: Concept
ISO 639-3 code: gdd
alternative label: Gedaged language
definition: Gedaged is an Austronesian language spoken by about 7000 people in coastal villages and on islands in Astrolabe Bay, Madang Province, Papua New Guinea.
in scheme: Lexvo - ISO 639-3 language codes
notation: gdd

Gude
type: Language
type: Concept
ISO 639-3 code: gde
alternative label: Gude language
definition: Gude is an Afro-Asiatic language spoken in Nigeria in Adamawa State in Mubi LGA and in Borno State in Askira-Uba LGA. It is also spoken in neighboring Cameroon. Different dialects are spoken in Nigeria and Cameroon.
in scheme: Lexvo - ISO 639-3 language codes
notation: gde

Guduf-Gava
type: Language
type: Concept
ISO 639-3 code: gdf
alternative label: Guduf-Gava language
definition: Guduf-Gava (also known as Gudupe, Afkabiye) is an Afro-Asiatic language spoken in Borno State, Nigeria.
in scheme: Lexvo - ISO 639-3 language codes
notation: gdf

Ga'dang
type: Language
type: Concept
ISO 639-3 code: gdg
alternative label: Ga'dang language
in scheme: Lexvo - ISO 639-3 language codes
notation: gdg

Gadjerawang
type: Language
type: Concept
ISO 639-3 code: gdh
alternative label: Gajirrabeng language
definition: Gajirrabeng (also spelt Gadjerawang, Gajirrawoong, Gadjerong, Gadyerong and Kajirrawung) is an Australian Aboriginal language of the Kimberley region, today known by only three or four fluent speakers.
in scheme: Lexvo - ISO 639-3 language codes
notation: gdh

Lachixío Zapotec
type: Language
type: Concept
ISO 639-3 code: zpl
alternative label: Zapotec, Lachixío
in scheme: Lexvo - ISO 639-3 language codes
notation: zpl

Gundi
type: Language
type: Concept
ISO 639-3 code: gdi
in scheme: Lexvo - ISO 639-3 language codes
notation: gdi

Karore
type: Language
type: Concept
ISO 639-3 code: xkx
alternative label: Karore language
definition: Karore is an Austronesian language spoken by about 550 individuals between the Andru and Johanna Rivers in West New Britain Province, Papua New Guinea on the island of New Britain.
in scheme: Lexvo - ISO 639-3 language codes
notation: xkx

Gurdjar
type: Language
type: Concept
ISO 639-3 code: gdj
in scheme: Lexvo - ISO 639-3 language codes
notation: gdj

Gadang
type: Language
type: Concept
ISO 639-3 code: gdk
alternative label: Gadang language
definition: Gadang is an Afro-Asiatic language spoken in southwestern Chad.
in scheme: Lexvo - ISO 639-3 language codes
notation: gdk

Dirasha
type: Language
type: Concept
ISO 639-3 code: gdl
alternative label: Dirasha language
definition: Dirasha (also known as Ghidole, Diraasha, Dirayta, Gidole, Gardulla, Dhirasha) is a member of the East Cushitic branch of the Afro-Asiatic family. It is spoken in Ethiopia in the Omo Region, in the hills west of Lake Chamo, around Gidole town. A number of speakers also use Oromo or Komso. According to Wondwosen, the "Dirasha" is the name of the people, and the name of the language is given variously as "Dirashitata, Dirayta and Diraytata" (2006:3,4).
in scheme: Lexvo - ISO 639-3 language codes
notation: gdl

Laal
type: Language
type: Concept
ISO 639-3 code: gdm
alternative label: Laal language
definition: Laal is an unclassified language spoken by 749 people in three villages in the Moyen-Chari prefecture of Chad on opposite banks of the Chari River, called Gori (lá), Damtar (ɓual), and Mailao. It may be a language isolate, in which case it would represent an isolated survival of an earlier language group of central Africa. It is unwritten (except in transcription by linguists). According to SIL-Chad member David Faris, it is in danger of extinction, with most people under 25 shifting to the locally more widespread Baguirmi language.
in scheme: Lexvo - ISO 639-3 language codes
notation: gdm

Umanakaina
type: Language
type: Concept
ISO 639-3 code: gdn
in scheme: Lexvo - ISO 639-3 language codes
notation: gdn

Ghodoberi
type: Language
type: Concept
ISO 639-3 code: gdo
alternative label: Godoberi language
definition: Godoberi (also spelled Ghodoberi) is an Andic language of the Northeast Caucasian language family spoken by the Godoberi in southwestern Dagestan, Russia. It is spoken by approximately 3,000 people.
in scheme: Lexvo - ISO 639-3 language codes
notation: gdo
preferred label: Godoberi @fr
preferred label: Lingua godoberi @it
preferred label: Língua godoberi @pt

Mehri
type: Language
type: Concept
ISO 639-3 code: gdq
alternative label: Mehri language
definition: :Not to be confused with Meheri tribes
in scheme: Lexvo - ISO 639-3 language codes
notation: gdq
preferred label: Méhri @fr

Wipi
type: Language
type: Concept
ISO 639-3 code: gdr
alternative label: Wipi language
definition: Wipii, or Gidra (also Jibu, Oriomo) is a Papuan language of New Guinea.
in scheme: Lexvo - ISO 639-3 language codes
notation: gdr

Ghandruk Sign Language
type: Language
type: Concept
ISO 639-3 code: gds
definition: Ghandruk Sign Language is an indigenous sign language of the village of Ghandruk in central Nepal.
in scheme: Lexvo - ISO 639-3 language codes
notation: gds

Kungardutyi
type: Language
type: Concept
in scheme: Lexvo - ISO 639-3 language codes

Gudu
type: Language
type: Concept
ISO 639-3 code: gdu
alternative label: Gudu language
definition: Gudu (also known as Gudo, Gutu) is an Afro-Asiatic language spoken in Nigeria in Adamawa State in the Song LGA. Kumbi is a dialect.
in scheme: Lexvo - ISO 639-3 language codes
notation: gdu

Uma' Lasan
type: Language
type: Concept
ISO 639-3 code: xky
in scheme: Lexvo - ISO 639-3 language codes
notation: xky

Godwari
type: Language
type: Concept
ISO 639-3 code: gdx
definition: Godwari is a dialect of Marwari spoken in Godwar.
in scheme: Lexvo - ISO 639-3 language codes
notation: gdx

Geruma
type: Language
type: Concept
ISO 639-3 code: gea
alternative label: Geruma language
definition: Geruma (also known as Gerema, Germa) is an Afro-Asiatic language spoken in Nigeria. Dialects include Duurum and Sum. Speakers are shifting to Hausa.
in scheme: Lexvo - ISO 639-3 language codes
notation: gea

Kire
type: Language
type: Concept
ISO 639-3 code: geb
alternative label: Kire language
definition: Kire (Giri) is a Ramu language of Papua New Guinea.
in scheme: Lexvo - ISO 639-3 language codes
notation: geb

Gboloo Grebo
type: Language
type: Concept
ISO 639-3 code: gec
alternative label: Grebo, Gboloo
in scheme: Lexvo - ISO 639-3 language codes
notation: gec

Gade
type: Language
type: Concept
ISO 639-3 code: ged
in scheme: Lexvo - ISO 639-3 language codes
notation: ged

Gengle
type: Language
type: Concept
ISO 639-3 code: geg
in scheme: Lexvo - ISO 639-3 language codes
notation: geg

Hutterisch
type: Language
type: Concept
ISO 639-3 code: geh
alternative label: German, Hutterite
alternative label: Hutterite German
definition: Hutterite German (Hutterisch) is an Upper German dialect of the Austro-Bavarian variety of the German language, which is spoken by Hutterite communities in Canada and the United States. Hutterite is also called Tirolean or Low German, but these are anachronisms.
in scheme: Lexvo - ISO 639-3 language codes
notation: geh
preferred label: Hutterische Sprache @de

Kurtokha
type: Language
type: Concept
ISO 639-3 code: xkz
alternative label: Kurtöp language
definition: The Kurtöp language (Dzongkha: ཀུར་ཏོ་པ་ཁ་; Wylie: Kur-to-pa kha; Kurtöpkha, also called Kurtö and Zhâke) is a member of the Tibeto-Burman language family spoken in the Kurtoe Gewog, Lhuntse District, Bhutan. There are about 10,000 speakers of Kurtöp.
in scheme: Lexvo - ISO 639-3 language codes
notation: xkz

Gebe
type: Language
type: Concept
ISO 639-3 code: gei
in scheme: Lexvo - ISO 639-3 language codes
notation: gei

Gen
type: Language
type: Concept
ISO 639-3 code: gej
alternative label: Gen language
definition: Gen (also called , , Gebe, Guin, Mina, Mina-Gen, and Popo) is a Gbe language spoken in the southeast of Togo in the Maritime Region. It is also spoken in the Mono Department of Benin. It is part of the Volta–Niger branch of the major African Niger–Congo language family. Like the other Gbe languages, Gen is a tonal language.
in scheme: Lexvo - ISO 639-3 language codes
notation: gej
preferred label: Lingua gen @it
preferred label: Língua gen @pt

Yiwom
type: Language
type: Concept
ISO 639-3 code: gek
alternative label: Yiwom language
definition: Yiwom Gerka is a Chadic (Afro-Asiatic) language spoken in Plateau State, Nigeria.
in scheme: Lexvo - ISO 639-3 language codes
notation: gek

ut-Ma'in
type: Language
type: Concept
ISO 639-3 code: gel
alternative label: Ut-Ma'in language
alternative label: ut-Ma'in language
definition: ut-Ma’in or Fakai is a dialect continuum spoken by 36,000 people in the Fakai district of Nigeria. There are numerous rather divergent dialects: *Kag (Puku, Fakanchi, Et-Kag) *Jiir (Gelanchi, Et-Jiir) *Kur (Kere, Kar, Keri-Ni, Kelli-Ni, Kelanchi, Kelinci) *Zuksun (Zussun, Et-Zuksun) *Ror (Et-Maror, Tudanchi, Er-Gwar) *Fer (Fere, Et-Fer, Wipsi-Ni, Kukum) *Us (Et-Us) *Koor (Kulu)
in scheme: Lexvo - ISO 639-3 language codes
notation: gel
preferred label: Ut-Ma'in @de

Geme
type: Language
type: Concept
ISO 639-3 code: geq
alternative label: Geme language
definition: Geme is a Ubangian language spoken in two small villages of the Central African Republic.
in scheme: Lexvo - ISO 639-3 language codes
notation: geq

Geser-Gorom
type: Language
type: Concept
ISO 639-3 code: ges
in scheme: Lexvo - ISO 639-3 language codes
notation: ges

Gera
type: Language
type: Concept
ISO 639-3 code: gew
alternative label: Gera language
definition: Gera (also known as Gerawa) is an Afro-Asiatic language spoken in Nigeria. Speakers are shifting to Hausa.
in scheme: Lexvo - ISO 639-3 language codes
notation: gew

Garre
type: Language
type: Concept
ISO 639-3 code: gex
alternative label: Garre language
definition: Garre (also known as Af-Garre) is an Afro-Asiatic language spoken in southern Somalia, Kenya and Ethiopia by the Garre people.
in scheme: Lexvo - ISO 639-3 language codes
notation: gex

Enya
type: Language
type: Concept
ISO 639-3 code: gey
alternative label: Enya language
definition: Enya is a Bantu language of the Democratic Republic of the Congo.
in scheme: Lexvo - ISO 639-3 language codes
notation: gey

Ge'ez
type: Language
type: Concept
ISO 639-2 Bibliographical code: gez
ISO 639-2 Terminological code: gez
ISO 639-3 code: gez
alternative label: Ge'ez language
alternative label: Ge’ez @de
alternative label: Lingua ge'ez @it
alternative label: Língua ge'ez @pt
alternative label: guèze @fr
definition: Geez (ግዕዝ, ; also transliterated Giiz, and less precisely called Ethiopic) is an ancient South Semitic language that originated in southern Arabia (modern Yemen) and was further developed in the northern region of Ethiopia and southern Eritrea in the Horn of Africa. It later became the official language of the Kingdom of Aksum and Ethiopian imperial court.
in scheme: Lexvo - ISO 639-3 language codes
notation: gez
preferred label: Geez
preferred label: geez @es

Patpatar
type: Language
type: Concept
ISO 639-3 code: gfk
alternative label: Patpatar language
definition: Patpatar is an Austronesian language spoken in New Ireland Province in Papua New Guinea.
in scheme: Lexvo - ISO 639-3 language codes
notation: gfk

Kamula
type: Language
type: Concept
ISO 639-3 code: xla
alternative label: Kamula language
definition: Kamula is a Trans–New Guinea language that forms an independent branch of that family in the classification of Malcolm Ross (2005).
in scheme: Lexvo - ISO 639-3 language codes
notation: xla

Gafat
type: Language
type: Concept
ISO 639-3 code: gft
alternative label: Gafat language
definition: The Gafat language is an extinct Semitic language that was once spoken along the Abbay River in Ethiopia. The records of this language are extremely sparse. There is a translation of the Song of Songs written in the 17th or 18th Century held at the Bodleian Library. Charles Beke collected a word list in the early 1840s with difficulty from the few who knew the language, having found that "the rising generation seem to be altogether ignorant of it; and those grown-up persons who profess to speak it are anything but familiar with it." The most recent accounts of this language are the reports of Wolf Leslau, who visited the region in 1947 and after considerable work was able to find a total of four people who could still speak the language. Edward Ullendorff, in his brief exposition on Gafat, concludes that as of the time of his writing, "one may ...
in scheme: Lexvo - ISO 639-3 language codes
notation: gft

Mangetti Dune !Xung
type: Language
type: Concept
ISO 639-3 code: gfx
alternative label: !Xung, Mangetti Dune
in scheme: Lexvo - ISO 639-3 language codes
notation: gfx

Gao
type: Language
type: Concept
ISO 639-3 code: gga
in scheme: Lexvo - ISO 639-3 language codes
notation: gga

Gbii
type: Language
type: Concept
ISO 639-3 code: ggb
alternative label: Gbii language
definition: The Gbii language, also known as Gbee or Gbi-Dowlu, is a Kru language of the Niger–Congo language family. It is spoken in northern Liberia, primarily in Nimba County. Its dialects include Dorbor and Kplor. It has a lexical similarity of 0.78 with the Bassa language, and so might be considered a Bassa dialect.
in scheme: Lexvo - ISO 639-3 language codes
notation: ggb

Gugadj
type: Language
type: Concept
ISO 639-3 code: ggd
in scheme: Lexvo - ISO 639-3 language codes
notation: ggd

Guragone
type: Language
type: Concept
ISO 639-3 code: gge
alternative label: Guragone language
definition: Guragone, also spelled Gorogone, Gun-Guragone, Gunagoragone, Gungorogone, Gurrgoni, Gurrogone, Gutjertabia, is an Australian Aboriginal language spoken in Arnhem Land. There were about 20 speakers in 1991, all bilingual in Burarra or Gunwinggu.
in scheme: Lexvo - ISO 639-3 language codes
notation: gge

Gurgula
type: Language
type: Concept
ISO 639-3 code: ggg
in scheme: Lexvo - ISO 639-3 language codes
notation: ggg

Kungarakany
type: Language
type: Concept
ISO 639-3 code: ggk
alternative label: Kungarakany language
definition: Kungarakany (Gunerakan, Gungaragan, Gungarakanj, Kangarraga, Kungarakan) is an Australian language spoken in the Northern Territory.
in scheme: Lexvo - ISO 639-3 language codes
notation: ggk

Ganglau
type: Language
type: Concept
ISO 639-3 code: ggl
in scheme: Lexvo - ISO 639-3 language codes
notation: ggl

Gugu Mini
type: Language
type: Concept
in scheme: Lexvo - ISO 639-3 language codes

Eastern Gurung
type: Language
type: Concept
ISO 639-3 code: ggn
alternative label: Gurung, Eastern
in scheme: Lexvo - ISO 639-3 language codes
notation: ggn

Loup B
type: Language
type: Concept
ISO 639-3 code: xlb
in scheme: Lexvo - ISO 639-3 language codes
notation: xlb

Southern Gondi
type: Language
type: Concept
ISO 639-3 code: ggo
alternative label: Gondi, Southern
in scheme: Lexvo - ISO 639-3 language codes
notation: ggo

Aghu Tharnggalu
type: Language
type: Concept
ISO 639-3 code: ggr
alternative label: Aghu Tharrnggala language
definition: Aghu Tharrnggala (or Aghu Tharnggalu) is an extinct Paman language variety formerly spoken on the Cape York Peninsula in Queensland, Australia. The name may also be used to refer to a language consisting of the Aghu Tharrngala dialect and several other related varieties. It is closely related to the other Kuku-Mini languages, and it is unknown when it went extinct.
in scheme: Lexvo - ISO 639-3 language codes
notation: ggr

Gitua
type: Language
type: Concept
ISO 639-3 code: ggt
in scheme: Lexvo - ISO 639-3 language codes
notation: ggt

Gban
type: Language
type: Concept
ISO 639-3 code: ggu
alternative label: Gagu
alternative label: Gagu language
definition: Gagu (Gagou), or Gban, is a Mande language of Ivory Coast. Dialects are N’da, Bokwa, Bokabo, Tuka.
in scheme: Lexvo - ISO 639-3 language codes
notation: ggu

Gogodala
type: Language
type: Concept
ISO 639-3 code: ggw
alternative label: Gogodala language
definition: Gogodala is a Papuan language of Papua New Guinea. Its closest relative is the Ari language.
in scheme: Lexvo - ISO 639-3 language codes
notation: ggw

Ghadamès
type: Language
type: Concept
ISO 639-3 code: gha
alternative label: Ghadamès language
definition: Ghadamès is a language spoken mainly by some Libyan Berbers. It is spoken in Ghadames, a small oasis town near the Libyan border with Algeria and Tunisia. It is spoken by 2,000 people in Libya, and 2,000 elsewhere. It has two dialects, Ayt Waziten and Elt Ulid.
in scheme: Lexvo - ISO 639-3 language codes
notation: gha

Classical Gaelic
type: Language
type: Concept
ISO 639-3 code: ghc
alternative label: Gaelic, Hiberno-Scottish
alternative label: Hiberno-Scottish Gaelic
definition: Classical Gaelic (; Irish: Gaeilge Chlasaiceach) is the term used in Scotland for the shared literary form that was in use in Scotland and Ireland 13th to the 18th century. The language is that of Early Modern Irish (also known as Classical Irish but not to be confused with Classical Old Irish). Although the first written signs of Scottish Gaelic having diverged from Early Modern Irish appear as far back as the 12th century annotations of the Book of Deer, Scottish Gaelic did not appear in writing or print on a significant scale until the 1767 translation of the New Testament into Scottish Gaelic.
in scheme: Lexvo - ISO 639-3 language codes
notation: ghc

Lycian
type: Language
type: Concept
ISO 639-3 code: xlc
alternative label: Lycian language
definition: Lycian language (Lycian: 𐊗𐊕𐊐𐊎𐊆𐊍𐊆 Trm̃mili ) refers to the inscriptional language of ancient Lycia, populated by Lycians, as well as its presumed spoken counterpart.
in scheme: Lexvo - ISO 639-3 language codes
notation: xlc
preferred label: Idioma licio @es
preferred label: Lingua licia @it
preferred label: Lycien @fr
preferred label: Lykische Sprache @de

Southern Ghale
type: Language
type: Concept
ISO 639-3 code: ghe
alternative label: Ghale, Southern
in scheme: Lexvo - ISO 639-3 language codes
notation: ghe

Northern Ghale
type: Language
type: Concept
ISO 639-3 code: ghh
alternative label: Ghale, Northern
in scheme: Lexvo - ISO 639-3 language codes
notation: ghh

Geko Karen
type: Language
type: Concept
ISO 639-3 code: ghk
alternative label: Karen, Geko
in scheme: Lexvo - ISO 639-3 language codes
notation: ghk

Ghulfan
type: Language
type: Concept
ISO 639-3 code: ghl
in scheme: Lexvo - ISO 639-3 language codes
notation: ghl

Ghanongga
type: Language
type: Concept
ISO 639-3 code: ghn
alternative label: Ghanongga language
definition: Ghanongga is an Oceanic language spoken by about 2,500 people on Ranongga Island, Solomon Islands.
in scheme: Lexvo - ISO 639-3 language codes
notation: ghn

Ghomara
type: Language
type: Concept
ISO 639-3 code: gho
alternative label: Ghomara language
definition: The language of the Ghomara is a Northern Berber language spoken by at least 10,000 people in Morocco near Tetouan and Chaouen. While included in the Zenati subgroup by some sources (such as the Ethnologue), it is probably more closely related to southern Moroccan languages, such as Central Atlas Tamazight and Shilha. Ghomara Berber is spoken on the western edge of the Rif in Morocco. Contrary to the Ethnologue, it is not extinct; Peter Behnstedt reports that it is spoken in at least the douar of Amtiqan and its immediate neighborhood, just west of Oued Ouringa. However, it is spoken by only a small minority of the Ghomara; even in 1931, according to Carleton Coon, only one of their eight tribes, the Beni Bu Zra, continued to speak it. It is relatively similar to the so-called Senhadja de Srair Berber varieties, spoken around Ketama, but s probably difficult to understand for a speaker of the mainstream dialects of Riff.
in scheme: Lexvo - ISO 639-3 language codes
notation: gho

Ghera
type: Language
type: Concept
ISO 639-3 code: ghr
in scheme: Lexvo - ISO 639-3 language codes
notation: ghr

Guhu-Samane
type: Language
type: Concept
ISO 639-3 code: ghs
alternative label: Guhu-Samane language
definition: Guhu-Samane, also known as Bia, Mid-Waria, Muri, Paiawa, Tahari, is a divergent Trans–New Guinea language that was related to the Binanderean family in the classification of Malcolm Ross (2005).
in scheme: Lexvo - ISO 639-3 language codes
notation: ghs

Kuke
type: Language
type: Concept
ISO 639-3 code: ght
alternative label: Ghale, Kutang
alternative label: Kutang Ghale
in scheme: Lexvo - ISO 639-3 language codes
notation: ght

Kitja
type: Language
type: Concept
ISO 639-3 code: gia
alternative label: Kija language
definition: Kija is an Australian Aboriginal language today spoken by about 100 people, most of whom live in the region from Halls Creek to Kununurra in Western Australia.
in scheme: Lexvo - ISO 639-3 language codes
notation: gia

Gibanawa
type: Language
type: Concept
ISO 639-3 code: gib
in scheme: Lexvo - ISO 639-3 language codes
notation: gib

Gail
type: Language
type: Concept
ISO 639-3 code: gic
alternative label: Gayle language
definition: Gayle, or Gail, is an English and Afrikaans-based gay argot or cant slang used primarily by English and Afrikaans-speaking homosexual men in urban communities of South Africa, and is similar in some respects to Polari in the United Kingdom, from which some lexical items have been borrowed. The equivalent language used by homosexual South African men who speak Bantu languages is called IsiNgqumo, and is based on a Nguni lexicon.
in scheme: Lexvo - ISO 639-3 language codes
notation: gic
preferred label: Língua gail @pt

Gidar
type: Language
type: Concept
ISO 639-3 code: gid
alternative label: Gidar language
definition: Gidar is a divergent Biu–Mandara (Chadic) language of Cameroon and Chad.
in scheme: Lexvo - ISO 639-3 language codes
notation: gid

Goaria
type: Language
type: Concept
ISO 639-3 code: gig
alternative label: Goaria language
definition: Goaria is a Marwari Rajasthani language spoken by some 25,000 people in Sindh Province, Pakistan. The people are predominantly Hindu, and use the Hindi language for worship.
in scheme: Lexvo - ISO 639-3 language codes
notation: gig
preferred label: Lingua goaria @it

Githabul
type: Language
type: Concept
in scheme: Lexvo - ISO 639-3 language codes

Gilbertese
type: Language
type: Concept
ISO 639-2 Bibliographical code: gil
ISO 639-2 Terminological code: gil
ISO 639-3 code: gil
alternative label: Gilbertese language
alternative label: Gilbertesische Sprache @de
alternative label: Gilbertin @fr
alternative label: Idioma gilbertés @es
alternative label: Lingua gilbertese @it
alternative label: gilbertais @fr
alternative label: gilbertês @pt
definition: Gilbertese or Kiribati (or sometimes Kiribatese) is a language from the Austronesian family, part of the Oceanian branch and of the Nuclear Micronesian subbranch. It has a basic verb–object–subject word order.
in scheme: Lexvo - ISO 639-3 language codes
notation: gil
preferred label: Gilbertesisch @de
preferred label: Gilbertês @pt
preferred label: gilbertese @it
preferred label: gilbertés @es
preferred label: kiribati @fr

Lydian
type: Language
type: Concept
ISO 639-3 code: xld
alternative label: Lydian language
definition: Lydian was an Indo-European language spoken in the region of Lydia in western Anatolia (present-day Turkey). It belongs to the Anatolian group of the Indo-European language family.
in scheme: Lexvo - ISO 639-3 language codes
notation: xld
preferred label: Idioma lidio @es
preferred label: Lingua lidia @it
preferred label: Lydien @fr
preferred label: Lydische Sprache @de

Gimi
type: Language
type: Concept
ISO 639-3 code: gim
alternative label: Gimi (Eastern Highlands)
alternative label: Gimi language
definition: Gimi (Labogai) is a Papuan language spoken in Eastern Highlands Province, Papua New Guinea.
in scheme: Lexvo - ISO 639-3 language codes
notation: gim

Hinukh
type: Language
type: Concept
ISO 639-3 code: gin
alternative label: Hinukh language
definition: The Hinukh language (Hinukh: гьинузас мец hinuzas mec, also known as Hinux, Ginukh, or Ginux) is a Northeast Caucasian language of the Tsezic subgroup. It is spoken by about 200 to 500 people, the Hinukhs, in the Tsunta district of southwestern Dagestan, mainly in the village of Genukh (Hinukh: Hino). Hinukh is very closely related to Tsez, but they are not entirely mutually intelligible.
in scheme: Lexvo - ISO 639-3 language codes
notation: gin
preferred label: Hinuchische Sprache @de

Gimi
type: Language
type: Concept
ISO 639-3 code: gip
alternative label: Gimi (West New Britain)
in scheme: Lexvo - ISO 639-3 language codes
notation: gip

Green Gelao
type: Language
type: Concept
ISO 639-3 code: giq
alternative label: Gelao, Green
in scheme: Lexvo - ISO 639-3 language codes
notation: giq

Red Gelao
type: Language
type: Concept
ISO 639-3 code: gir
alternative label: Gelao, Red
in scheme: Lexvo - ISO 639-3 language codes
notation: gir

North Giziga
type: Language
type: Concept
ISO 639-3 code: gis
alternative label: Giziga, North
alternative label: North Giziga language
definition: North Giziga is an Afro-Asiatic language spoken in northern Cameroon.
in scheme: Lexvo - ISO 639-3 language codes
notation: gis

Gitxsan
type: Language
type: Concept
ISO 639-3 code: git
alternative label: Gitxsan language
definition: Gitxsan (or Gitxsanimaax, Gitksan, Giatikshan, Gityskyan, Giklsan) is a First Nations language of northwestern British Columbia. It is a Tsimshianic language, closely related to the neighboring Nisga’a language. The two groups are, however, politically separate and prefer to refer to Gitxsan and Nisga'a as distinct languages. Gitxsanimaax is an endangered language, currently estimated to have no more than 1,000 speakers, of whom the great majority are elders. Few if any children grow up speaking it at home.
in scheme: Lexvo - ISO 639-3 language codes
notation: git
preferred label: Gitksan @fr

Mulao
type: Language
type: Concept
ISO 639-3 code: giu
in scheme: Lexvo - ISO 639-3 language codes
notation: giu

White Gelao
type: Language
type: Concept
ISO 639-3 code: giw
alternative label: Gelao, White
in scheme: Lexvo - ISO 639-3 language codes
notation: giw

Gilima
type: Language
type: Concept
ISO 639-3 code: gix
in scheme: Lexvo - ISO 639-3 language codes
notation: gix

Giyug
type: Language
type: Concept
ISO 639-3 code: giy
in scheme: Lexvo - ISO 639-3 language codes
notation: giy

South Giziga
type: Language
type: Concept
ISO 639-3 code: giz
alternative label: Giziga, South
alternative label: South Giziga language
definition: South Giziga is an Afro-Asiatic language spoken in northern Cameroon. Dialects are Mi Mijivin, Muturami, and Rum.
in scheme: Lexvo - ISO 639-3 language codes
notation: giz

Geji
type: Language
type: Concept
ISO 639-3 code: gji
alternative label: Geji language
definition: Geji (Gezawa) is a minor Chadic language of Nigeria.
in scheme: Lexvo - ISO 639-3 language codes
notation: gji

Kachi Koli
type: Language
type: Concept
ISO 639-3 code: gjk
alternative label: Koli, Kachi
in scheme: Lexvo - ISO 639-3 language codes
notation: gjk

Gunditjmara
type: Language
type: Concept
in scheme: Lexvo - ISO 639-3 language codes

Gonja
type: Language
type: Concept
ISO 639-3 code: gjn
alternative label: Gonja language
definition: The Gonja language is a Kwa language spoken by an estimated 230,000 people, almost all of whom are of the Gonja ethnic group of northern Ghana. Related to Guang languages in the south of Ghana, it is spoken by about a third of the population in the northern region. The Brong-Ahafo and Volta regions lie to the south of the Gonja-speaking area, while Dagombas, Mamprussis and Walas are to the north. Its dialects are Gonja and Choruba.
in scheme: Lexvo - ISO 639-3 language codes
notation: gjn

Lemnian
type: Language
type: Concept
ISO 639-3 code: xle
alternative label: Lemnian language
definition: The Lemnian language is a language of the 6th century BC spoken on the island of Lemnos. It is mainly attested by an inscription found on a funerary stele, termed the Lemnos stele, discovered in 1885 near Kaminia. However, fragments of inscriptions on local pottery show that it was spoken there by a community. In 2009, a newly discovered inscription from Efestia was reported. Lemnian is accepted as being closely related to Etruscan. After the Athenians conquered the island in the latter half of that century, Lemnian was replaced by Attic Greek.
in scheme: Lexvo - ISO 639-3 language codes
notation: xle
preferred label: Idioma lemnio @es
preferred label: Langue de Lemnos @fr
preferred label: Lemnische Sprache @de
preferred label: Lingua lemnia @it
preferred label: Língua lêmnia @pt

Gujari
type: Language
type: Concept
ISO 639-3 code: gju
alternative label: Gujari language
definition: Gojri, also known as Gujari is a variety of Rajasthani spoken by the Gujjars of Northern-Pakistan, India and Afghanistan. Rajasthani, Marwari and Gujarati are evolved from Gujari. The language was known as Gujjar bhakha or Gurjar Apabhramsha lately. It was used as literary language as early as 12th century. The poet Bhoja referred to Gaurjar Apabhramsha (Gurjar Apabhramsha) in 1014 AD.
in scheme: Lexvo - ISO 639-3 language codes
notation: gju

Guya
type: Language
type: Concept
ISO 639-3 code: gka
in scheme: Lexvo - ISO 639-3 language codes
notation: gka

Ndai
type: Language
type: Concept
ISO 639-3 code: gke
in scheme: Lexvo - ISO 639-3 language codes
notation: gke

Gokana
type: Language
type: Concept
ISO 639-3 code: gkn
alternative label: Gokana language
definition: Gokana (Gòkánà) is an Ogoni language spoken by some 130,000 people in Rivers State, Nigeria.
in scheme: Lexvo - ISO 639-3 language codes
notation: gkn

Kok-Nar
type: Language
type: Concept
ISO 639-3 code: gko
in scheme: Lexvo - ISO 639-3 language codes
notation: gko

Guinea Kpelle
type: Language
type: Concept
ISO 639-3 code: gkp
alternative label: Kpelle, Guinea
in scheme: Lexvo - ISO 639-3 language codes
notation: gkp

Gaelic
type: Language
type: Concept
ISO 639-1 code: gd
ISO 639-2 Bibliographical code: gla
ISO 639-2 Terminological code: gla
ISO 639-3 code: gla
alternative label: Canadian Gaelic
alternative label: Gaelic, Scottish
alternative label: Gaélique canadien @fr
alternative label: Kanadisch-Gälische Sprache @de
alternative label: Lingua gaelica canadese @it
alternative label: Scottish Gaelic
alternative label: gaélique écossais @fr
definition: Canadian Gaelic or Cape Breton Gaelic , locally just Gaelic or The Gaelic, refers to the dialects of Scottish Gaelic that have been spoken continuously for more than 200 years on Cape Breton Island and in isolated enclaves on the Nova Scotia mainland. To a lesser extent the language is also spoken on nearby Prince Edward Island, New Brunswick, Glengarry County in present-day Ontario and by emigrant Gaels living in major Canadian cities such as Toronto. At its peak in the mid-19th century, Gaelic, considered together with the closely related Irish language, was the third most spoken language in Canada after English and French. The language has sharply declined since that period, however, and is now nearly extinct. Recently, efforts have been made to revitalise the language.
in scheme: Lexvo - ISO 639-3 language codes
notation: gla
preferred label: Schottisches Gälisch @de
preferred label: gaelico scozzese @it
preferred label: gaélico escocés @es
preferred label: gaélico escocês @pt
preferred label: gaélique @fr

Bon Gula
type: Language
type: Concept
ISO 639-3 code: glc
in scheme: Lexvo - ISO 639-3 language codes
notation: glc

Nanai
type: Language
type: Concept
ISO 639-3 code: gld
alternative label: Nanai language
definition: The Nanai language (also called Gold language or Hezhen language) is spoken by the Nanai people in Siberia, and to a much smaller extent in China's Heilongjiang province, where it is known as Hezhe. The language has about 3,902 speakers out of 12,160 members of the ethnicity, but most of them (especially younger generations) are also fluent in Russian or Chinese (depending on the country where they live), and mostly use one of those languages for communication.
in scheme: Lexvo - ISO 639-3 language codes
notation: gld
preferred label: Nanaï @fr

Irish
type: Language
type: Concept
ISO 639-1 code: ga
ISO 639-2 Bibliographical code: gle
ISO 639-2 Terminological code: gle
ISO 639-3 code: gle
alternative label: Idioma irlandés @es
alternative label: Irische Sprache @de
alternative label: Irish language
alternative label: Lingua irlandese @it
alternative label: Língua irlandesa @pt
alternative label: irlandais @fr
definition: Irish , also known as Irish Gaelic, is a Goidelic language of the Indo-European language family, originating in Ireland and historically spoken by the Irish people. Irish is now spoken as a first language by a small minority of Irish people, as well as being a second language of a larger proportion of the population. Irish enjoys constitutional status as the national and first official language of the Republic of Ireland. It is an official language of the European Union and an officially recognised minority language in Northern Ireland.
in scheme: Lexvo - ISO 639-3 language codes
notation: gle
preferred label: Irisch @de
preferred label: Irlandais @fr
preferred label: irlandese @it
preferred label: irlandés @es
preferred label: irlandês @pt

Galician
type: Language
type: Concept
ISO 639-1 code: gl
ISO 639-2 Bibliographical code: glg
ISO 639-2 Terminological code: glg
ISO 639-3 code: glg
alternative label: Galician language
alternative label: Galicische Sprache @de
alternative label: Idioma gallego @es
alternative label: Lingua gallega @it
alternative label: Língua galega @pt
alternative label: galicien @fr
definition: Galician (, ) is a language of the Western Ibero-Romance branch, spoken in Galicia, an autonomous community located in northwestern Spain, where it is co-official with Castilian, as well as in border zones of the neighbouring territories of Asturias and Castile and León.
in scheme: Lexvo - ISO 639-3 language codes
notation: glg
preferred label: Galicien @fr
preferred label: Galizisch @de
preferred label: galego @pt
preferred label: galiziano @it
preferred label: gallego @es

Northwest Pashayi
type: Language
type: Concept
ISO 639-3 code: glh
alternative label: Pashayi, Northwest
in scheme: Lexvo - ISO 639-3 language codes
notation: glh

Guliguli
type: Language
type: Concept
ISO 639-3 code: gli
alternative label: Guliguli language
definition: Guliguli is an extinct language that was allegedly once spoken on the western slopes of Mt Vinaroni, New Georgia, Solomon Islands. The linguist Karen Davis is skeptical that Guliguli ever existed, since the word guliguli has an obscene meaning in the neighboring Hoava language, and there is no memory among Hoava speakers of a neighboring language with that name. Guliguli was probably either a dialect of the extinct Kazukuru language, or a naive transcription of (the main dialect of) Kazukuru, or even a hoax.
in scheme: Lexvo - ISO 639-3 language codes
notation: gli
preferred label: Idioma guliguli @es

Gula Iro
type: Language
type: Concept
ISO 639-3 code: glj
alternative label: Gula Iro language
definition: The Gula Iro language (autonym kùláál) is a Bua language spoken by some 3,500 people (as of 1991) north and east of Lake Iro in southern Chad, between the Bola and Salamat rivers. It has four dialects, according to Pairault: *páṭóól, the northernmost and the least comprehensible to speakers of the other dialects, spoken in and around Badi; *pòŋààl, by the north shore of the lake, spoken in and around Boum Kabir, Boum Sarher, and Tordjigel; *tɩ́ààlà, spoken east and south of the lake, including Kouré, Bouni, Tormorhal, and Masidjanga; *tííṭààl, the easternmost, spoken in various villages west of Tamba;
in scheme: Lexvo - ISO 639-3 language codes
notation: glj

Gilaki
type: Language
type: Concept
ISO 639-3 code: glk
alternative label: Gilaki language
definition: The Gilaki language is a Caspian language, and a member of the northwestern Iranian language branch, spoken in Iran's Gīlān Province.
in scheme: Lexvo - ISO 639-3 language codes
notation: glk
preferred label: Gileki @es
preferred label: Lingua gilaki @it

Mixtepec Zapotec
type: Language
type: Concept
ISO 639-3 code: zpm
alternative label: Zapotec, Mixtepec
in scheme: Lexvo - ISO 639-3 language codes
notation: zpm

Garlali
type: Language
type: Concept
in scheme: Lexvo - ISO 639-3 language codes

Ligurian
type: Language
type: Concept
ISO 639-3 code: xlg
alternative label: Ligurian (Ancient)
alternative label: Ligurian language
definition: The Ligurian language was spoken in pre-Roman times and into the Roman era by an ancient people of north-western Italy and south-eastern France known as the Ligures. Very little is known about this language (mainly place names and personal names remain) which is generally believed to have been, in the 1st millennium BCE, Indo-European; it appears to have shared many features with other Indo-European languages, primarily Celtic (Gaulish) and Italic (Latin and the Osco-Umbrian languages). For examples of the Corsican toponymy cited by Jubainville, see Prehistory of Corsica. In Jubainville's view, two languages mentioned by classical authors were survivals from prehistory: Ligurian and Iberian. This choice of languages relies on Seneca the Younger, who spent eight years in exile on Corsica starting in 41 AD and expressed the opinion that the coastal Corsicans were Ligurian but the inlanders were of Iberian extraction, most like the Cantabri.
in scheme: Lexvo - ISO 639-3 language codes
notation: xlg
preferred label: Antiguo idioma ligur @es
preferred label: Ligure ancien @fr
preferred label: Ligurische Sprache @de
preferred label: Lingua antico ligure @it
preferred label: Língua lígure antiga @pt

Galambu
type: Language
type: Concept
ISO 639-3 code: glo
alternative label: Galambu language
definition: Galambu (also known as Galambi, Galambe, Galembi) is an Afro-Asiatic language spoken in Nigeria. Most members of the ethnic group do not speak Galambu.
in scheme: Lexvo - ISO 639-3 language codes
notation: glo

Glaro-Twabo
type: Language
type: Concept
ISO 639-3 code: glr
in scheme: Lexvo - ISO 639-3 language codes
notation: glr

Gula
type: Language
type: Concept
ISO 639-3 code: glu
alternative label: Gula (Chad)
in scheme: Lexvo - ISO 639-3 language codes
notation: glu

Manx
type: Language
type: Concept
ISO 639-1 code: gv
ISO 639-2 Bibliographical code: glv
ISO 639-2 Terminological code: glv
ISO 639-3 code: glv
in scheme: Lexvo - ISO 639-3 language codes
notation: glv
preferred label: gaélico manés @es
preferred label: manx @fr

Glavda
type: Language
type: Concept
ISO 639-3 code: glw
alternative label: Glavda language
definition: Glavda (also known as Galavda, Gelebda, Glanda, Guelebda, Galvaxdaxa) is an Afro-Asiatic language spoken in Borno State, Nigeria and in Far North Province, Cameroon.
in scheme: Lexvo - ISO 639-3 language codes
notation: glw

Gule
type: Language
type: Concept
ISO 639-3 code: gly
alternative label: Gule language
definition: Gule, also known as Anej, Fecakomodiyo, and Hamej, is an extinct Koman language of Sudan.
in scheme: Lexvo - ISO 639-3 language codes
notation: gly

Gambera
type: Language
type: Concept
ISO 639-3 code: gma
in scheme: Lexvo - ISO 639-3 language codes
notation: gma

Gula'alaa
type: Language
type: Concept
ISO 639-3 code: gmb
in scheme: Lexvo - ISO 639-3 language codes
notation: gmb

Mághdì
type: Language
type: Concept
ISO 639-3 code: gmd
in scheme: Lexvo - ISO 639-3 language codes
notation: gmd

Middle High German
type: Language
type: Concept
ISO 639-2 Bibliographical code: gmh
ISO 639-2 Terminological code: gmh
ISO 639-3 code: gmh
alternative label: German, Middle High (ca. 1050-1500)
alternative label: German, Middle High (ca.1050-1500)
alternative label: Middle High German (ca. 1050-1500)
alternative label: alemán de la alta edad media @es
alternative label: alemão medieval alto @pt
alternative label: alemão médio-alto @pt
alternative label: allemand, moyen haut (ca. 1050-1500) @fr
alternative label: moyen haut-allemand @fr
alternative label: tedesco medio alto @it
definition: Middle High German , abbreviated MHG (Mhd.), is the term used for the period in the history of the German language between 1050 and 1350. It is preceded by Old High German and followed by Early New High German. In some uses, the term covers a longer period, going up to 1500.
in scheme: Lexvo - ISO 639-3 language codes
notation: gmh
preferred label: Alto alemán medio @es
preferred label: Alto alemão médio @pt
preferred label: Alto tedesco medio @it
preferred label: Mittelhochdeutsch @de
preferred label: Moyen haut-allemand @fr

Middle Low German
type: Language
type: Concept
ISO 639-3 code: gml
alternative label: German, Middle Low
definition: Middle Low German (ISO 639-3 code gml) is a language that is the descendant of Old Saxon and is the ancestor of modern Low German. It served as the international lingua franca of the Hanseatic League. It was spoken from about 1100 to 1600.
in scheme: Lexvo - ISO 639-3 language codes
notation: gml
preferred label: Mittelniederdeutsche Sprache @de
preferred label: Moyen bas allemand @fr

Gbaya-Mbodomo
type: Language
type: Concept
ISO 639-3 code: gmm
in scheme: Lexvo - ISO 639-3 language codes
notation: gmm

Gimnime
type: Language
type: Concept
ISO 639-3 code: gmn
in scheme: Lexvo - ISO 639-3 language codes
notation: gmn

Gumalu
type: Language
type: Concept
ISO 639-3 code: gmu
in scheme: Lexvo - ISO 639-3 language codes
notation: gmu

Gamo
type: Language
type: Concept
ISO 639-3 code: gmv
in scheme: Lexvo - ISO 639-3 language codes
notation: gmv

Magoma
type: Language
type: Concept
ISO 639-3 code: gmx
in scheme: Lexvo - ISO 639-3 language codes
notation: gmx

Mycenaean Greek
type: Language
type: Concept
ISO 639-3 code: gmy
alternative label: Greek, Mycenaean
definition: Mycenaean Greek is the most ancient attested form of the Greek language, spoken on the Greek mainland, Crete and Cyprus in the 16th to 12th centuries BC, before the hypothesised Dorian invasion which was often cited as the terminus post quem for the coming of the Greek language to Greece. The language is preserved in inscriptions in Linear B, a script first attested on Crete before the 14th century BC. Most instances of these inscriptions are on clay tablets found in Knossos in central Crete, and in Pylos in the southwest of the Peloponnese. Other tablets have been found at Mycenae itself, Tiryns and Thebes and at Chania in Western Crete. The language is named after Mycenae, one of the major centres of Mycenaean Greece.
in scheme: Lexvo - ISO 639-3 language codes
notation: gmy
preferred label: Dialetto miceneo @it
preferred label: Grego micênico @pt
preferred label: Griego micénico @es
preferred label: Mycénien @fr
preferred label: Mykenisches Griechisch @de

Liburnian
type: Language
type: Concept
ISO 639-3 code: xli
alternative label: Liburnian language
definition: The Liburnian language is an extinct language which was spoken by the ancient Liburnians, who occupied Liburnia in classical times. The Liburnian language is reckoned as an Indo-European language, in the Centum group. Alternative speculations place it on the same Indo-European branch as the Venetic language or on a separate branch.
in scheme: Lexvo - ISO 639-3 language codes
notation: xli
preferred label: Liburnische Sprache @de

Mgbolizhia
type: Language
type: Concept
in scheme: Lexvo - ISO 639-3 language codes

Kaansa
type: Language
type: Concept
ISO 639-3 code: gna
in scheme: Lexvo - ISO 639-3 language codes
notation: gna

Gangte
type: Language
type: Concept
ISO 639-3 code: gnb
alternative label: Gangte language
definition: Gangte is a Kukish language of India. There are a few speakers across the border in Burma.
in scheme: Lexvo - ISO 639-3 language codes
notation: gnb

Guanche
type: Language
type: Concept
ISO 639-3 code: gnc
alternative label: Guanche language
definition: Guanche is an extinct language that was spoken by the Guanches of the Canary Islands until the 16th or 17th century. It is only known today through a few sentences and individual words recorded by early travellers, supplemented by several placenames, as well as some words assimilated into the Canary Islanders' Spanish. Relationships with other languages have therefore been difficult to determine with certainty; however, it is almost certainly Afro-Asiatic, and many linguists consider Guanche to likely be one of, or to be related to, the Berber languages.
in scheme: Lexvo - ISO 639-3 language codes
notation: gnc
preferred label: Lenguas guanches @es

Zulgo-Gemzek
type: Language
type: Concept
ISO 639-3 code: gnd
alternative label: Zulgo-Gemzek language
definition: Zulgo-Gemzek is an Afro-Asiatic language spoken in northern Cameroon. Dialects are Gemzek, Mineo, and Zulgo.
in scheme: Lexvo - ISO 639-3 language codes
notation: gnd

Ganang
type: Language
type: Concept
ISO 639-3 code: gne
in scheme: Lexvo - ISO 639-3 language codes
notation: gne

Ngangam
type: Language
type: Concept
ISO 639-3 code: gng
alternative label: Ngangam language
definition: Ngangam (Gangam) is a language of the Gurma people spoken in Togo and Benin.
in scheme: Lexvo - ISO 639-3 language codes
notation: gng

Lere
type: Language
type: Concept
ISO 639-3 code: gnh
in scheme: Lexvo - ISO 639-3 language codes
notation: gnh

Gooniyandi
type: Language
type: Concept
ISO 639-3 code: gni
alternative label: Gooniyandi language
definition: Gooniyandi is an Australian Aboriginal language now spoken by about 100 people, most of whom live in or near Fitzroy Crossing in Western Australia. Gooniyandi is an endangered language as it is not being passed on to children, who instead grow up speaking Kriol.
in scheme: Lexvo - ISO 639-3 language codes
notation: gni

//Gana
type: Language
type: Concept
ISO 639-3 code: gnk
in scheme: Lexvo - ISO 639-3 language codes
notation: gnk

Gangulu
type: Language
type: Concept
ISO 639-3 code: gnl
in scheme: Lexvo - ISO 639-3 language codes
notation: gnl

Ginuman
type: Language
type: Concept
ISO 639-3 code: gnm
in scheme: Lexvo - ISO 639-3 language codes
notation: gnm

Alanic
type: Language
type: Concept
ISO 639-3 code: xln
in scheme: Lexvo - ISO 639-3 language codes
notation: xln

Gumatj
type: Language
type: Concept
ISO 639-3 code: gnn
in scheme: Lexvo - ISO 639-3 language codes
notation: gnn

Northern Gondi
type: Language
type: Concept
ISO 639-3 code: gno
alternative label: Gondi, Northern
in scheme: Lexvo - ISO 639-3 language codes
notation: gno

Gana
type: Language
type: Concept
ISO 639-3 code: gnq
in scheme: Lexvo - ISO 639-3 language codes
notation: gnq

Gureng Gureng
type: Language
type: Concept
ISO 639-3 code: gnr
in scheme: Lexvo - ISO 639-3 language codes
notation: gnr

Guntai
type: Language
type: Concept
ISO 639-3 code: gnt
in scheme: Lexvo - ISO 639-3 language codes
notation: gnt

Gnau
type: Language
type: Concept
ISO 639-3 code: gnu
alternative label: Gnau language
definition: Gnau is a language of Papua New Guinea. It is part of the Torricelli language family.
in scheme: Lexvo - ISO 639-3 language codes
notation: gnu

Western Bolivian Guaraní
type: Language
type: Concept
ISO 639-3 code: gnw
alternative label: Guaraní, Western Bolivian
definition: Western Bolivian Guaraní, known locally as Simba and Simba Guaraní, is a Guaraní language spoken in Bolivia, in the Chuquisaca Department north of the Pilcomayo River.
in scheme: Lexvo - ISO 639-3 language codes
notation: gnw

Loup A
type: Language
type: Concept
ISO 639-3 code: xlo
in scheme: Lexvo - ISO 639-3 language codes
notation: xlo

Ganzi
type: Language
type: Concept
ISO 639-3 code: gnz
in scheme: Lexvo - ISO 639-3 language codes
notation: gnz

Gouro
type: Language
type: Concept
ISO 639-3 code: goa
alternative label: Guro language
definition: Guro (also known as Guoro, Kwéndré, Kweni and Lo) is a Mande language spoken by approximately 332,000 people in Côte d'Ivoire, primarily in the areas of Haut-Sassandra and Marahoue.
in scheme: Lexvo - ISO 639-3 language codes
notation: goa
preferred label: Guro

Playero
type: Language
type: Concept
ISO 639-3 code: gob
alternative label: Playero language
definition: Playero is a Guahiban language that is spoken by about 250 people in Colombia. Speakers are somewhat acculterated and bilingual in Spanish.
in scheme: Lexvo - ISO 639-3 language codes
notation: gob

Gorakor
type: Language
type: Concept
ISO 639-3 code: goc
in scheme: Lexvo - ISO 639-3 language codes
notation: goc

Godié
type: Language
type: Concept
ISO 639-3 code: god
alternative label: Godié language
definition: The Godié language is a Kru language of Ivory Coast.
in scheme: Lexvo - ISO 639-3 language codes
notation: god

Gongduk
type: Language
type: Concept
ISO 639-3 code: goe
alternative label: Gongduk language
definition: Gongduk or Gongdu is an endangered Tibeto-Burman language spoken by about 1,000 people in a few inaccessible villages located near the Kuri Chhu river in the Gongdu Gewog of Mongar District in eastern Bhutan. The language appears to be the sole representative of a unique branch of the Tibeto-Burman language family and retains the complex verbal agreement system of Proto-Tibeto-Burman.
in scheme: Lexvo - ISO 639-3 language codes
notation: goe

Gofa
type: Language
type: Concept
ISO 639-3 code: gof
in scheme: Lexvo - ISO 639-3 language codes
notation: gof

Lepontic
type: Language
type: Concept
ISO 639-3 code: xlp
alternative label: Lepontic language
definition: Lepontic is an extinct Alpine language that was spoken in parts of Rhaetia and Cisalpine Gaul (what is now Northern Italy) between 550 and 100 BC. Lepontic is attested in inscriptions found in an area centered around Lugano, Switzerland, and including the Lake Como and Lake Maggiore areas of Italy.
in scheme: Lexvo - ISO 639-3 language codes
notation: xlp
preferred label: Idioma lepóntico @es
preferred label: Lepontische Sprache @de
preferred label: Lingua leponzia @it
preferred label: Lépontique @fr
preferred label: Língua lepôntica @pt

Gogo
type: Language
type: Concept
ISO 639-3 code: gog
alternative label: Gogo language
definition: Gogo is a Bantu language spoken by the Gogo people of Dodoma Region in Tanzania. The language is spoken throughout Dodoma Region and into the neighbouring district of Manyoni. The language is considered to have three dialects: Nyambwa (Cinyambwa or West Gogo) spoken to the west of Dodoma and in Manyoni, Nyaugogo (Cinyaugogo or Central Gogo) spoken in the environs of Dodoma, and Tumba (Citumba or East Gogo) spoken to the east. The Gogo group is grouped with Kagulu, which has a 56% lexical similarity with Gogo proper, which leads some to classify Kagulu as a Gogo dialect. Gogo has about 50% lexical similarity with Hehe and Sangu (both Bena–Kinga languages (G.60), 48% with Kimbu and 45% with Nilamba. These last two are both in Zone F. Gogo is spoken by both Christians and Muslims, and is a major language of the Anglican Church of Tanzania.
in scheme: Lexvo - ISO 639-3 language codes
notation: gog
preferred label: Língua gogo @pt

Old High German
type: Language
type: Concept
ISO 639-2 Bibliographical code: goh
ISO 639-2 Terminological code: goh
ISO 639-3 code: goh
alternative label: German, Old High (ca. 750-1050)
alternative label: German, Old High (ca.750-1050)
alternative label: Old High German (ca. 750-1050)
alternative label: alemán de la alta edad antigua @es
alternative label: alemão arcaico alto @pt
alternative label: allemand, vieux haut (ca. 750-1050) @fr
alternative label: ancien haut allemand @fr
alternative label: tedesco antico alto @it
definition: The term Old High German (OHG, German: , German abbr. Ahd.) refers to the earliest stage of the German language and it conventionally covers the period from around 500 to 1050. Coherent written texts do not appear until the second half of the 8th century, and some treat the period before 750 as prehistoric and date the start of Old High German proper to 750 for this reason. There are, however, a number of Elder Futhark inscriptions dating to the 6th century (notably the Pforzen buckle), as well as single words and many names found in Latin texts predating the 8th century.
in scheme: Lexvo - ISO 639-3 language codes
notation: goh
preferred label: Althochdeutsch @de
preferred label: Alto alemán antiguo @es
preferred label: Alto alemão antigo @pt
preferred label: Alto tedesco antico @it
preferred label: Vieux haut-allemand @fr

Gobasi
type: Language
type: Concept
ISO 639-3 code: goi
in scheme: Lexvo - ISO 639-3 language codes
notation: goi

Gowlan
type: Language
type: Concept
ISO 639-3 code: goj
in scheme: Lexvo - ISO 639-3 language codes
notation: goj

Gowli
type: Language
type: Concept
ISO 639-3 code: gok
in scheme: Lexvo - ISO 639-3 language codes
notation: gok

Gola
type: Language
type: Concept
ISO 639-3 code: gol
alternative label: Gola language
definition: Gola is an erstwhile Atlantic language of Liberia. It is not closely related to other languages and appears to form its own branch of Niger–Congo.
in scheme: Lexvo - ISO 639-3 language codes
notation: gol

Goan Konkani
type: Language
type: Concept
ISO 639-3 code: gom
alternative label: Konkani, Goan
in scheme: Lexvo - ISO 639-3 language codes
notation: gom

Gondi
type: Language
type: Concept
ISO 639-2 Bibliographical code: gon
ISO 639-2 Terminological code: gon
ISO 639-3 code: gon
alternative label: Gondi language
alternative label: Gondi-Sprache @de
alternative label: Gondî @fr
alternative label: Língua gondi @pt
preferred label: gondi @es
definition: Gondi (Gōndi) is spoken by the Gondi people. It is a Central-Dravidian language, spoken by about two million people chiefly in the states of Madhya Pradesh, Gujarat, Andhra Pradesh, Maharashtra, Chhattishgarh and in various adjoining areas of neighbouring states. Although it is the language of the Gond people, only about half of them still speak it.
in scheme: Lexvo - ISO 639-3 language codes
notation: gon
preferred label: gond @fr

Gone Dau
type: Language
type: Concept
ISO 639-3 code: goo
alternative label: Gone Dau language
definition: Gone Dau is an East Fijian language spoken by about 700 people on the islands of Gone and Dau, Fiji. *
in scheme: Lexvo - ISO 639-3 language codes
notation: goo
preferred label: Gone dau @fr

Yeretuar
type: Language
type: Concept
ISO 639-3 code: gop
alternative label: Yeretuar language
definition: Yeretuar, or Goni, is an Austronesian language in its putative Cenderawasih branch from Cenderawasih Bay (Geelvink Bay) in Indonesian Papua. It is not closely related to other languages.
in scheme: Lexvo - ISO 639-3 language codes
notation: gop

Gorap
type: Language
type: Concept
ISO 639-3 code: goq
in scheme: Lexvo - ISO 639-3 language codes
notation: goq

Gorontalo
type: Language
type: Concept
ISO 639-2 Bibliographical code: gor
ISO 639-2 Terminological code: gor
ISO 639-3 code: gor
alternative label: Gorontalo language
alternative label: Idioma gorontalo @es
definition: The Gorontalo language (also called Hulontalo) is a Philippine language spoken in Gorontalo Province (Northern Sulawesi, Indonesia, southern coast) by the Gorontalo people. There is no ISO 639-1 code for Gorontalo. Dialects of Gorontalo are East Gorontalo, Gorontalo Kota, Tilamuta, Suwawa, and West Gorontalo. There were 900.000 speakers of Gorontalo in 1989.
in scheme: Lexvo - ISO 639-3 language codes
notation: gor
preferred label: Mongondou @de
preferred label: gorontalo @es

Groningois
type: Language
type: Concept
ISO 639-3 code: gos
definition: Gronings (, locally ), in the dialect itself called Grunnegs or Grönnegs, is a collective name for some Friso-Saxon dialects spoken in the province of Groningen and around the Groningen border in Drenthe and Friesland. Gronings and the strongly related varieties in East-Frisia have a strong Frisian influence and take a remarkable position within the Low Saxon language. The dialect is characterized by a typical accent and vocabulary, which differ strongly from the other Low Saxon dialects.
in scheme: Lexvo - ISO 639-3 language codes
notation: gos
preferred label: Gronings
preferred label: Idioma groningués @es

Gothic
type: Language
type: Concept
ISO 639-2 Bibliographical code: got
ISO 639-2 Terminological code: got
ISO 639-3 code: got
alternative label: Gothic language
alternative label: Gotische Sprache @de
alternative label: Idioma gótico @es
alternative label: Lingua gotica @it
alternative label: Língua gótica @pt
alternative label: gothique @fr
alternative label: gotique @fr
definition: Gothic is an extinct Germanic language that was spoken by the Goths. It is known primarily from the Codex Argenteus, a 6th-century copy of a 4th-century Bible translation, and is the only East Germanic language with a sizable text corpus. All others, including Burgundian and Vandalic, are known, if at all, only from proper names that survived in historical accounts, and from loan-words in other languages such as Portuguese, Spanish and French.
in scheme: Lexvo - ISO 639-3 language codes
notation: got
preferred label: Gotique @fr
preferred label: Gotisch @de
preferred label: gotico @it
preferred label: gótico @es

Gavar
type: Language
type: Concept
ISO 639-3 code: gou
alternative label: Gavar language
definition: Gavar (also known as Gawar, Gouwar, Gauar, Rtchi, Kortchi, Ma-Gavar) is an Afro-Asiatic language spoken in Cameroon in Far North Province.
in scheme: Lexvo - ISO 639-3 language codes
notation: gou

Gorowa
type: Language
type: Concept
ISO 639-3 code: gow
alternative label: Gorowa language
definition: Gorowa is a Cushitic language spoken in Tanzania in the Dodoma and Manyara Regions.
in scheme: Lexvo - ISO 639-3 language codes
notation: gow

Lusitanian
type: Language
type: Concept
ISO 639-3 code: xls
alternative label: Lusitanian language
definition: Lusitanian (so named after the Lusitani or Lusitanians) was a paleohispanic language that apparently belonged to the Indo-European family. Its relationship to the Celtic languages of the Iberian Peninsula, either as a member, a cousin (in a branch termed "Para-Celtic"), or as a different branch of Indo-European, is debated. , inscriptions, dated from ca. 1 CE, and numerous names of places (toponyms) and of gods (theonyms). The language was spoken in the territory inhabited by Lusitanian tribes, from Douro to the Tagus rivers, territory that nowadays belongs mainly to Portugal, but also to Spain.
in scheme: Lexvo - ISO 639-3 language codes
notation: xls
preferred label: Idioma lusitano @es
preferred label: Lingua lusitana @it
preferred label: Lusitain @fr
preferred label: Lusitanische Sprache @de
preferred label: Língua lusitana @pt

Gobu
type: Language
type: Concept
ISO 639-3 code: gox
in scheme: Lexvo - ISO 639-3 language codes
notation: gox

Goundo
type: Language
type: Concept
ISO 639-3 code: goy
in scheme: Lexvo - ISO 639-3 language codes
notation: goy

Gozarkhani
type: Language
type: Concept
ISO 639-3 code: goz
in scheme: Lexvo - ISO 639-3 language codes
notation: goz

Gupa-Abawa
type: Language
type: Concept
ISO 639-3 code: gpa
in scheme: Lexvo - ISO 639-3 language codes
notation: gpa

Ghanaian Pidgin English
type: Language
type: Concept
ISO 639-3 code: gpe
alternative label: Pidgin English, Ghanaian
in scheme: Lexvo - ISO 639-3 language codes
notation: gpe

Taiap
type: Language
type: Concept
ISO 639-3 code: gpn
alternative label: Taiap language
definition: Taiap (also called Gapun, after the name of the village where it is spoken) is an endangered language isolate spoken by around a hundred people in the East Sepik Province of Papua New Guinea. It is being replaced by the national language and lingua franca Tok Pisin.
in scheme: Lexvo - ISO 639-3 language codes
notation: gpn

Ga'anda
type: Language
type: Concept
ISO 639-3 code: gqa
alternative label: Ga'anda language
definition: Gaanda (also known as Ganda, Gaandu, Mokar, Makwar) is an Afro-Asiatic language spoken by about 10,000 people in the Adamawa state of Nigeria. Some speakers live in the Song, Gyuk, Mubi, and Biu (Borno State) LGAs. It has 2 dialects, Gaanda and Gabin. Its speakers are generally not monolingual in Gaanda, instead, they use Hausa and Fulfulde as well. They are becoming more interested in education; Ga'anda has a secondary school. The traditional religions of the people are Christian and Muslim.
in scheme: Lexvo - ISO 639-3 language codes
notation: gqa

Guiqiong
type: Language
type: Concept
ISO 639-3 code: gqi
in scheme: Lexvo - ISO 639-3 language codes
notation: gqi

Guana
type: Language
type: Concept
ISO 639-3 code: gqn
alternative label: Guana (Brazil)
in scheme: Lexvo - ISO 639-3 language codes
notation: gqn

Gor
type: Language
type: Concept
ISO 639-3 code: gqr
in scheme: Lexvo - ISO 639-3 language codes
notation: gqr

Qau
type: Language
type: Concept
ISO 639-3 code: gqu
in scheme: Lexvo - ISO 639-3 language codes
notation: gqu

Rajput Garasia
type: Language
type: Concept
ISO 639-3 code: gra
alternative label: Garasia, Rajput
in scheme: Lexvo - ISO 639-3 language codes
notation: gra

Grebo
type: Language
type: Concept
ISO 639-2 Bibliographical code: grb
ISO 639-2 Terminological code: grb
ISO 639-3 code: grb
alternative label: Krumen language
definition: Krumen is a dialect continuum spoken by the Krumen people of Liberia and Ivory Coast (Tabou and Grabo subprefectures). It is a branch of the Grebo languages, a subfamily of the Kru languages and ultimately of the Niger–Congo languages. It had 48,300 speakers as of 1993. The main varieties are: *Tepo: Tepo, Bapo, Wlopo / Ropo, Dapo, Honpo, Yrepo / Kapo, Glawlo dialects *Pye: Trepo, Wluwe-Hawlo, Gbowe-Hran, Wlepo, Dugbo, Yrewe / Giriwe, Yapo, Pie dialects *Plapo Plapo has only a hundred speakers and no dialectical variation.
in scheme: Lexvo - ISO 639-3 language codes
notation: grb
preferred label: Grebo-Sprache @de
preferred label: gerbo @it
preferred label: grebo @es

Ancient Greek
type: Language
type: Concept
ISO 639-2 Bibliographical code: grc
ISO 639-2 Terminological code: grc
ISO 639-3 code: grc
alternative label: Altgriechische Sprache @de
alternative label: Ancient Greek (to 1453)
alternative label: Ancient Greek language
alternative label: Greek, Ancient (to 1453)
alternative label: Lingua greca antica @it
alternative label: Língua grega antiga @pt
alternative label: grec ancien @fr
alternative label: grec ancien (jusqu'à 1453) @fr
alternative label: grego clássico @pt
alternative label: griego antiguo @es
definition: Ancient Greek is the stage of the Greek language in the periods spanning the times c. 9th–6th centuries BC, (known as Archaic), c. 5th–4th centuries BC (Classical), and the c. 3rd century BC – 6th century AD (Hellenistic) of ancient Greece and the ancient world; being predated in the 2nd millennium BC by Mycenaean Greek. The language of the Hellenistic phase is known as Koine (common) or Biblical Greek, the language from the late period onward has no considerable difference from Medieval Greek. Koine is regarded as a separate historical stage of its own, although in its earlier form it closely resembles the Classical. Prior to the Koine period, Greek of the classic and earlier periods included several regional dialects.
in scheme: Lexvo - ISO 639-3 language codes
notation: grc
preferred label: Altgriechisch @de
preferred label: Grec ancien @fr
preferred label: Griego antiguo @es
preferred label: greco antico @it
preferred label: grego arcaico @pt

Guruntum-Mbaaru
type: Language
type: Concept
ISO 639-3 code: grd
alternative label: Guruntum language
definition: Guruntum is a Chadic language spoken by about 15,000 people in Nigeria. Classification Guruntum is a West Chadic language of the B subgroup.
in scheme: Lexvo - ISO 639-3 language codes
notation: grd

Madi
type: Language
type: Concept
ISO 639-3 code: grg
in scheme: Lexvo - ISO 639-3 language codes
notation: grg

Cuneiform Luwian
type: Language
type: Concept
ISO 639-3 code: xlu
alternative label: Luwian, Cuneiform
in scheme: Lexvo - ISO 639-3 language codes
notation: xlu

Gbiri-Niragu
type: Language
type: Concept
ISO 639-3 code: grh
alternative label: Gbiri-Niragu language
definition: Gbiri-Niragu, also known as Gure-Kahugu, is a Kainji language of Nigeria. Speakers are shifting to Hausa.
in scheme: Lexvo - ISO 639-3 language codes
notation: grh

Ghari
type: Language
type: Concept
ISO 639-3 code: gri
alternative label: Ghari language
definition: Ghari (also known as Gari, Tangarare, Sughu, and West Guadalcanal) is an Oceanic language spoken on Guadalcanal island of the Solomon Islands.
in scheme: Lexvo - ISO 639-3 language codes
notation: gri

Southern Grebo
type: Language
type: Concept
ISO 639-3 code: grj
alternative label: Grebo, Southern
in scheme: Lexvo - ISO 639-3 language codes
notation: grj

Kota Marudu Talantang
type: Language
type: Concept
ISO 639-3 code: grm
in scheme: Lexvo - ISO 639-3 language codes
notation: grm

Guarani
type: Language
type: Concept
ISO 639-1 code: gn
ISO 639-2 Bibliographical code: grn
ISO 639-2 Terminological code: grn
ISO 639-3 code: grn
in scheme: Lexvo - ISO 639-3 language codes
notation: grn
preferred label: guarana @it
preferred label: guarani @fr
preferred label: guaraní @es

Groma
type: Language
type: Concept
ISO 639-3 code: gro
alternative label: Groma language
definition: Groma is a language spoken in Sikkim and Tibet. It belongs to the southern group of Tibetan languages. Its speakers identify as Tibetans.
in scheme: Lexvo - ISO 639-3 language codes
notation: gro

Gorovu
type: Language
type: Concept
ISO 639-3 code: grq
in scheme: Lexvo - ISO 639-3 language codes
notation: grq

Taznatit
type: Language
type: Concept
ISO 639-3 code: grr
alternative label: Zenati language
definition: Zenati, or Taznatit, is the Zenati Berber language of the Gourara (Tigurarin) region, an archipelago of oases surrounding Timimoun in southwestern Algeria, and of a smaller number of villages in Touat to its south, notably Tamentit (where it was already practically extinct by 1985 ) and Tittaf.
in scheme: Lexvo - ISO 639-3 language codes
notation: grr

Elymian
type: Language
type: Concept
ISO 639-3 code: xly
alternative label: Elymian language
definition: The Elymian language is the extinct language of the ancient Elymian people of western Sicily. It is not known whether Elymian was an Indo-European tongue. The limited and fragmentary nature of the surviving sources makes it very difficult to identify its affinities with other regional languages; it has been speculated that Elymian was related to the Italic languages, though this interpretation is disputed.
in scheme: Lexvo - ISO 639-3 language codes
notation: xly
preferred label: Elymische Sprache @de

Gresi
type: Language
type: Concept
ISO 639-3 code: grs
alternative label: Gresi language
definition: Gresi (Geresi, Glesi, Gresik, Klesi) is a Papuan language of Indonesia. It is very close to Kemtuik.
in scheme: Lexvo - ISO 639-3 language codes
notation: grs

Garo
type: Language
type: Concept
ISO 639-3 code: grt
alternative label: Garo language
definition: Garo (also spelled as Garrow, or else known by the people's own name for themselves, Mande) is the language of the majority of the people of the Garo Hills in the Indian state of Meghalaya. Garo is also used in Kamrup, Dhubri, Goalpara and the Darrang districts of Assam, India as well as in neighboring Bangladesh. Garo uses the Latin script and has a close affinity to Bodo, the language of one of the dominant communities of the neighbouring state of Assam.
in scheme: Lexvo - ISO 639-3 language codes
notation: grt
preferred label: Lingua garo @it
preferred label: Língua garo @pt

Kistane
type: Language
type: Concept
ISO 639-3 code: gru
alternative label: Soddo language
definition: Soddo (autonym kəstane "Christian"; formerly called Aymälläl in Western sources, after a particular dialect of it) is a Gurage language spoken by about 300,000 people in southeastern Ethiopia. It is a South Ethiopian Semitic language of the Northern Gurage subfamily.
in scheme: Lexvo - ISO 639-3 language codes
notation: gru

Central Grebo
type: Language
type: Concept
ISO 639-3 code: grv
alternative label: Grebo, Central
in scheme: Lexvo - ISO 639-3 language codes
notation: grv

Gweda
type: Language
type: Concept
ISO 639-3 code: grw
in scheme: Lexvo - ISO 639-3 language codes
notation: grw

Guriaso
type: Language
type: Concept
ISO 639-3 code: grx
alternative label: Guriaso language
definition: Guriaso is a language of Papua New Guinea. Only described in 1983, it is distantly related to the Kwomtari and Nai languages. (See Kwomtari languages for details.)
in scheme: Lexvo - ISO 639-3 language codes
notation: grx

Barclayville Grebo
type: Language
type: Concept
ISO 639-3 code: gry
alternative label: Grebo, Barclayville
in scheme: Lexvo - ISO 639-3 language codes
notation: gry

Guramalum
type: Language
type: Concept
ISO 639-3 code: grz
in scheme: Lexvo - ISO 639-3 language codes
notation: grz

Ghanaian Sign Language
type: Language
type: Concept
ISO 639-3 code: gse
in scheme: Lexvo - ISO 639-3 language codes
notation: gse

German Sign Language
type: Language
type: Concept
ISO 639-3 code: gsg
definition: German Sign Language or Deutsche Gebärdensprache is the sign language of the Deaf community in Germany. It is often abbreviated as DGS. It is unclear how many use German Sign Language as their main language; Gallaudet University estimated 50,000 in 1986. The language has evolved through use in deaf communities over hundreds of years.
in scheme: Lexvo - ISO 639-3 language codes
notation: gsg
preferred label: Deutsche Gebärdensprache @de

Gusilay
type: Language
type: Concept
ISO 639-3 code: gsl
alternative label: Gusilay language
definition: Gusilay (Gusiilay, Gusilaay, Kusiilaay, Kusilay) is a Jola language of the Casamance region of Senegal.
in scheme: Lexvo - ISO 639-3 language codes
notation: gsl

Santa Inés Yatzechi Zapotec
type: Language
type: Concept
ISO 639-3 code: zpn
alternative label: Zapotec, Santa Inés Yatzechi
in scheme: Lexvo - ISO 639-3 language codes
notation: zpn

Guatemalan Sign Language
type: Language
type: Concept
ISO 639-3 code: gsm
definition: Guatelmalan Sign Language is the national deaf sign language used in Guatemala. The first dictionary was published in 2000. It is distinct from the sign languages used in Mexico and other neighboring Spanish speaking countries, and from Highland Maya Sign Language, which is used among Kiche Maya of rural Guatemala.
in scheme: Lexvo - ISO 639-3 language codes
notation: gsm
preferred label: Lenguaje de señas guatemalteco @es
preferred label: Língua Gestual da Guatemala @pt

Mushungulu
type: Language
type: Concept
ISO 639-3 code: xma
in scheme: Lexvo - ISO 639-3 language codes
notation: xma

Gusan
type: Language
type: Concept
ISO 639-3 code: gsn
in scheme: Lexvo - ISO 639-3 language codes
notation: gsn

Southwest Gbaya
type: Language
type: Concept
ISO 639-3 code: gso
alternative label: Gbaya, Southwest
in scheme: Lexvo - ISO 639-3 language codes
notation: gso

Wasembo
type: Language
type: Concept
ISO 639-3 code: gsp
alternative label: Wasembo language
definition: Wasembo, also known as Biapim, Gusap, Yankowan, is a Rai Coast language spoken in Madang Province, Papua New Guinea.
in scheme: Lexvo - ISO 639-3 language codes
notation: gsp

Greek Sign Language
type: Language
type: Concept
ISO 639-3 code: gss
definition: Greek Sign Language is the sign language of the Greek deaf community. It has been legally recognised as the official language of the Deaf Community in Greece by Law 2817 in 2000.
in scheme: Lexvo - ISO 639-3 language codes
notation: gss
preferred label: Língua de sinais grega @pt

Alsatian
type: Language
type: Concept
ISO 639-2 Bibliographical code: gsw
ISO 639-2 Terminological code: gsw
ISO 639-3 code: gsw
alternative label: Alemannic
alternative label: Alemán de Suiza @es
alternative label: German, Swiss
alternative label: Suisse allemand @fr
alternative label: Suíço-alemão @pt
alternative label: Swiss German
alternative label: suisse alémanique @fr
alternative label: tedesco svizzero @it
definition: Swiss German (, ) is any of the Alemannic dialects spoken in Switzerland and in some Alpine communities in Northern Italy. Occasionally, the Alemannic dialects spoken in other countries are grouped together with Swiss German as well, especially the dialects of Liechtenstein and Austrian Vorarlberg which are closely associated to Switzerland's.
in scheme: Lexvo - ISO 639-3 language codes
notation: gsw
preferred label: Schweizerdeutsch @de
preferred label: Svizzero tedesco @it
preferred label: alemán suizo @es
preferred label: alemão suíço @pt
preferred label: alémanique @fr

Guató
type: Language
type: Concept
ISO 639-3 code: gta
alternative label: Guató language
definition: The Guató language, or , is a possible language isolate spoken by the about 10% Guató people of Brazil. Kaufman (1990) provisionally classifies it as a branch of the Macro-Gê languages, but no evidence for this was found by Eduardo Ribeiro.
in scheme: Lexvo - ISO 639-3 language codes
notation: gta
preferred label: Idioma guató @es

Gbati-ri
type: Language
type: Concept
ISO 639-3 code: gti
in scheme: Lexvo - ISO 639-3 language codes
notation: gti

Mbonga
type: Language
type: Concept
ISO 639-3 code: xmb
alternative label: Mboa language
definition: Mboa, also known as Mbonga, is an apparently extinct language of Cameroon (Blench 2011), though Ethnologue reports 1,490 speakers cited in 2000.
in scheme: Lexvo - ISO 639-3 language codes
notation: xmb

Aghu-Tharnggala
type: Language
type: Concept
in scheme: Lexvo - ISO 639-3 language codes

Shiki
type: Language
type: Concept
ISO 639-3 code: gua
alternative label: Shiki language
definition: Shiki is one of the Bantoid Jarawan languages of Nigeria, spoken in Bauchi State .
in scheme: Lexvo - ISO 639-3 language codes
notation: gua

Guajajára
type: Language
type: Concept
ISO 639-3 code: gub
in scheme: Lexvo - ISO 639-3 language codes
notation: gub

Wayuu
type: Language
type: Concept
ISO 639-3 code: guc
alternative label: Wayuu language
definition: The Wayuu language, or Goajiro (Wayuu: wayuunaiki), is spoken by 305,000 indigenous Wayuu people in northeastern Colombia and northwestern Venezuela on the Guajira Peninsula.
in scheme: Lexvo - ISO 639-3 language codes
notation: guc
preferred label: Idioma wayúu @es
preferred label: Língua wayuu @pt

Yocoboué Dida
type: Language
type: Concept
ISO 639-3 code: gud
alternative label: Dida, Yocoboué
in scheme: Lexvo - ISO 639-3 language codes
notation: gud

Gurinji
type: Language
type: Concept
ISO 639-3 code: gue
alternative label: Gurindji language
definition: Gurindji is a Southwest Pama–Nyungan language spoken in the Northern Territory, Australia. Gurindji Kriol is a mixed language that is derived from it.
in scheme: Lexvo - ISO 639-3 language codes
notation: gue

Gupapuyngu
type: Language
type: Concept
ISO 639-3 code: guf
in scheme: Lexvo - ISO 639-3 language codes
notation: guf

Guaraní language
type: Language
type: Concept
ISO 639-3 code: gug
alternative label: Guaraní, Paraguayan
alternative label: Paraguayan Guaraní
definition: Guaraní, specifically the primary variety known as Paraguayan Guaraní (; endonym avañeẽ Ava language'), is an indigenous language of South America that belongs to the Tupí–Guaraní subfamily of the Tupian languages. It is one of the official languages of Paraguay (along with Spanish), where it is spoken by the majority of the population, and half of the rural population is monolingual. It is spoken by communities in neighbouring countries, including parts of northern Argentina and southwestern Brazil, and is a second official language of the Argentine province of Corrientes; it is also an official language of Mercosur.
in scheme: Lexvo - ISO 639-3 language codes
notation: gug
preferred label: Guarani @fr
preferred label: Guaraní @de
preferred label: Idioma guaraní @es
preferred label: Lingua guaraní @it
preferred label: Língua guarani @pt

Guahibo
type: Language
type: Concept
ISO 639-3 code: guh
alternative label: Guahibo language
definition: Guahibo, the native language of the Guahibo people, is a Guahiban language that is spoken by about 23,006 people in Colombia and additional 8,428 in Venezuela. There is a 40% rate of monolingualism, and a 45% literacy rate.
in scheme: Lexvo - ISO 639-3 language codes
notation: guh
preferred label: Sikuani @fr

Eastern Bolivian Guaraní
type: Language
type: Concept
ISO 639-3 code: gui
alternative label: Guaraní, Eastern Bolivian
in scheme: Lexvo - ISO 639-3 language codes
notation: gui

Gujarati
type: Language
type: Concept
ISO 639-1 code: gu
ISO 639-2 Bibliographical code: guj
ISO 639-2 Terminological code: guj
ISO 639-3 code: guj
alternative label: Gujarati language
alternative label: Idioma guyaratí @es
alternative label: Lingua gujarati @it
alternative label: Língua guzerate @pt
alternative label: goudjarâtî @fr
alternative label: goudjrati @fr
definition: Gujarati ( ) is an Indo-Aryan language, and part of the greater Indo-European language family. It is derived from a language called Old Gujarati (1100 - 1500 AD) which is the ancestor language of the modern Gujarati and Rajasthani languages. It is native to the Indian state of Gujarat, and is its chief language, as well as of the adjacent union territories of Daman and Diu and Dadra and Nagar Haveli.
in scheme: Lexvo - ISO 639-3 language codes
notation: guj
preferred label: gujarati @es
preferred label: guzerate @pt

Gumuz
type: Language
type: Concept
ISO 639-3 code: guk
alternative label: Gumuz language
definition: Gumuz (also spelled "Gumaz") is a dialect cluster spoken along the border of Ethiopia and Sudan. Most Ethiopian speakers live in the Metekel Zone of the Benishangul-Gumuz Region, although a group of 1,000 live outside the town of Welkite. The Sudanese speakers live in the area east of Er Roseires, around Famaka and Fazoglo on the Blue Nile, extending north along the border.
in scheme: Lexvo - ISO 639-3 language codes
notation: guk
preferred label: Idioma gumuz @es

Makhuwa-Marrevone
type: Language
type: Concept
ISO 639-3 code: xmc
in scheme: Lexvo - ISO 639-3 language codes
notation: xmc

Gullah language
type: Language
type: Concept
ISO 639-3 code: gul
alternative label: Creole English, Sea Island
alternative label: Sea Island Creole English
definition: Gullah (also called Sea Island Creole English and Geechee) is a creole language spoken by the Gullah people (also called "Geechees" within the community), an African American population living on the Sea Islands and the coastal region of the U.S. states of North Carolina, South Carolina, Georgia and northeast Florida.
in scheme: Lexvo - ISO 639-3 language codes
notation: gul
preferred label: Gullah @de

Guambiano
type: Language
type: Concept
ISO 639-3 code: gum
in scheme: Lexvo - ISO 639-3 language codes
notation: gum

Mbyá Guaraní
type: Language
type: Concept
ISO 639-3 code: gun
alternative label: Guaraní, Mbyá
alternative label: Mbyá Guaraní language
definition: Mbyá Guaraní is a Tupi–Guaraní language spoken 16,050 Brazilians, 3,000 Argentines, and 8,000 Paraguayans. It is 75% lexically similar to Paraguayan Guaraní.
in scheme: Lexvo - ISO 639-3 language codes
notation: gun
preferred label: Dialeto mbiá @pt
preferred label: Idioma mbyá @es

Guayabero
type: Language
type: Concept
ISO 639-3 code: guo
alternative label: Guayabero language
definition: Guayabero is a Guahiban language that is spoken by about 1200 people in Colombia. Many of its speakers are monoglots, with few fluent Spanish speakers in the population.
in scheme: Lexvo - ISO 639-3 language codes
notation: guo

Gunwinggu
type: Language
type: Concept
ISO 639-3 code: gup
alternative label: Gunwinggu language
definition: Kunwinjku (also spelt Gunwingu, Gunwingku) is the variety of Bininj Gun-wok spoken in the largest population centre, Kunbarlanja (formerly Oenpelli) and therefore the most widespread. This dialect had a population of speakers around 700 as of 2003 according to Evans, almost all of whom speak Kunwinjku inspite of increasing exposure to English.
in scheme: Lexvo - ISO 639-3 language codes
notation: gup

Aché
type: Language
type: Concept
ISO 639-3 code: guq
alternative label: Aché language
definition: Aché, also known as Guayaki, is a Guarani language of Paraguay. The six Aché dialects are distinct enough to cause some problems with communication.
in scheme: Lexvo - ISO 639-3 language codes
notation: guq

Farefare
type: Language
type: Concept
ISO 639-3 code: gur
alternative label: Frafra language
definition: Frafra or Farefare, also known as Gurenɛ, is the language of the Frafra people of northern Ghana, particularly the Upper East Region, and southern Burkina Faso. It is a national language of Ghana, and is closely related to Mossi, Moré, the national language of Burkina Faso.
in scheme: Lexvo - ISO 639-3 language codes
notation: gur
preferred label: Gurenne @fr

Mbudum
type: Language
type: Concept
ISO 639-3 code: xmd
alternative label: Mbudum language
definition: Mbudum or Mbedam is an Afro-Asiatic language spoken in Cameroon in Far North Province.
in scheme: Lexvo - ISO 639-3 language codes
notation: xmd

Guinean Sign Language
type: Language
type: Concept
ISO 639-3 code: gus
in scheme: Lexvo - ISO 639-3 language codes
notation: gus

Maléku Jaíka
type: Language
type: Concept
ISO 639-3 code: gut
alternative label: Maléku language
definition: The Maléku Jaíka language, also called Guatuso, is an indigenous language of north central Costa Rica. It is a Chibchan language spoken by around 750 indigenous Maléku people.
in scheme: Lexvo - ISO 639-3 language codes
notation: gut
preferred label: Idioma guatuso @es

Yanomamö
type: Language
type: Concept
ISO 639-3 code: guu
in scheme: Lexvo - ISO 639-3 language codes
notation: guu

Gey
type: Language
type: Concept
ISO 639-3 code: guv
in scheme: Lexvo - ISO 639-3 language codes
notation: guv

Gun
type: Language
type: Concept
ISO 639-3 code: guw
in scheme: Lexvo - ISO 639-3 language codes
notation: guw

Gourmanchéma
type: Language
type: Concept
ISO 639-3 code: gux
alternative label: Gourmanchéma language
definition: Gourmanchéma (Goulmacema, Gourma, Gourmantche, Gulimancema, Gulmancema, Gurma) is a major language of the Gurma people spoken in from Burkina Faso across northern Togo and Benin and as far as Niger.
in scheme: Lexvo - ISO 639-3 language codes
notation: gux
preferred label: Gourmantché @fr
preferred label: Gurma @de

Gusii
type: Language
type: Concept
ISO 639-3 code: guz
alternative label: Ekegusii
alternative label: Gusii language
alternative label: Língua gusii @pt
definition: The Gusii language (also known as Kisii or Ekegusii) is a Bantu language spoken in the Kisii district in western Kenya,whose head-quarters is Kisii town, (between the Kavirondo Gulf of Lake Victoria and the border with Tanzania). It is spoken by the Gusii people, numbering about 1.5 million (SIL/Ethnologue 1994). A few Gusii people are bilingual in Luo.
in scheme: Lexvo - ISO 639-3 language codes
notation: guz
preferred label: gusii @es

Guana
type: Language
type: Concept
ISO 639-3 code: gva
alternative label: Guana (Paraguay)
in scheme: Lexvo - ISO 639-3 language codes
notation: gva

Guanano
type: Language
type: Concept
ISO 639-3 code: gvc
alternative label: Guanano language
definition: Guanano (also Wanano) is a Tucanoan language spoken in the northwest part of Amazonas in Brazil and in Vaupés in Colombia.
in scheme: Lexvo - ISO 639-3 language codes
notation: gvc
preferred label: Wanano @fr

Duwet
type: Language
type: Concept
ISO 639-3 code: gve
alternative label: Duwet language
definition: Duwet, also known as Guwot or Waing, is an aberrant member of the Busu subgroup of Lower Markham languages in Morobe Province, Papua New Guinea. Duwet is spoken by about 400 people and appears to have been heavily influenced by its neighboring Nabak language (also called Wain) of the Papuan Trans–New Guinea languages.
in scheme: Lexvo - ISO 639-3 language codes
notation: gve

Golin
type: Language
type: Concept
ISO 639-3 code: gvf
alternative label: Golin language
definition: Golin (also Gollum, Gumine) is a Papuan language of Papua New Guinea.
in scheme: Lexvo - ISO 639-3 language codes
notation: gvf

Median
type: Language
type: Concept
ISO 639-3 code: xme
alternative label: Median language
definition: The Median language (also Medean or Medic) was the language of the Medes. It is an Old Iranian language and classified as belonging to the northwestern Iranian subfamily which includes many other languages such as Azari, Zazaki, Gilaki, Mazandarani, the Kurdish languages, and Baluchi.
in scheme: Lexvo - ISO 639-3 language codes
notation: xme
preferred label: Língua meda @pt
preferred label: Medische Sprache @de

Guajá
type: Language
type: Concept
ISO 639-3 code: gvj
alternative label: Guaja language
definition: Guajá, or Awá (also Ayaya, Guaxare, Wazaizara), is an isolated Tupi–Guarani language spoken in Brazil.
in scheme: Lexvo - ISO 639-3 language codes
notation: gvj

Gulay
type: Language
type: Concept
ISO 639-3 code: gvl
alternative label: Gulay language
definition: Gulay (Gulai) is a Bongo–Bagirmi language of Chad. An eighth of speakers are Pen (Peni), and do not like to be called Gulay.
in scheme: Lexvo - ISO 639-3 language codes
notation: gvl

Gurmana
type: Language
type: Concept
ISO 639-3 code: gvm
in scheme: Lexvo - ISO 639-3 language codes
notation: gvm

Kuku-Yalanji
type: Language
type: Concept
ISO 639-3 code: gvn
alternative label: Kuku Nyungkal language
definition: Kuku Nyungkal (also known as Kuku Njunggal; Guugu Nyungkul; Gugu Njunggal ) is an Australian Aboriginal language and the language of the Kuku Nyungkal people of Far North Queensland. It is one of the Kuku Yalanji languages still being spoken (though by fewer people than speak Kuku Yalanji itself). Most of the speakers today live in the communities of Wujal Wujal and Mossman.
in scheme: Lexvo - ISO 639-3 language codes
notation: gvn

Gavião of Jiparaná
type: Language
type: Concept
ISO 639-3 code: gvo
alternative label: Gavião Do Jiparaná
definition: Gavião of Jiparaná (Gavião do Jiparaná), also known as Digüt and Gavião do Rondônia, is a Tupian language of Brazil. It is partially intelligible with Suruí. The Zoró dialect is sometimes considered a separate language.
in scheme: Lexvo - ISO 639-3 language codes
notation: gvo

Pará Gavião
type: Language
type: Concept
ISO 639-3 code: gvp
alternative label: Gavião, Pará
in scheme: Lexvo - ISO 639-3 language codes
notation: gvp

Western Gurung
type: Language
type: Concept
ISO 639-3 code: gvr
alternative label: Gurung, Western
in scheme: Lexvo - ISO 639-3 language codes
notation: gvr

Gumawana
type: Language
type: Concept
ISO 639-3 code: gvs
in scheme: Lexvo - ISO 639-3 language codes
notation: gvs

Guyani
type: Language
type: Concept
ISO 639-3 code: gvy
in scheme: Lexvo - ISO 639-3 language codes
notation: gvy

Mbato
type: Language
type: Concept
ISO 639-3 code: gwa
alternative label: Mbato language
definition: Mbato, also known as Potu or Gwa, is a Kwa language of Ivory Coast and in Ghana. It's one of two Potou languages.
in scheme: Lexvo - ISO 639-3 language codes
notation: gwa

Gwa
type: Language
type: Concept
ISO 639-3 code: gwb
in scheme: Lexvo - ISO 639-3 language codes
notation: gwb

Kalami
type: Language
type: Concept
ISO 639-3 code: gwc
alternative label: Kalami language
definition: Kalami is a Dardic language spoken in northern Pakistan.
in scheme: Lexvo - ISO 639-3 language codes
notation: gwc
preferred label: Kohistani de Kalam @fr

Gawwada
type: Language
type: Concept
ISO 639-3 code: gwd
alternative label: Gawwada language
definition: Gawwada (also known as Gauwada, Gawata, Kawwad'a, Kawwada) is an Afro-Asiatic language spoken in southern Ethiopia. Dialects include Dihina, Gergere, Gobeze, Gollango, Gorose, Harso.
in scheme: Lexvo - ISO 639-3 language codes
notation: gwd

Mingrelian
type: Language
type: Concept
ISO 639-3 code: xmf
alternative label: Mingrelian language
definition: Mingrelian, or Megrelian (მარგალური ნინა margaluri nina; ), is a Kartvelian language spoken in Western Georgia (regions of Samegrelo and Abkhazia), primarily by Georgians of Mingrelian origin. The language was also called Iverian (Georgian iveriuli ena) in the early 20th century. Because for more than a thousand years Mingrelian holds only a regional status within Georgia, the number of its speakers has been decreasing in favor of the national language, with UNESCO designating it as a definitely endangered language.
in scheme: Lexvo - ISO 639-3 language codes
notation: xmf
preferred label: Idioma megreliano @es
preferred label: Lingua mengrelia @it
preferred label: Língua mingreliana @pt
preferred label: Mingrelische Sprache @de
preferred label: Mingrélien @fr

Gweno
type: Language
type: Concept
ISO 639-3 code: gwe
alternative label: Gweno language
definition: The Gweno are a Chaga ethnic and linguistic group based in the northernmost part of the Pare Mountains in the Kilimanjaro Region of Tanzania. In 2000 the ethnic Gweno population was estimated to number somewhere over 2,000, with their nearly extinct language spoken mostly by older adults, while younger Gweno have shifted to Asu and Swahili.
in scheme: Lexvo - ISO 639-3 language codes
notation: gwe

Gowro
type: Language
type: Concept
ISO 639-3 code: gwf
in scheme: Lexvo - ISO 639-3 language codes
notation: gwf

Moo
type: Language
type: Concept
ISO 639-3 code: gwg
in scheme: Lexvo - ISO 639-3 language codes
notation: gwg

Gwichʼin
type: Language
type: Concept
ISO 639-2 Bibliographical code: gwi
ISO 639-2 Terminological code: gwi
ISO 639-3 code: gwi
alternative label: Gwich'in
alternative label: Gwich’in @fr
alternative label: Gwich’in language
alternative label: Idioma gwich'in @es
alternative label: Língua gwich’in @pt
alternative label: gwich'in @fr
definition: The Gwich’in language is the Athabaskan language of the Gwich’in indigenous people. It is also known in older or dialect-specific publications as Kutchin, Takudh, Tukudh, or Loucheux. In the Northwest Territories and Yukon of Canada, it is used principally in the towns of Inuvik, Aklavik, Fort McPherson, Old Crow, and Tsiigehtchic (formerly Arctic Red River). There are about 430 Gwich’in speakers in Canada out of a total Gwich’in population of 1,900.
in scheme: Lexvo - ISO 639-3 language codes
notation: gwi
preferred label: Kutchin-Sprache @de
preferred label: gwichʼin @fr
preferred label: kutchin @es

/Gwi
type: Language
type: Concept
ISO 639-3 code: gwj
alternative label: Gǀui dialect
definition: or (sometimes spelled |Gwi, Dcui, Gcwi, or Cgui) is a Khoe dialect of Botswana with 2,500 speakers (2004 Cook). It is part of the Gǁana dialect cluster, and is closely related to Naro.
in scheme: Lexvo - ISO 639-3 language codes
notation: gwj

Awngthim
type: Language
type: Concept
ISO 639-3 code: gwm
in scheme: Lexvo - ISO 639-3 language codes
notation: gwm

Gwandara
type: Language
type: Concept
ISO 639-3 code: gwn
alternative label: Gwandara language
definition: Gwandara is a West Chadic language, and the closest relative of Hausa. Its several dialects are spoken in northern Nigeria by about 30,000 people.
in scheme: Lexvo - ISO 639-3 language codes
notation: gwn

Gwere
type: Language
type: Concept
ISO 639-3 code: gwr
alternative label: Gwere language
definition: ‎ Gwere, or Lugwere, is the language spoken by the Gwere people (Bagwere), a Bantu people found in the eastern part of Uganda. It has a close dialectical resemblance to Soga and Ganda, which neighbhour the Gwere.
in scheme: Lexvo - ISO 639-3 language codes
notation: gwr

Gawar-Bati
type: Language
type: Concept
ISO 639-3 code: gwt
alternative label: Gawar-Bati language
in scheme: Lexvo - ISO 639-3 language codes
notation: gwt
preferred label: Gawar-bati @fr

Guwamu
type: Language
type: Concept
ISO 639-3 code: gwu
in scheme: Lexvo - ISO 639-3 language codes
notation: gwu

Kwini
type: Language
type: Concept
ISO 639-3 code: gww
in scheme: Lexvo - ISO 639-3 language codes
notation: gww

Gua
type: Language
type: Concept
ISO 639-3 code: gwx
alternative label: Gua language
definition: Gua (Gwa) is a Guang language spoken by 180,000 in coastal Ghana. It is also called Anum-Boso, after its two dialects.
in scheme: Lexvo - ISO 639-3 language codes
notation: gwx

Wè Southern
type: Language
type: Concept
ISO 639-3 code: gxx
in scheme: Lexvo - ISO 639-3 language codes
notation: gxx

Northwest Gbaya
type: Language
type: Concept
ISO 639-3 code: gya
alternative label: Gbaya, Northwest
in scheme: Lexvo - ISO 639-3 language codes
notation: gya

Garus
type: Language
type: Concept
ISO 639-3 code: gyb
in scheme: Lexvo - ISO 639-3 language codes
notation: gyb

Kayardild
type: Language
type: Concept
ISO 639-3 code: gyd
alternative label: Kayardild language
definition: Kayardild is a Tangkic language spoken on Bentinck Island and surrounding islands such as Sweers Island, north west Queensland, Australia, with fewer than ten fluent speakers remaining. Other members of the family include Lardil, Yukulta (Ganggalida) and Yangkaal. It is famous for its many unusual case phenomena, including case stacking of up to four levels, the use of clause-level case to signal interclausal relations and pragmatic factors, and another set of verbal case endings which convert their hosts from nouns into verbs morphologically.
in scheme: Lexvo - ISO 639-3 language codes
notation: gyd

Mengaka
type: Language
type: Concept
ISO 639-3 code: xmg
in scheme: Lexvo - ISO 639-3 language codes
notation: xmg

Gyem
type: Language
type: Concept
ISO 639-3 code: gye
in scheme: Lexvo - ISO 639-3 language codes
notation: gye

Gungabula
type: Language
type: Concept
ISO 639-3 code: gyf
in scheme: Lexvo - ISO 639-3 language codes
notation: gyf

Gbayi
type: Language
type: Concept
ISO 639-3 code: gyg
in scheme: Lexvo - ISO 639-3 language codes
notation: gyg

Gyele
type: Language
type: Concept
ISO 639-3 code: gyi
in scheme: Lexvo - ISO 639-3 language codes
notation: gyi

Gayil
type: Language
type: Concept
ISO 639-3 code: gyl
in scheme: Lexvo - ISO 639-3 language codes
notation: gyl

Ngäbere
type: Language
type: Concept
ISO 639-3 code: gym
alternative label: Guaymí language
definition: Introduction Also known as Guaymí, Ngöbere, Movere, Chiriquí, Valiente. The Ngäbere language is spoken by the indigenous Ngäbe people in Panama and Costa Rica. The people refer to themselves as Ngäbe (roughly pronounced “nawbay”), and to their language as Ngäbere (“nawberay”). The Ngäbes are the most populous of Panama’s several indigenous peoples. The language originates in Panama with the population centered within the semi-autonomous indigenous reservation known as the Comarca Ngäbe-Buglé. Beginning in the 1950s Costa Rica began to receive Ngäbe immigrants, where they are located in several indigenous reservations: Abrojos Montezuma, Conteburica, Coto Brus, Guaymí de Alto Laguna de Osa, and Altos de San Antonio.
in scheme: Lexvo - ISO 639-3 language codes
notation: gym
preferred label: Idioma ngäbe @es

Tonga
type: Language
type: Concept
ISO 639-3 code: toi
alternative label: Tonga (Zambia)
alternative label: Tonga language
definition: The Tonga language of Zambia and Zimbabwe is a Bantu Language primarily spoken by the Tonga people in those countries who live mainly in the Southern and Western provinces of Zambia, and in northern Zimbabwe, with a few in Mozambique. The language is also spoken by the Tonga, Ila, Iwe, Toka and Leya people, as well as many bilingual Zambians and Zimbabweans. It is one of the major lingua francas in Zambia, together with Bemba, Lozi and Nyanja. The Tonga of Malawi is not particularly close.
in scheme: Lexvo - ISO 639-3 language codes
notation: toi
preferred label: ChiTonga @de
preferred label: Chitonga @fr
preferred label: Língua tonga @pt

Guyanese Creole
type: Language
type: Concept
ISO 639-3 code: gyn
alternative label: Creole English, Guyanese
alternative label: Guyanese Creole English
definition: Guyanese Creole (Creolese by its speakers: or simply Guyanese) is an English-based creole language spoken by people in Guyana.
in scheme: Lexvo - ISO 639-3 language codes
notation: gyn

Kuku-Muminh
type: Language
type: Concept
ISO 639-3 code: xmh
in scheme: Lexvo - ISO 639-3 language codes
notation: xmh

Guarayu
type: Language
type: Concept
ISO 639-3 code: gyr
alternative label: Guarayu language
definition: Guarayu is a Tupian language of Bolivia.
in scheme: Lexvo - ISO 639-3 language codes
notation: gyr

Gunya
type: Language
type: Concept
ISO 639-3 code: gyy
alternative label: Gunya language
definition: The Kunja is an extinct Australian Aboriginal language.
in scheme: Lexvo - ISO 639-3 language codes
notation: gyy

Ganza
type: Language
type: Concept
ISO 639-3 code: gza
alternative label: Ganza language
definition: Ganza (also Ganzo, Koma) is an Afro-Asiatic language (Omotic), spoken in the western Oromo region of Ethiopia, near the border of Sudan. The Ganza people may originally have been from Sudan.
in scheme: Lexvo - ISO 639-3 language codes
notation: gza

Gazi
type: Language
type: Concept
ISO 639-3 code: gzi
in scheme: Lexvo - ISO 639-3 language codes
notation: gzi

Gane
type: Language
type: Concept
ISO 639-3 code: gzn
in scheme: Lexvo - ISO 639-3 language codes
notation: gzn

Han
type: Language
type: Concept
ISO 639-3 code: haa
alternative label: Hän language
definition: The Hän language (Dawson, Han-Kutchin, Moosehide) is a Native American endangered language spoken in only two places: Eagle, Alaska and Dawson City, Yukon. There are only a few fluent speakers left (perhaps about 10), all of them elderly.
in scheme: Lexvo - ISO 639-3 language codes
notation: haa
preferred label: Língua hän @pt

Amatlán Zapotec
type: Language
type: Concept
ISO 639-3 code: zpo
alternative label: Zapotec, Amatlán
in scheme: Lexvo - ISO 639-3 language codes
notation: zpo

Hanoi Sign Language
type: Language
type: Concept
ISO 639-3 code: hab
in scheme: Lexvo - ISO 639-3 language codes
notation: hab

Majera
type: Language
type: Concept
ISO 639-3 code: xmj
alternative label: Majera language
definition: Majera (Mazᵉra) is a minor Afro-Asiatic language of Chad and Cameroon.
in scheme: Lexvo - ISO 639-3 language codes
notation: xmj

Gurani
type: Language
type: Concept
ISO 639-3 code: hac
alternative label: Gorani language
definition: Gorani (also Gurani) is a Northwestern Iranian language, that includes Hewrami, and is spoken by Kurdish populations in the southernmost parts of Iranian Kurdistan and the Iraqi Kurdistan region. Some linguists classify it as a member of the Zaza–Gorani branch of the Northwestern Iranian languages. Although it shares similarities in vocabulary to Kurmanji and Sorani, also spoken by Kurds, Gorani is distinct grammatically from the two and shares similarities with Zazaki. In the nineteenth century, Gorani as a language of communication was slowly replaced by Sorani in several cities, both in Iran and Iraq. Today, Sorani is the primary language spoken in cities including Kirkuk, Meriwan, and Halabja, which are still considered part of the greater Goran region.
in scheme: Lexvo - ISO 639-3 language codes
notation: hac
preferred label: Gorani @de

Hatam
type: Language
type: Concept
ISO 639-3 code: had
alternative label: Hattam language
definition: Hattam, also spelled Hatam, Atam and also known as Borai or Mansim, is a divergent language of New Guinea. It is not closely related to any other language, and though Ross (2005) tentatively assigned it to the West Papuan languages, based on similarities in pronouns, Ethnologue (2009) removed it as a language isolate.
in scheme: Lexvo - ISO 639-3 language codes
notation: had

Eastern Oromo
type: Language
type: Concept
ISO 639-3 code: hae
alternative label: Eastern Oromo language
alternative label: Oromo, Eastern
definition: Eastern Oromo (also known as "Ittu Oromo" or "Qottu Oromo") is a dialect of the Oromo language. According to the Ethnologue map of Ethiopian languages, it is spoken in the Mirab Hararghe Zone, Misraq Hararghe Zone and northern Bale Zone of the Oromia Region of Ethiopia.
in scheme: Lexvo - ISO 639-3 language codes
notation: hae

Haiphong Sign Language
type: Language
type: Concept
ISO 639-3 code: haf
in scheme: Lexvo - ISO 639-3 language codes
notation: haf

Hanga
type: Language
type: Concept
ISO 639-3 code: hag
in scheme: Lexvo - ISO 639-3 language codes
notation: hag

Hahon
type: Language
type: Concept
ISO 639-3 code: hah
in scheme: Lexvo - ISO 639-3 language codes
notation: hah

Haida
type: Language
type: Concept
ISO 639-2 Bibliographical code: hai
ISO 639-2 Terminological code: hai
ISO 639-3 code: hai
alternative label: Haida language
alternative label: Haida-Sprache @de
alternative label: Idioma haida @es
alternative label: Lingua haida @it
preferred label: haida @es
definition: The Haida language is the language of the Haida people. It contains seven vowels and well over 30 consonants.
in scheme: Lexvo - ISO 639-3 language codes
notation: hai
preferred label: Haïda @fr

Hajong
type: Language
type: Concept
ISO 639-3 code: haj
alternative label: Hajong language
definition: Hajong (হাজং) is an Indo-Aryan language with Tibeto-Burman roots spoken by more than 175,000 ethnic Hajong in the states of Assam, Meghalaya, Arunachal Pradesh and West Bengal in India and the Mymensingh District in Bangladesh. It is written in the Assamese script, and it is being supplanted by the Assamese language in India. Hajong was originally a Tibeto-Burman language, but it was linguistically mixed with Bengali and Assamese.
in scheme: Lexvo - ISO 639-3 language codes
notation: haj

Chino hakka
type: Language
type: Concept
ISO 639-3 code: hak
alternative label: Chinese, Hakka
alternative label: Hakka Chinese
definition: Hakka is one of the main subdivisions of the Chinese language spoken by the Hakka people in southern China and throughout the diaspora areas of East Asia, Southeast Asia and around the world.
in scheme: Lexvo - ISO 639-3 language codes
notation: hak
preferred label: Hakka
preferred label: Lingua hakka @it

Halang
type: Language
type: Concept
ISO 639-3 code: hal
alternative label: Halang language
definition: Halang, also known as Salang, is a Bahnaric language of the Mon–Khmer branch of the Austroasiatic language family. It is spoken in the southern Laotian province of Attapu by approximately 4000 people and in the neighboring Kon Tum Province of Vietnam by approximately 13,500 people (Ethnologue, 2000).
in scheme: Lexvo - ISO 639-3 language codes
notation: hal

Hewa
type: Language
type: Concept
ISO 639-3 code: ham
alternative label: Hewa language
definition: Hewa, also known as Sisimin and Lagaip, is a Sepik language of northern Papua New Guinea.
in scheme: Lexvo - ISO 639-3 language codes
notation: ham

Ancient Macedonian
type: Language
type: Concept
ISO 639-3 code: xmk
alternative label: Ancient Macedonian language
alternative label: Macedonian, Ancient
definition: Ancient Macedonian was the language of the ancient Macedonians. It was spoken in the kingdom of Macedon during the 1st millennium BCE and it belongs to the Indo-European group of languages. It gradually fell out of use during the 4th century BCE, marginalized by Koine Greek, the lingua franca of the Hellenistic period.
in scheme: Lexvo - ISO 639-3 language codes
notation: xmk
preferred label: Ancien macédonien @fr
preferred label: Antiguo idioma macedonio @es
preferred label: Lingua antico macedone @it
preferred label: Língua macedônia antiga @pt
preferred label: Makedonische Sprache @de

Hangaza
type: Language
type: Concept
ISO 639-3 code: han
in scheme: Lexvo - ISO 639-3 language codes
notation: han

Hakö
type: Language
type: Concept
ISO 639-3 code: hao
in scheme: Lexvo - ISO 639-3 language codes
notation: hao

Hupla
type: Language
type: Concept
ISO 639-3 code: hap
in scheme: Lexvo - ISO 639-3 language codes
notation: hap

Ha
type: Language
type: Concept
ISO 639-3 code: haq
alternative label: Ha language
definition: Ha, also known with the Bantu language prefix as Giha, Ikiha, or Kiha, is a Bantu language spoken by the Ha people of the Kigoma region of Tanzania which is closely related to the languages of Rwanda and Burundi; neighboring dialects are mutually intelligible with Kirundi.
in scheme: Lexvo - ISO 639-3 language codes
notation: haq

Harari
type: Language
type: Concept
ISO 639-3 code: har
alternative label: Harari language
definition: Harari (sometimes (H)aderi or (H)adere) is the language of the Harari people of Ethiopia. According to the 1998 Ethiopian census, it is spoken by 21,283 people. Most of its speakers are multilingual in Amharic and/or Oromo. Harari is closely related to the East Gurage languages, Zay and Silte. Locals or natives of this city also refer to it as "Gey sinan" (Language of the City). Several words are of Arabic or (to a lesser extent) Italian origin. Originally written in the Arabic script, it has recently converted to the Geez alphabet.
in scheme: Lexvo - ISO 639-3 language codes
notation: har
preferred label: Língua harari @pt

Haisla
type: Language
type: Concept
ISO 639-3 code: has
alternative label: Haisla language
definition: The Haisla language is a First Nations language spoken by the Haisla people of the North Coast region of the Canadian province of British Columbia, who are based in the village of Kitaamat 10 km from the town of Kitimat at the head of the Douglas Channel, a 120 km fjord that serves as a waterway for the Haisla as well as for the aluminum smelter and accompanying port of the town of Kitimat. The Haisla and their language, along with that of the neighbouring Heiltsuk and Wuikinuxv peoples, were in the past incorrectly called "Northern Kwakiutl".
in scheme: Lexvo - ISO 639-3 language codes
notation: has
preferred label: Idioma haisla @es

Haitian
type: Language
type: Concept
ISO 639-1 code: ht
ISO 639-2 Bibliographical code: hat
ISO 639-2 Terminological code: hat
ISO 639-3 code: hat
alternative label: Creole, Haitian
alternative label: Criollo haitiano @es
alternative label: Crioulo haitiano @pt
alternative label: Haitian Creole
alternative label: Haitian Creole language
alternative label: Haitianische Sprache @de
alternative label: Haïtien @fr
alternative label: Lingua creola haitiana @it
definition: Haitian Creole language (Kreyòl ayisyen; ), often called simply Creole or Kreyòl, is a language spoken in Haiti by about twelve million people, which includes all Haitians in Haiti and via emigration, by about two to three million speakers residing in the Bahamas, Cuba, Canada, France, Cayman Islands, French Guiana, Martinique, Guadeloupe, Belize, Puerto Rico, Dominican Republic, Ivory Coast, Trinidad and Tobago, Venezuela, and the United States.
in scheme: Lexvo - ISO 639-3 language codes
notation: hat
preferred label: Haitianisch @de
preferred label: haitiano @es
preferred label: haïtien @fr

Hausa
type: Language
type: Concept
ISO 639-1 code: ha
ISO 639-2 Bibliographical code: hau
ISO 639-2 Terminological code: hau
ISO 639-3 code: hau
alternative label: Haoussa @fr
alternative label: Hausa language
alternative label: Idioma hausa @es
alternative label: Lingua hausa @it
alternative label: Língua haúça @pt
alternative label: haúça @pt
definition: Hausa (Yaren Hausa – language of the Hausa [people]) is the Chadic language with the largest number of speakers, spoken as a first language by about 25 million people, and as a second language by about 18 million more, an approximate total of 43 million people. Hausa is one of Africa's largest spoken languages after Arabic, French, English, Portuguese and Swahili.
in scheme: Lexvo - ISO 639-3 language codes
notation: hau
preferred label: haoussa @fr
preferred label: hausa @es
preferred label: haussa @it
preferred label: hauçá @pt

Havu
type: Language
type: Concept
ISO 639-3 code: hav
alternative label: Havu language
definition: Havu or Haavu is a Bantu language of the Democratic Republic of the Congo. It is very close to the Shi language.
in scheme: Lexvo - ISO 639-3 language codes
notation: hav

Hawaiian
type: Language
type: Concept
ISO 639-2 Bibliographical code: haw
ISO 639-2 Terminological code: haw
ISO 639-3 code: haw
alternative label: Hawaiian language
alternative label: Hawaiische Sprache @de
alternative label: Hawaïen @fr
alternative label: Idioma hawaiano @es
alternative label: Lingua hawaiiana @it
alternative label: Língua havaiana @pt
definition: The Hawaiian language (Hawaiian: Ōlelo Hawaii) is a Polynesian language that takes its name from Hawaii, the largest island in the tropical North Pacific archipelago where it developed. Hawaiian, along with English, is an official language of the state of Hawaii. King Kamehameha III established the first Hawaiian-language constitution in 1839 and 1840.
in scheme: Lexvo - ISO 639-3 language codes
notation: haw
preferred label: Hawaiisch @de
preferred label: havaiano @pt
preferred label: hawaiano @es
preferred label: hawaïen @fr

Southern Haida
type: Language
type: Concept
ISO 639-3 code: hax
alternative label: Haida, Southern
in scheme: Lexvo - ISO 639-3 language codes
notation: hax

Haya
type: Language
type: Concept
ISO 639-3 code: hay
alternative label: Haya language
definition: Haya (OluHaya, Swahili:Kihaya) is a Niger–Congo language spoken by the Haya people of Tanzania, in the south and southwest coast of Lake Victoria. In 1991, the population of Haya speakers was estimated at 1,200,000 people .
in scheme: Lexvo - ISO 639-3 language codes
notation: hay
preferred label: Língua haya @pt

Hazara
type: Language
type: Concept
ISO 639-3 code: haz
alternative label: Hazaragi language
definition: Hazaragi is a dialect of the Persian language spoken by the Hazara people, most of all in an area known as the Hazarajat.
in scheme: Lexvo - ISO 639-3 language codes
notation: haz
preferred label: Hazaragi
preferred label: Idioma hazara @es
preferred label: Língua hazaragi @pt

Hamba
type: Language
type: Concept
ISO 639-3 code: hba
in scheme: Lexvo - ISO 639-3 language codes
notation: hba

Huba
type: Language
type: Concept
ISO 639-3 code: hbb
alternative label: Huba language
definition: Huba, also Kilba, is a Chadic language of Nigeria.
in scheme: Lexvo - ISO 639-3 language codes
notation: hbb

Heiban
type: Language
type: Concept
ISO 639-3 code: hbn
alternative label: Heiban language
definition: The Heiban language, Ebang, or Abul, is a Niger–Congo language in the Heiban family spoken in Kordofan, Sudan.
in scheme: Lexvo - ISO 639-3 language codes
notation: hbn

Ancient Hebrew
type: Language
type: Concept
ISO 639-3 code: hbo
alternative label: Biblical Hebrew
alternative label: Hebrew, Ancient
definition: Biblical Hebrew , also called Classical Hebrew , is the archaic form of the Hebrew language, a Canaanite Semitic language spoken in the area known as Canaan between the Jordan River and the Mediterranean Sea. Biblical Hebrew is attested from about the 10th century BC, and persisted through the Second Temple period (ending in AD 70 ). Biblical Hebrew eventually developed into Mishnaic Hebrew, which was spoken until the 2nd century AD. Biblical Hebrew is best-attested in the Hebrew Bible, a document which reflects various stages of the Hebrew language in its consonantal skeleton, as well as a vocalic system which was added later, in the Middle Ages. There is also some evidence of regional dialectal variation, including differences between Biblical Hebrew as spoken in the northern Kingdom of Israel and in the southern Kingdom of Judah.
in scheme: Lexvo - ISO 639-3 language codes
notation: hbo
preferred label: Hebraico bíblico @pt
preferred label: Hébreu biblique @fr

Malaysian Sign Language
type: Language
type: Concept
ISO 639-3 code: xml
definition: Malaysian Sign Language (, or BIM) is the sign language in everyday use in many parts of Malaysia. BIM has many dialects, differing from state to state.
in scheme: Lexvo - ISO 639-3 language codes
notation: xml
preferred label: Língua de sinais malasiana @pt

Serbo-Croatian
type: Language
type: Concept
ISO 639-1 code: sh
ISO 639-3 code: hbs
alternative label: Idioma serbocroata @es
alternative label: Lingua serbo-croata @it
alternative label: Língua servo-croata @pt
alternative label: Serbo-croate @fr
alternative label: Serbokroatische Sprache @de
definition: Serbo-Croatian or Serbo-Croat, less commonly Bosnian/Croatian/Serbian (BCS) is a South Slavic language with multiple standards and the primary language of Serbia, Croatia, Bosnia and Herzegovina, and Montenegro. Croats and Serbs differ in religion and have historically lived under different empires, and have adopted slightly different literary forms as the official languages of their respective republics. Since independence, Bosnian has likewise been established as an official standard in Bosnia and Herzegovina. Currently, there is a movement to create a Montenegrin language, separating it from Serbian. Thus Serbo-Croatian generally goes by the ethnic names Serbian, Croatian, Bosnian, and Montenegrin. All four standards are based on the same dialect, which had served as the official language of the Kingdom of Yugoslavia, and later of the Socialist Federal Republic of Yugoslavia, from 1918 to 1991.
in scheme: Lexvo - ISO 639-3 language codes
notation: hbs
preferred label: Serbo-Kroatisch @de
preferred label: serbo-croate @fr
preferred label: serbo-croato @it
preferred label: serbocroata @es
preferred label: servo-croata @pt

Habu
type: Language
type: Concept
ISO 639-3 code: hbu
in scheme: Lexvo - ISO 639-3 language codes
notation: hbu

Andaman Creole Hindi
type: Language
type: Concept
ISO 639-3 code: hca
alternative label: Creole Hindi, Andaman
in scheme: Lexvo - ISO 639-3 language codes
notation: hca

Huichol
type: Language
type: Concept
ISO 639-3 code: hch
alternative label: Huichol language
definition: The Huichol language is an indigenous language of Mexico which belongs to the Uto-Aztecan language family. It is spoken by the ethnic group widely known as the Huichol (self-designation Wixaritari), whose mountainous territory extends over portions of the Mexican states of Jalisco, Nayarit, and Durango, mostly in Jalisco. Under the 2003 law of language rights, the indigenous languages of Mexico along with Spanish are recognized as "national languages".
in scheme: Lexvo - ISO 639-3 language codes
notation: hch
preferred label: Huichol-Sprache @de
preferred label: Idioma huichol @es

Northern Haida
type: Language
type: Concept
ISO 639-3 code: hdn
alternative label: Haida, Northern
in scheme: Lexvo - ISO 639-3 language codes
notation: hdn

Honduras Sign Language
type: Language
type: Concept
ISO 639-3 code: hds
definition: Honduras Sign Language, also known as "Lengua de Señas Hondureñas" (LESHO), is the dominant sign language used in Honduras.
in scheme: Lexvo - ISO 639-3 language codes
notation: hds
preferred label: Língua Gestual das Honduras @pt

Hadiyya
type: Language
type: Concept
ISO 639-3 code: hdy
alternative label: Hadiyya language
definition: Hadiyya (sometimes Hadiyigna or Adiya) is the Afro-Asiatic language of the Hadiya people of Ethiopia. Most speakers live in the Southern Nations, Nationalities, and People's Region in the Hadiya Zone around the town Hosaena.
in scheme: Lexvo - ISO 639-3 language codes
notation: hdy
preferred label: Lingua hadiya @it
preferred label: Língua hadia @pt

Northern Qiandong Miao
type: Language
type: Concept
ISO 639-3 code: hea
alternative label: Miao, Northern Qiandong
in scheme: Lexvo - ISO 639-3 language codes
notation: hea

Hebrew
type: Language
type: Concept
ISO 639-1 code: he
ISO 639-2 Bibliographical code: heb
ISO 639-2 Terminological code: heb
ISO 639-3 code: heb
alternative label: Hebraico samaritano @pt
alternative label: Hébreu samaritain @fr
alternative label: Samaritan Hebrew
definition: Samaritan Hebrew , is a reading tradition for Biblical Hebrew as used by the Samaritans for reading the Samaritan Pentateuch. Its pronunciation is highly similar to that of Samaritan Arabic, used by the Samaritans in prayer.
in scheme: Lexvo - ISO 639-3 language codes
notation: heb
preferred label: Hebräisch @de
preferred label: ebraico @it
preferred label: hebraico @pt
preferred label: hebreo @es
preferred label: hébreu @fr

Herdé
type: Language
type: Concept
ISO 639-3 code: hed
alternative label: Herdé language
definition: Herdé (He’dé) is an Afro-Asiatic language of Chad. Zime is a generic name.
in scheme: Lexvo - ISO 639-3 language codes
notation: hed

Helong
type: Language
type: Concept
ISO 639-3 code: heg
in scheme: Lexvo - ISO 639-3 language codes
notation: heg

Manado Malay
type: Language
type: Concept
ISO 639-3 code: xmm
alternative label: Malay, Manado
definition: Manado Malay is a language spoken in Manado and the surrounding area. The local name of the language is Bahasa Manado, and the name Minahasa Malay is also used, after the main ethnic group speaking the language. Since Manado Malay is used only for spoken communication, there is no standard orthography.
in scheme: Lexvo - ISO 639-3 language codes
notation: xmm
preferred label: Malais de Manado @fr

Hehe
type: Language
type: Concept
ISO 639-3 code: heh
alternative label: Hehe language
definition: Hehe is a Bantu language spoken by the Hehe people of the Iringa region of Tanzania. It was reported to have "Ngoni" features, that is, words of a Zulu-like language introduced when conquered by a Nguni or Zulu-like people in the early 19th century. However, other "Ngoni" speeches seem to have lost most of these distinctive features over the past 150-odd years, the language more resembling those of the neighbouring peoples. Some Bible translation (British and Foreign Bible Society).
in scheme: Lexvo - ISO 639-3 language codes
notation: heh

Heiltsuk
type: Language
type: Concept
ISO 639-3 code: hei
in scheme: Lexvo - ISO 639-3 language codes
notation: hei

Hemba
type: Language
type: Concept
ISO 639-3 code: hem
alternative label: Hemba language
definition: Hemba (Emba), also known as Eastern Luba, is a Bantu language of the Democratic Republic of the Congo. It is spoken by the Hemba people.
in scheme: Lexvo - ISO 639-3 language codes
notation: hem

Herero
type: Language
type: Concept
ISO 639-1 code: hz
ISO 639-2 Bibliographical code: her
ISO 639-2 Terminological code: her
ISO 639-3 code: her
alternative label: Herero language
alternative label: Herero-Sprache @de
alternative label: Idioma herero @es
alternative label: Lingua herero @it
alternative label: Língua hereró @pt
preferred label: herero @es
alternative label: héréro @fr
definition: The Herero language (Otjiherero) is a language of the Bantu family (Niger–Congo group). It is spoken by the Herero people in Namibia (206,000) and Botswana. The total number of speakers in both countries is approximately 237,000.
in scheme: Lexvo - ISO 639-3 language codes
notation: her
preferred label: Héréro @fr
preferred label: Otjiherero @de

Hai//om
type: Language
type: Concept
ISO 639-3 code: hgm
in scheme: Lexvo - ISO 639-3 language codes
notation: hgm

Haigwai
type: Language
type: Concept
ISO 639-3 code: hgw
in scheme: Lexvo - ISO 639-3 language codes
notation: hgw

Hoia Hoia
type: Language
type: Concept
ISO 639-3 code: hhi
in scheme: Lexvo - ISO 639-3 language codes
notation: hhi

Kerak
type: Language
type: Concept
ISO 639-3 code: hhr
in scheme: Lexvo - ISO 639-3 language codes
notation: hhr

Hoyahoya
type: Language
type: Concept
ISO 639-3 code: hhy
in scheme: Lexvo - ISO 639-3 language codes
notation: hhy

Lamang
type: Language
type: Concept
ISO 639-3 code: hia
alternative label: Lamang language
definition: Lamang (Laamang) is an Afro-Asiatic language of Nigeria.
in scheme: Lexvo - ISO 639-3 language codes
notation: hia

Hibito
type: Language
type: Concept
ISO 639-3 code: hib
alternative label: Hibito language
definition: Hibito (spelled variously Híbito, Hívito, Chibito, Ibito, Jibito, Xibita, Zibito) is an extinct language of Peru. It, together with Cholón, also extinct, constituted the Hibito-Cholon family.
in scheme: Lexvo - ISO 639-3 language codes
notation: hib
preferred label: Idioma hibito @es

Hidatsa
type: Language
type: Concept
ISO 639-3 code: hid
alternative label: Hidatsa language
definition: Hidatsa is an endangered Siouan language, closely related to the Crow language. It is spoken by the Hidatsa tribe, primarily in North Dakota and South Dakota.
in scheme: Lexvo - ISO 639-3 language codes
notation: hid

Manichaean Middle Persian
type: Language
type: Concept
ISO 639-3 code: xmn
alternative label: Persian, Manichaean Middle
in scheme: Lexvo - ISO 639-3 language codes
notation: xmn

Fiji Hindi
type: Language
type: Concept
ISO 639-3 code: hif
alternative label: Hindi, Fiji
definition: Fiji Hindi, also known as Fijian Hindi or Fijian Hindustani, is the language spoken by most Fijian citizens of Indian descent. It is derived mainly from the Awadhi and Bhojpuri varieties of Hindi. It has also borrowed a large number of words from Fijian and English. The relation between Fiji Hindi and Standard Hindi is similar to the relation between Afrikaans and Dutch. A large number of words, unique to Fiji Hindi, have been created to cater for the new environment that Fiji Indians now live in. First-generation Fiji Indians, who used the language as a lingua franca in Fiji, referred to it as Fiji Baat (Fiji talk).
in scheme: Lexvo - ISO 639-3 language codes
notation: hif
preferred label: Fidschi-Hindi @de
preferred label: Hindi de Fiyi @es
preferred label: Hindi des Fidji @fr
preferred label: Hindi fijiano @pt
preferred label: Lingua Figi Hindi @it

Kamwe
type: Language
type: Concept
ISO 639-3 code: hig
alternative label: Kamwe language
definition: Kamwe (also sometimes known as Higi) is an Afro-Asiatic language spoken in Adamawa State, Borno State in Nigeria and North Western Cameroon. Dialects include Nkafa, Dakwa, Fali of Kiriya, Fali of Mijilu, Futu, Humsi, Modi, Sina, and Tili Pte.
in scheme: Lexvo - ISO 639-3 language codes
notation: hig

Pamosu
type: Language
type: Concept
ISO 639-3 code: hih
alternative label: Pamosu language
definition: Pamosu is a Papuan language of Madang Province, Papua New Guinea. Some of the older generation can speak Pal, a related language.
in scheme: Lexvo - ISO 639-3 language codes
notation: hih

Hinduri
type: Language
type: Concept
ISO 639-3 code: hii
in scheme: Lexvo - ISO 639-3 language codes
notation: hii

Hijuk
type: Language
type: Concept
ISO 639-3 code: hij
in scheme: Lexvo - ISO 639-3 language codes
notation: hij

Seit-Kaitetu
type: Language
type: Concept
ISO 639-3 code: hik
in scheme: Lexvo - ISO 639-3 language codes
notation: hik

Hiligaynon
type: Language
type: Concept
ISO 639-2 Bibliographical code: hil
ISO 639-2 Terminological code: hil
ISO 639-3 code: hil
alternative label: Hiligaynon language
alternative label: Hiligaynon-Sprache @de
alternative label: Idioma hiligainón @es
alternative label: Lingua hiligaynon @it
preferred label: hiligaynon @es
definition: Hiligaynon, often referred to as Ilonggo, is an Austronesian language spoken in the Western Visayas region of the Philippines.
in scheme: Lexvo - ISO 639-3 language codes
notation: hil
preferred label: Hiligaïnon @fr
preferred label: hiligayna @it

Himachali
type: Language
type: Concept
in scheme: Lexvo - ISO 639-3 language codes
preferred label: himachali @es

Morerebi
type: Language
type: Concept
ISO 639-3 code: xmo
in scheme: Lexvo - ISO 639-3 language codes
notation: xmo

Hindi
type: Language
type: Concept
ISO 639-1 code: hi
ISO 639-2 Bibliographical code: hin
ISO 639-2 Terminological code: hin
ISO 639-3 code: hin
preferred label: hindi @es
in scheme: Lexvo - ISO 639-3 language codes
notation: hin
preferred label: híndi @pt

Tsoa
type: Language
type: Concept
ISO 639-3 code: hio
in scheme: Lexvo - ISO 639-3 language codes
notation: hio

Himarimã
type: Language
type: Concept
ISO 639-3 code: hir
alternative label: Himarimã language
definition: Himarimã is the presumed language of the uncontacted Hi-Merimã people, who are thought to number about 1000.
in scheme: Lexvo - ISO 639-3 language codes
notation: hir

Hittite
type: Language
type: Concept
ISO 639-2 Bibliographical code: hit
ISO 639-2 Terminological code: hit
ISO 639-3 code: hit
alternative label: Hethitische Sprache @de
alternative label: Hittite language
alternative label: Idioma hitita @es
alternative label: Lingua ittita @it
alternative label: Língua hitita @pt
definition: Hittite (natively "[in the language] of Neša") is the extinct language once spoken by the Hittites, a people who created an empire centred on Hattusa in north-central Anatolia. The language is attested in cuneiform, in records from the 16th (Anitta text) down to the 13th century BC, with isolated Hittite loanwords and numerous personal names appearing in an Old Assyrian context from as early as the 20th century BC.
in scheme: Lexvo - ISO 639-3 language codes
notation: hit
preferred label: Hethitisch @de
preferred label: hitita @es
preferred label: hittite @fr

Hiw
type: Language
type: Concept
ISO 639-3 code: hiw
alternative label: Hiw language
definition: Hiw (sometimes spelled Hiu) is an Oceanic language spoken on Hiw island, in the Torres islands of Vanuatu.
in scheme: Lexvo - ISO 639-3 language codes
notation: hiw
preferred label: Idioma Hiw @es

Hixkaryána
type: Language
type: Concept
ISO 639-3 code: hix
alternative label: Hixkaryana language
definition: Hixkaryana is one of the Carib languages, spoken by just over 500 people on the Nhamundá River, a tributary of the Amazon River in Brazil. It is one of a few known natural languages that normally use object–verb–subject word order, and may have been the first such language to be described (by linguist Desmond C. Derbyshire).
in scheme: Lexvo - ISO 639-3 language codes
notation: hix
preferred label: Hixkaryana @fr
preferred label: Idioma hixkaryána @es

Haji
type: Language
type: Concept
ISO 639-3 code: hji
in scheme: Lexvo - ISO 639-3 language codes
notation: hji

Kuku-Mu'inh
type: Language
type: Concept
ISO 639-3 code: xmp
in scheme: Lexvo - ISO 639-3 language codes
notation: xmp

Kahe
type: Language
type: Concept
ISO 639-3 code: hka
alternative label: Kahe language
definition: The Kahe are an ethnic and linguistic group based southeast of Moshi in northern Tanzania. The Kahe language, or Kikahe, is in the Chagga cluster of Bantu languages. Three dialects are recognized: Kimwangaria, Msengoni and Kichangareni. Kikahe is spoken by 9130 people, and is one of the smaller language communities in Tanzania.
in scheme: Lexvo - ISO 639-3 language codes
notation: hka

Hunde
type: Language
type: Concept
ISO 639-3 code: hke
alternative label: Hunde language
definition: The Hunde are an ethnolinguistic group of about 200,000 people (as of 1980) located in the eastern region of the Democratic Republic of the Congo. The Hunde live in the province of Nord-Kivu and the regions of Masisi and Rutshuru. The language of the Hunde is Kihunde, and alternate names are Kobi and Rukobi. The history of the Hunde since national independence has been bound up with that of the Kinyarwanda-speaking population in the region, including the recent First and Second Congo Wars.
in scheme: Lexvo - ISO 639-3 language codes
notation: hke

Hunjara-Kaina Ke
type: Language
type: Concept
ISO 639-3 code: hkk
in scheme: Lexvo - ISO 639-3 language codes
notation: hkk

Heung Kong Sau Yue
type: Language
type: Concept
ISO 639-3 code: hks
alternative label: Hong Kong Sign Language
in scheme: Lexvo - ISO 639-3 language codes
notation: hks

Halia
type: Language
type: Concept
ISO 639-3 code: hla
in scheme: Lexvo - ISO 639-3 language codes
notation: hla

Halbi
type: Language
type: Concept
ISO 639-3 code: hlb
alternative label: Halbi language
definition: Halbi (also Bastari, Halba, Halvas, Halabi, Halvi, Mahari, Mehari) is an Eastern zone Indo-Aryan language of the Oriya subgroup, spoken by about 500,000 individuals across the central part of India. It is considered a dilect of Oriya language by linguist.It uses SOV word order (subject-object-verb), makes strong use of affixes, and places adjectives before nouns. It is often used as a trade language, but there is a low literacy rate.
in scheme: Lexvo - ISO 639-3 language codes
notation: hlb

Halang Doan
type: Language
type: Concept
ISO 639-3 code: hld
alternative label: Halang Doan language
definition: Halang Doan is a language spoken by more than four thousand people on either side of the Laotian–Vietnamese border. There are some 2,346 speakers in Attopu Province, Laos, and another couple of thousand in Kon Tum Province, Vietnam.
in scheme: Lexvo - ISO 639-3 language codes
notation: hld

Kuku-Mangk
type: Language
type: Concept
ISO 639-3 code: xmq
in scheme: Lexvo - ISO 639-3 language codes
notation: xmq

Hlersu
type: Language
type: Concept
ISO 639-3 code: hle
in scheme: Lexvo - ISO 639-3 language codes
notation: hle

Matu Chin
type: Language
type: Concept
ISO 639-3 code: hlt
alternative label: Chin, Matu
alternative label: Nga La language
definition: Nga La, also known as Matu Chin (Matupi) and Haltu, is a Kukish language of Burma and India.
in scheme: Lexvo - ISO 639-3 language codes
notation: hlt

Hieroglyphic Luwian
type: Language
type: Concept
ISO 639-3 code: hlu
alternative label: Luwian, Hieroglyphic
definition: Hieroglyphic Luwian is a variant of the Luwian language, recorded in official and royal seals and a small number of monumental inscriptions. It is written in a hieroglyphic script known as Anatolian hieroglyphs
in scheme: Lexvo - ISO 639-3 language codes
notation: hlu

Southern Mashan Miao
type: Language
type: Concept
ISO 639-3 code: hma
alternative label: Hmong, Southern Mashan
alternative label: Miao, Southern Mashan
alternative label: Southern Mashan Hmong
in scheme: Lexvo - ISO 639-3 language codes
notation: hma

Humburi Senni
type: Language
type: Concept
ISO 639-3 code: hmb
alternative label: Humburi Senni Songhay
alternative label: Songhay, Humburi Senni
definition: Humburi Senni, or Central Songhay, is a variety of Southern Songhai spoken by about 140,000 people in the Hombori region, straddling the Burkina–Mali border.
in scheme: Lexvo - ISO 639-3 language codes
notation: hmb

Central Huishui Miao
type: Language
type: Concept
ISO 639-3 code: hmc
alternative label: Central Huishui Hmong
alternative label: Hmong, Central Huishui
alternative label: Miao, Central Huishui
in scheme: Lexvo - ISO 639-3 language codes
notation: hmc

El Alto Zapotec
type: Language
type: Concept
ISO 639-3 code: zpp
alternative label: Zapotec, El Alto
in scheme: Lexvo - ISO 639-3 language codes
notation: zpp

A-hmaos
type: Language
type: Concept
ISO 639-3 code: hmd
alternative label: A-Hmao language
alternative label: Da-Hua Miao
alternative label: Large Flowery Miao
alternative label: Miao, Da-Hua
alternative label: Miao, Large Flowery
definition: The A-Hmao language, also known as Large Flowery Miao , is a Hmongic language spoken in China. It is the language the Pollard script was designed for, and displays extensive tone sandhi. There is a high degree of literacy in Pollard among the older generation.
in scheme: Lexvo - ISO 639-3 language codes
notation: hmd

Meroitic
type: Language
type: Concept
ISO 639-3 code: xmr
alternative label: Meroitic language
definition: The Meroitic language was spoken in Meroë and the Sudan during the Meroitic period (attested from 300 BCE) and went extinct about 400 CE. It was written in two forms of the Meroitic alphabet: Meroitic Cursive, which was written with a stylus and was used for general record-keeping; and Meroitic Hieroglyphic, which was carved in stone or used for royal or religious documents. It is poorly understood owing to the scarcity of bilingual texts.
in scheme: Lexvo - ISO 639-3 language codes
notation: xmr
preferred label: Idioma meroítico @es
preferred label: Meroitische Sprache @de
preferred label: Méroïtique @fr

Eastern Huishui Miao
type: Language
type: Concept
ISO 639-3 code: hme
alternative label: Eastern Huishui Hmong
alternative label: Hmong, Eastern Huishui
alternative label: Miao, Eastern Huishui
in scheme: Lexvo - ISO 639-3 language codes
notation: hme

Hmong Don
type: Language
type: Concept
ISO 639-3 code: hmf
in scheme: Lexvo - ISO 639-3 language codes
notation: hmf

Southwestern Guiyang Hmong
type: Language
type: Concept
ISO 639-3 code: hmg
alternative label: Hmong, Southwestern Guiyang
in scheme: Lexvo - ISO 639-3 language codes
notation: hmg

Southwestern Huishui Miao
type: Language
type: Concept
ISO 639-3 code: hmh
alternative label: Hmong, Southwestern Huishui
alternative label: Miao, Southwestern Huishui
alternative label: Southwestern Huishui Hmong
in scheme: Lexvo - ISO 639-3 language codes
notation: hmh

Northern Huishui Miao
type: Language
type: Concept
ISO 639-3 code: hmi
alternative label: Hmong, Northern Huishui
alternative label: Miao, Northern Huishui
alternative label: Northern Huishui Hmong
in scheme: Lexvo - ISO 639-3 language codes
notation: hmi

Ge
type: Language
type: Concept
ISO 639-3 code: hmj
alternative label: Gejia
alternative label: Gejia language
definition: The Ge or Gejia language , Chonganjiang Miao (Zhong'an River Miao), is a Miao language of China. The endonym is spelled Mhong, though it shares this with Huishui Miao; it is pronounced , as in the Hmong language. When speaking Chinese, they call themselves Gédōu.
in scheme: Lexvo - ISO 639-3 language codes
notation: hmj

Maek
type: Language
type: Concept
ISO 639-3 code: hmk
alternative label: Ye-Maek language
definition: Ye-Maek, also known as Yemaek and Maek, is an unclassified and arguably unattested languages of Manchuria and eastern Korea north of Silla in the last few centuries BCE.
in scheme: Lexvo - ISO 639-3 language codes
notation: hmk

Luopohe Miao
type: Language
type: Concept
ISO 639-3 code: hml
alternative label: Hmong, Luopohe
alternative label: Luobo River Miao
alternative label: Luopohe Hmong
alternative label: Miao, Luopohe
definition: Luobo River Miao (罗泊河 Luōpōhé Miao), Hmjo or A-Hmyo, is a Miao language of China.
in scheme: Lexvo - ISO 639-3 language codes
notation: hml

Central Mashan Miao
type: Language
type: Concept
ISO 639-3 code: hmm
alternative label: Central Mashan Hmong
alternative label: Hmong, Central Mashan
alternative label: Miao, Central Mashan
in scheme: Lexvo - ISO 639-3 language codes
notation: hmm

Mong
type: Language
type: Concept
ISO 639-2 Bibliographical code: hmn
ISO 639-2 Terminological code: hmn
ISO 639-3 code: hmn
alternative label: Hmong
in scheme: Lexvo - ISO 639-3 language codes
notation: hmn
preferred label: Miao-Sprache @de
preferred label: hmong @es

Hiri Motu
type: Language
type: Concept
ISO 639-1 code: ho
ISO 639-2 Bibliographical code: hmo
ISO 639-2 Terminological code: hmo
ISO 639-3 code: hmo
alternative label: Hiri Motu language
preferred label: Hiri motu @es
alternative label: Lingua hiri motu @it
preferred label: hiri motu @fr
definition: Hiri Motu, (also known as Police Motu or Pidgin Motu) is an official language of Papua New Guinea. It is a simplified version of Motu and although it is strictly neither a pidgin nor a creole it possesses some features of both language types. Phonological and grammatical differences mean not only that Hiri Motu speakers cannot understand Motu, but also that Motu speakers not exposed to Hiri Motu have similar difficulties, though the languages are lexically very similar, and retain a common Austronesian syntactical basis.
in scheme: Lexvo - ISO 639-3 language codes
notation: hmo
preferred label: Hiri-Motu @de

Northern Mashan Miao
type: Language
type: Concept
ISO 639-3 code: hmp
alternative label: Hmong, Northern Mashan
alternative label: Miao, Northern Mashan
alternative label: Northern Mashan Hmong
in scheme: Lexvo - ISO 639-3 language codes
notation: hmp

Eastern Qiandong Miao
type: Language
type: Concept
ISO 639-3 code: hmq
alternative label: Miao, Eastern Qiandong
in scheme: Lexvo - ISO 639-3 language codes
notation: hmq

Hmar
type: Language
type: Concept
ISO 639-3 code: hmr
alternative label: Hmar language
definition: The Hmar language belongs to the Kukish branch of the Tibeto-Burman family of languages. The speakers of the language are also known as Hmar.
in scheme: Lexvo - ISO 639-3 language codes
notation: hmr

Moroccan Sign Language
type: Language
type: Concept
ISO 639-3 code: xms
in scheme: Lexvo - ISO 639-3 language codes
notation: xms

Southern Qiandong Miao
type: Language
type: Concept
ISO 639-3 code: hms
alternative label: Miao, Southern Qiandong
in scheme: Lexvo - ISO 639-3 language codes
notation: hms

Hamtai
type: Language
type: Concept
ISO 639-3 code: hmt
alternative label: Hamtai language
definition: Hamtai (Hamday) is the most populous of the Angan languages of Papua New Guinea. It is also known as Kamea (in Gulf Province), Kapau, and Watut. Dialects are Wenta, Howi, Pmasa’a, Hamtai proper, Kaintiba.
in scheme: Lexvo - ISO 639-3 language codes
notation: hmt

Hamap
type: Language
type: Concept
ISO 639-3 code: hmu
in scheme: Lexvo - ISO 639-3 language codes
notation: hmu

Hmong Dô
type: Language
type: Concept
ISO 639-3 code: hmv
in scheme: Lexvo - ISO 639-3 language codes
notation: hmv

Western Mashan Miao
type: Language
type: Concept
ISO 639-3 code: hmw
alternative label: Hmong, Western Mashan
alternative label: Miao, Western Mashan
alternative label: Western Mashan Hmong
in scheme: Lexvo - ISO 639-3 language codes
notation: hmw

Southern Guiyang Miao
type: Language
type: Concept
ISO 639-3 code: hmy
alternative label: Hmong, Southern Guiyang
alternative label: Miao, Southern Guiyang
alternative label: Southern Guiyang Hmong
in scheme: Lexvo - ISO 639-3 language codes
notation: hmy

Hmong Shua
type: Language
type: Concept
ISO 639-3 code: hmz
alternative label: Miao, Sinicized
alternative label: Sinicized Miao
in scheme: Lexvo - ISO 639-3 language codes
notation: hmz

Matbat
type: Language
type: Concept
ISO 639-3 code: xmt
in scheme: Lexvo - ISO 639-3 language codes
notation: xmt

Mina
type: Language
type: Concept
ISO 639-3 code: hna
alternative label: Mina (Cameroon)
alternative label: Mina language
definition: The Mina language is spoken in Northern Cameroon. Another language of the same name is found in India. They are distinguished in ISO 639-3 by referring to this language as and to the other as
in scheme: Lexvo - ISO 639-3 language codes
notation: hna

Southern Hindko
type: Language
type: Concept
ISO 639-3 code: hnd
alternative label: Hindko, Southern
in scheme: Lexvo - ISO 639-3 language codes
notation: hnd

Chhattisgarhi
type: Language
type: Concept
ISO 639-3 code: hne
alternative label: Chhattisgarhi language
definition: Chhattisgarhi (Devanagari: छत्तीसगढ़ी) is the official language in the Indian state of Chhattisgarh and has approximately 17.5 million speakers. It is an East Central Indo-Iranian language with heavy presence of vocabulary and linguistic features from Munda and Dravidian languages. Chhattisgarhi has been known by name Khaltahi to surrounding hill-people and by name Laria to Sambalpuri and Oriya speakers.
in scheme: Lexvo - ISO 639-3 language codes
notation: hne
preferred label: Idioma chatisgarí @es

//Ani
type: Language
type: Concept
ISO 639-3 code: hnh
in scheme: Lexvo - ISO 639-3 language codes
notation: hnh

Hani
type: Language
type: Concept
ISO 639-3 code: hni
in scheme: Lexvo - ISO 639-3 language codes
notation: hni

Mong Njua
type: Language
type: Concept
ISO 639-3 code: hnj
alternative label: Hmong Njua
alternative label: Mong Leng
in scheme: Lexvo - ISO 639-3 language codes
notation: hnj

Hanunoo
type: Language
type: Concept
ISO 639-3 code: hnn
alternative label: Hanunó'o language
definition: The Hanunó'o language is a language spoken by Mangyans in the province of Mindoro in the Philippines.
in scheme: Lexvo - ISO 639-3 language codes
notation: hnn
preferred label: Hanunó'o @de

Kamu
type: Language
type: Concept
ISO 639-3 code: xmu
alternative label: Kamu language
definition: The Kamu language, or Gamor, is an extinct indigenous Australian language spoken in Northern Territory, Australia. There were two speakers in 1967.
in scheme: Lexvo - ISO 639-3 language codes
notation: xmu

Northern Hindko
type: Language
type: Concept
ISO 639-3 code: hno
alternative label: Hindko, Northern
in scheme: Lexvo - ISO 639-3 language codes
notation: hno

Caribbean Hindustani
type: Language
type: Concept
ISO 639-3 code: hns
alternative label: Hindustani, Caribbean
definition: Caribbean Hindustani is a dialect of Bhojpuri spoken in Suriname, Guyana, and Trinidad and Tobago. These three countries put an adjective before the name of the language, so that the local language variant is known for instance as "Sarnami Hindoestani" in Suriname. Most people still call the language "Hindustani".
in scheme: Lexvo - ISO 639-3 language codes
notation: hns

Hung
type: Language
type: Concept
ISO 639-3 code: hnu
in scheme: Lexvo - ISO 639-3 language codes
notation: hnu

Hoava
type: Language
type: Concept
ISO 639-3 code: hoa
alternative label: Hoava language
definition: Hoava is an Oceanic language spoken by about 1000-1500 people on New Georgia Island, Solomon Islands. Speakers of Hoava are multilingual and usually also speak Roviana, Marovo, SI Pijin, English.
in scheme: Lexvo - ISO 639-3 language codes
notation: hoa

Mari
type: Language
type: Concept
ISO 639-3 code: hob
alternative label: Mari (Madang Province)
in scheme: Lexvo - ISO 639-3 language codes
notation: hob

Ho
type: Language
type: Concept
ISO 639-3 code: hoc
alternative label: Ho language
definition: Ho (also known as Bihar Ho and Lanka Kol) is a Munda language of the Austroasiatic language family spoken primarily in India by about 3,803,126 people. It is written with the Devanagari and the Varang Kshiti scripts. It is spoken by the Ho people. 0.103% of India's Population speaks this language as per the 2001 census. The Script was founded and developed by pandit Dr. Lako Bodra.
in scheme: Lexvo - ISO 639-3 language codes
notation: hoc
preferred label: Língua ho @pt

Holma
type: Language
type: Concept
ISO 639-3 code: hod
alternative label: Holma language
definition: Holma (also known as Da Holmaci, Bali Holma) is an extinct Afro-Asiatic language formerly spoken in Nigeria in Adamawa State. Speakers switched to Fulfulde.
in scheme: Lexvo - ISO 639-3 language codes
notation: hod

Horom
type: Language
type: Concept
ISO 639-3 code: hoe
in scheme: Lexvo - ISO 639-3 language codes
notation: hoe

Hobyót
type: Language
type: Concept
ISO 639-3 code: hoh
alternative label: Hobyót language
definition: Hobyót (also known as Hewbyót or Hobi) is an endangered Semitic language spoken in a small area of Oman and neighboring Yemen.
in scheme: Lexvo - ISO 639-3 language codes
notation: hoh

Holikachuk
type: Language
type: Concept
ISO 639-3 code: hoi
alternative label: Holikachuk language
definition: Holikachuk is a highly endangered Athabaskan language formerly spoken at the village of Holikachuk (Hiyeghelinhdi) on the Innoko River in central Alaska. In 1962 residents of Holikachuk relocated to Grayling on the lower Yukon River. Holikachuk is intermediate between the Deg Xinag and Koyukon languages, linguistically closer to Koyukon but socially much closer to Deg Xinag. Though it was recognized by scholars as a distinct language as early as the 1840s, it was only definitively identified in the 1970s. Of about 180 Holikachuk people, only about 5 spoke the language in 2007.
in scheme: Lexvo - ISO 639-3 language codes
notation: hoi
preferred label: Língua holikachuk @pt

Haroti
type: Language
type: Concept
ISO 639-3 code: hoj
alternative label: Hadothi
alternative label: Harauti language
definition: The Harauti language is a dialect of Rajasthani language of Indo-Aryan language family. It is spoken in historical Hadoti region: Kota, Baran, Bundi and Jhalawar districts of Rajasthan and its adjacent areas of Madhya Pradesh.
in scheme: Lexvo - ISO 639-3 language codes
notation: hoj

Tankarana Malagasy
type: Language
type: Concept
ISO 639-3 code: xmv
alternative label: Antankarana Malagasy
alternative label: Malagasy, Antankarana
alternative label: Malagasy, Tankarana
in scheme: Lexvo - ISO 639-3 language codes
notation: xmv

Holu
type: Language
type: Concept
ISO 639-3 code: hol
in scheme: Lexvo - ISO 639-3 language codes
notation: hol

Homa
type: Language
type: Concept
ISO 639-3 code: hom
alternative label: Homa language
definition: Homa is an extinct South Sudanese Bantu language of uncertain affiliation. It has been included in the Boan languages.
in scheme: Lexvo - ISO 639-3 language codes
notation: hom

Holoholo
type: Language
type: Concept
ISO 639-3 code: hoo
alternative label: Holoholo language
definition: Holoholo is a Bantu language of DR Congo and formerly in Tanzania spoken by the Holoholo people. Classification is uncertain, but it may belong with the Takama group (Nurse 2003:169).
in scheme: Lexvo - ISO 639-3 language codes
notation: hoo

Hopi
type: Language
type: Concept
ISO 639-3 code: hop
alternative label: Hopi language
definition: Hopi is a Uto-Aztecan language spoken by the Hopi people (a Pueblo group) of northeastern Arizona, USA, although today some Hopi are monolingual English speakers.
in scheme: Lexvo - ISO 639-3 language codes
notation: hop
preferred label: Idioma hopi @es
preferred label: Lingua hopi @it
preferred label: Língua hopi @pt

Horo
type: Language
type: Concept
ISO 639-3 code: hor
in scheme: Lexvo - ISO 639-3 language codes
notation: hor

Ho Chi Minh City Sign Language
type: Language
type: Concept
ISO 639-3 code: hos
in scheme: Lexvo - ISO 639-3 language codes
notation: hos

Hote
type: Language
type: Concept
ISO 639-3 code: hot
alternative label: Malê
in scheme: Lexvo - ISO 639-3 language codes
notation: hot

Hovongan
type: Language
type: Concept
ISO 639-3 code: hov
in scheme: Lexvo - ISO 639-3 language codes
notation: hov

Honi
type: Language
type: Concept
ISO 639-3 code: how
in scheme: Lexvo - ISO 639-3 language codes
notation: how

Holiya
type: Language
type: Concept
ISO 639-3 code: hoy
in scheme: Lexvo - ISO 639-3 language codes
notation: hoy

Tsimihety Malagasy
type: Language
type: Concept
ISO 639-3 code: xmw
alternative label: Malagasy, Tsimihety
in scheme: Lexvo - ISO 639-3 language codes
notation: xmw

Hozo
type: Language
type: Concept
ISO 639-3 code: hoz
alternative label: Hozo language
definition: Hozo is an Afroasiatic language spoken mostly in the Kondala woreda of Mirab Welega Zone (Western Oromia) by peoples generically known as "Mao". There are smaller groups of Hozo speakers in Mana Sibu woreda. The term Hozo is usually understood by the Mao to refer to a clan. Hozo speakers prefer to call themselves Amo. Hozo and Seze are sometimes called Begi Mao.
in scheme: Lexvo - ISO 639-3 language codes
notation: hoz

Hpon
type: Language
type: Concept
ISO 639-3 code: hpo
in scheme: Lexvo - ISO 639-3 language codes
notation: hpo

Hawaii Pidgin Sign Language
type: Language
type: Concept
ISO 639-3 code: hps
alternative label: Hawai'i Pidgin Sign Language
definition: Hawaii Pidgin Sign Language is a sign language used in Hawaii. Now largely supplanted by American Sign Language, it is almost extinct and is used only by a few elderly people, who are bilingual in ASL. The language is named for the Hawaii Pidgin spoken language and is not itself a pidgin.
in scheme: Lexvo - ISO 639-3 language codes
notation: hps
preferred label: Língua de Sinais Havaiana @pt

Hrangkhol
type: Language
type: Concept
ISO 639-3 code: hra
alternative label: Hrangkhol language
definition: Hrangkhol or Rangkhawl is a Kukish language spoken by the Hrangkhawl people.
in scheme: Lexvo - ISO 639-3 language codes
notation: hra

Niwer Mil
type: Language
type: Concept
in scheme: Lexvo - ISO 639-3 language codes

Hre
type: Language
type: Concept
ISO 639-3 code: hre
in scheme: Lexvo - ISO 639-3 language codes
notation: hre

Haruku
type: Language
type: Concept
ISO 639-3 code: hrk
in scheme: Lexvo - ISO 639-3 language codes
notation: hrk

Horned Miao
type: Language
type: Concept
ISO 639-3 code: hrm
alternative label: Miao, Horned
in scheme: Lexvo - ISO 639-3 language codes
notation: hrm

Maden
type: Language
type: Concept
ISO 639-3 code: xmx
in scheme: Lexvo - ISO 639-3 language codes
notation: xmx

Haroi
type: Language
type: Concept
ISO 639-3 code: hro
in scheme: Lexvo - ISO 639-3 language codes
notation: hro

Nhirrpi
type: Language
type: Concept
in scheme: Lexvo - ISO 639-3 language codes

Hértevin
type: Language
type: Concept
ISO 639-3 code: hrt
in scheme: Lexvo - ISO 639-3 language codes
notation: hrt

Hruso
type: Language
type: Concept
ISO 639-3 code: hru
alternative label: Hruso language
definition: Hruso, also Aka or Angka, is a small Tibeto-Burman language of India. Levai has traditionally been considered a dialect, but may be a separate language.
in scheme: Lexvo - ISO 639-3 language codes
notation: hru

Croatian
type: Language
type: Concept
ISO 639-1 code: hr
ISO 639-2 Bibliographical code: hrv
ISO 639-2 Terminological code: hrv
ISO 639-3 code: hrv
alternative label: Croatian language
alternative label: Idioma croata @es
alternative label: Kroatische Sprache @de
alternative label: Lingua croata @it
alternative label: Língua croata @pt
alternative label: croate @fr
definition: Croatian is the collective name for varieties of the Serbo-Croatian language spoken by Croats, principally in Croatia, Bosnia and Herzegovina, the Serbian province of Vojvodina and other neighbouring countries.
in scheme: Lexvo - ISO 639-3 language codes
notation: hrv
preferred label: Croate @fr
preferred label: Kroatisch @de
preferred label: croata @es
preferred label: croato @it

Warwar Feni
type: Language
type: Concept
in scheme: Lexvo - ISO 639-3 language codes

Hunsrik
type: Language
type: Concept
ISO 639-3 code: hrx
preferred label: Riograndenser Hunsrückisch
definition: Riograndenser Hunsrückisch (, ), spoken in parts of Brazil, is a Brazilian West Germanic language derived primarily from the Hunsrückisch dialect of the German Language.
in scheme: Lexvo - ISO 639-3 language codes
notation: hrx

Mayaguduna
type: Language
type: Concept
ISO 639-3 code: xmy
in scheme: Lexvo - ISO 639-3 language codes
notation: xmy

Harzani
type: Language
type: Concept
ISO 639-3 code: hrz
in scheme: Lexvo - ISO 639-3 language codes
notation: hrz

Upper Sorbian
type: Language
type: Concept
ISO 639-2 Bibliographical code: hsb
ISO 639-2 Terminological code: hsb
ISO 639-3 code: hsb
alternative label: Haut-sorabe @fr
alternative label: Lingua lusaziana superiore @it
alternative label: Obersorbische Sprache @de
alternative label: Sorbian, Upper
alternative label: Upper Sorbian language
alternative label: sorbiano superior @pt
alternative label: sorbio superior @es
alternative label: sorábio superior @pt
definition: Upper Sorbian is a minority language spoken by Sorbs in Germany in the historical province of Upper Lusatia (Hornja Łužica in Sorbian), which is today part of Saxony. It is grouped in the West Slavic language branch, together with Lower Sorbian, Czech, Polish, Slovak and Kashubian.
in scheme: Lexvo - ISO 639-3 language codes
notation: hsb
preferred label: Alto sorabo @es
preferred label: Alto sorábio @pt
preferred label: Obersorbisch @de
preferred label: alto sorabo @it
preferred label: haut-sorabe @fr

Hungarian Sign Language
type: Language
type: Concept
ISO 639-3 code: hsh
definition: Hungarian Sign Language is the sign language of Deaf people in Hungary. There is historical evidence that Hungarian and Austrian Sign Language are related, but there is no linguistic research and proof for the matter, yet.
in scheme: Lexvo - ISO 639-3 language codes
notation: hsh

Hausa Sign Language
type: Language
type: Concept
ISO 639-3 code: hsl
definition: Hausa Sign Language is the sign language of the Deaf community in Hausa-speaking areas of Northern Nigeria.
in scheme: Lexvo - ISO 639-3 language codes
notation: hsl
preferred label: Língua Gestual Hausa @pt

Xiang Chinese
type: Language
type: Concept
ISO 639-3 code: hsn
alternative label: Chinese, Xiang
definition: Xiāng (Hsiang, ), also known as Hunanese , is a Chinese language spoken mainly in Hunan province, but also in Sichuan and Guangxi provinces. Scholars divide it into Old Xiāng and New Xiāng. Old Xiāng dialects are of immense interest to Chinese dialectologists and historical phonologists because they, along with dialects of Wu Chinese, still exhibit the three-way distinction of Middle Chinese obstruents, preserving the voiced stops, fricatives and affricates. However, Xiāng has been heavily influenced by Mandarin, which adjoins three of the four sides of the Xiāng speaking territory. New Xiāng, which has lost the voiced obstruents, is to a certain extent intelligible to speakers of Southwestern Mandarin.
in scheme: Lexvo - ISO 639-3 language codes
notation: hsn
preferred label: Chino xiang @es
preferred label: Lingua xiang @it
preferred label: Xiang @de

Harsusi
type: Language
type: Concept
ISO 639-3 code: hss
alternative label: Harsusi language
definition: Harsusi (also known as Hersyet, Harsi `Aforit) is a Semitic language closely related to Mehri. It is spoken by 1,000 to 2,000 Harasis in Jiddat al-Harasis, Dhofar Province, Oman. Reportedly, the Harasis are increasing their use of the more dominant Mehri and are bilingual in Arabic.
in scheme: Lexvo - ISO 639-3 language codes
notation: hss

Zoogocho Zapotec
type: Language
type: Concept
ISO 639-3 code: zpq
alternative label: Zapotec, Zoogocho
in scheme: Lexvo - ISO 639-3 language codes
notation: zpq

Hoti
type: Language
type: Concept
ISO 639-3 code: hti
in scheme: Lexvo - ISO 639-3 language codes
notation: hti

Mori Bawah
type: Language
type: Concept
ISO 639-3 code: xmz
in scheme: Lexvo - ISO 639-3 language codes
notation: xmz

Minica Huitoto
type: Language
type: Concept
ISO 639-3 code: hto
alternative label: Huitoto, Minica
definition: Minica Huitoto (mee-nee-kah wee-toh-toh) is one of three indigenous American Huitoto languages of the Witotoan family spoken by a few thousand speakers in western South America.
in scheme: Lexvo - ISO 639-3 language codes
notation: hto
preferred label: Idioma meneca @es
preferred label: Witoto minica @fr

Hadza
type: Language
type: Concept
ISO 639-3 code: hts
alternative label: Hadza language
definition: Hadza is a language isolate spoken by fewer than a thousand Hadza people along the shores of Lake Eyasi in Tanzania, the last full-time hunter-gatherers in Africa. Despite the small number of speakers, language use is vigorous, with most children learning it. Hadza has traditionally been grouped with Khoisan, largely on the basis of its use of clicks, but this classification is no longer generally accepted.
in scheme: Lexvo - ISO 639-3 language codes
notation: hts
preferred label: Idioma hadza @es
preferred label: Lingua hadza @it
preferred label: Língua hadza @pt

Hitu
type: Language
type: Concept
ISO 639-3 code: htu
in scheme: Lexvo - ISO 639-3 language codes
notation: htu

Middle Hittite
type: Language
type: Concept
ISO 639-3 code: htx
alternative label: Hittite, Middle
in scheme: Lexvo - ISO 639-3 language codes
notation: htx

Huambisa
type: Language
type: Concept
ISO 639-3 code: hub
alternative label: Huambisa language
definition: Huambisa, Huambiza, or Wambisa is the language of the native Huambisas of Perú. It is closely related to the Close to the Achuar-Shiwiar and Aguaruna languages. It has official standing in the area it is spoken.
in scheme: Lexvo - ISO 639-3 language codes
notation: hub

=/Hua
type: Language
type: Concept
ISO 639-3 code: huc
in scheme: Lexvo - ISO 639-3 language codes
notation: huc

Huaulu
type: Language
type: Concept
ISO 639-3 code: hud
in scheme: Lexvo - ISO 639-3 language codes
notation: hud

Ancient North Arabian
type: Language
type: Concept
ISO 639-3 code: xna
alternative label: North Arabian, Ancient
definition: Ancient North Arabian is a language known from fragmentary inscriptions in modern day Iraq, Jordan, Syria and Saudi Arabia, dating to between roughly the 6th century BC and the 6th century AD, all written in scripts derived from Epigraphic South Arabian. Pre-classical Arabic (or Old Arabic), the predecessor of Classical Arabic, seems to have coexisted with these languages in central and north Arabia. However, it remained spoken until it was first attested in an inscription in Qaryat Al-Faw (Qaryat Dhat Kahil) in the 1st century BC.
in scheme: Lexvo - ISO 639-3 language codes
notation: xna
preferred label: Frühnordarabische Sprache @de

San Francisco Del Mar Huave
type: Language
type: Concept
ISO 639-3 code: hue
alternative label: Huave, San Francisco Del Mar
in scheme: Lexvo - ISO 639-3 language codes
notation: hue

Humene
type: Language
type: Concept
ISO 639-3 code: huf
in scheme: Lexvo - ISO 639-3 language codes
notation: huf

Huachipaeri
type: Language
type: Concept
ISO 639-3 code: hug
alternative label: Huachipaeri language
definition: Huachipaeri is a native language official in the area of its use in Perú. It is also known as Huachipaire, Wacipaire, and the derogatory: "Mashco".
in scheme: Lexvo - ISO 639-3 language codes
notation: hug

Chesungun
type: Language
type: Concept
ISO 639-3 code: huh
alternative label: Huilliche language
definition: The Huilliche language (also known as Veliche and Huiliche) is an Araucanian language spoken (as of 1982) by about 2,000 ethnic Huilliche people in Chile. It is spoken in an area south of the area inhabited by the Mapuche, in the nation's Los Lagos and Los Ríos regions; and mountain valleys, between the city of Valdivia and south toward Chiloé Archipelago. Huilliche has a dialect called Tsesungún.
in scheme: Lexvo - ISO 639-3 language codes
notation: huh
preferred label: Huilliche
preferred label: Idioma huilliche @pt

Huli
type: Language
type: Concept
ISO 639-3 code: hui
alternative label: Huli language
definition: Huli is a Trans–New Guinea language spoken by the Huli people of the Southern Highlands province of Papua New Guinea. It features a quindecimal (base-15) numeral system.
in scheme: Lexvo - ISO 639-3 language codes
notation: hui

Northern Guiyang Miao
type: Language
type: Concept
ISO 639-3 code: huj
alternative label: Hmong, Northern Guiyang
alternative label: Miao, Northern Guiyang
alternative label: Northern Guiyang Hmong
in scheme: Lexvo - ISO 639-3 language codes
notation: huj

Hulung
type: Language
type: Concept
ISO 639-3 code: huk
in scheme: Lexvo - ISO 639-3 language codes
notation: huk

Hula
type: Language
type: Concept
ISO 639-3 code: hul
in scheme: Lexvo - ISO 639-3 language codes
notation: hul

Hungana
type: Language
type: Concept
ISO 639-3 code: hum
alternative label: Hungana language
definition: Hungana is an endangered Bantu language of the Democratic Republic of the Congo.
in scheme: Lexvo - ISO 639-3 language codes
notation: hum

Hungarian
type: Language
type: Concept
ISO 639-1 code: hu
ISO 639-2 Bibliographical code: hun
ISO 639-2 Terminological code: hun
ISO 639-3 code: hun
alternative label: Hongrois @fr
alternative label: Hungarian language
alternative label: Idioma húngaro @es
alternative label: Lingua ungherese @it
alternative label: Língua húngara @pt
alternative label: Ungarische Sprache @de
definition: Hungarian ( ) is a Uralic language, part of the Ugric group, spoken by the Hungarians. It is the most widely spoken non-Indo-European language in Europe, according to the number of native speakers. Hungarian is the official language of Hungary and is also spoken by Hungarian communities in the seven neighboring countries and by diaspora communities worldwide.
in scheme: Lexvo - ISO 639-3 language codes
notation: hun
preferred label: Ungarisch @de
preferred label: hongrois @fr
preferred label: húngaro @es
preferred label: ungherese @it

Hu
type: Language
type: Concept
ISO 639-3 code: huo
in scheme: Lexvo - ISO 639-3 language codes
notation: huo

Hupa
type: Language
type: Concept
ISO 639-2 Bibliographical code: hup
ISO 639-2 Terminological code: hup
ISO 639-3 code: hup
alternative label: Hupa language
preferred label: hupa @es
definition: Hupa (native name: Na:tinixwe Mixine:whe') is an Athabaskan language (of Na-Dené stock) spoken in the Trinity valley in California by the Hupa (Natinixwe).
in scheme: Lexvo - ISO 639-3 language codes
notation: hup

Kanakanabu
type: Language
type: Concept
ISO 639-3 code: xnb
alternative label: Kanakanabu language
definition: Kanakanabu (also spelled Kanakanavu) is a Southern Tsouic language is spoken by the Kanakanabu, an indigenous people of Taiwan (see Taiwanese aborigines). It is a Formosan language of the Austronesian family.
in scheme: Lexvo - ISO 639-3 language codes
notation: xnb

Tsat
type: Language
type: Concept
ISO 639-3 code: huq
alternative label: Tsat language
definition: Tsat (also known as Utsat, Utset, Huihui, Hui, or Hainan Cham, Chinese: 回辉语/回輝語 Huíhuīyǔ) is a language spoken near Sanya, Hainan, China by the Utsuls. Tsat is a member of the Malayo-Polynesian group within the Austronesian language family, and is related to the Cham languages, originally from the coast of present-day Vietnam. Today, the language is spoken by 4,500 people in Yanglan (羊栏) and Huixin (回新), two villages on the outskirts of Sanya, Hainan.
in scheme: Lexvo - ISO 639-3 language codes
notation: huq

Halkomelem
type: Language
type: Concept
ISO 639-3 code: hur
alternative label: Halkomelem language
definition: Halkomelem (also Halqeméylem in the Upriver dialect, Hulqumínum in the Island dialect, and Hunquminum in the Downriver dialect) is a language of the First Nations peoples of southeastern Vancouver Island from the west shore of Saanich Inlet northward beyond Nanoose Bay, and of the mainland around the Fraser River Delta upriver to Harrison Lake and the lower boundary of Fraser Canyon in British Columbia. In the classification of Salishan languages, Halkomelem is a member of the Central Salish branch. There are four other branches of the family: Tsamosan, Interior Salish, Bella Coola, and Tillamook. Speakers of the Central and Tsamosan languages are often identified in ethnographic literature as "Coast Salish."
in scheme: Lexvo - ISO 639-3 language codes
notation: hur

Huastec
type: Language
type: Concept
ISO 639-3 code: hus
alternative label: Huastec language
definition: The Wastek (Huastec) language is a Mayan language of Mexico, spoken by the Huastecs living in rural areas of San Luis Potosí and northern Veracruz. Though relatively isolated from them, it is related to the Mayan languages spoken further south and east in Mexico and Central America. According to the 2005 population census, there were about 150,000 speakers of Wastek in Mexico (some 90,000 in San Luis Potosi and some 50,000 in Veracruz). The language is called Teenek (with varying spellings) by its speakers, and this name has gained currency in Mexican national and international usage in recent years.
in scheme: Lexvo - ISO 639-3 language codes
notation: hus
preferred label: Huastekisch @de
preferred label: Huastèque @fr
preferred label: Idioma huasteco @es

Humla
type: Language
type: Concept
ISO 639-3 code: hut
in scheme: Lexvo - ISO 639-3 language codes
notation: hut

Murui Huitoto
type: Language
type: Concept
ISO 639-3 code: huu
alternative label: Huitoto, Murui
alternative label: Murui Huitoto language
definition: Murui Huitoto - or simply Murui (also known as Bue and Witoto) is an indigenous American Huitoto language of the Witotoan family spoken by 2,900 of indigenous people in western South America alongside the Ampiyacu, Putumayo, and Napo rivers.
in scheme: Lexvo - ISO 639-3 language codes
notation: huu
preferred label: Língua murui huitoto @pt
preferred label: Witoto murui @fr

San Mateo Del Mar Huave
type: Language
type: Concept
ISO 639-3 code: huv
alternative label: Huave, San Mateo Del Mar
in scheme: Lexvo - ISO 639-3 language codes
notation: huv

Hukumina
type: Language
type: Concept
ISO 639-3 code: huw
in scheme: Lexvo - ISO 639-3 language codes
notation: huw

Nüpode Huitoto
type: Language
type: Concept
ISO 639-3 code: hux
alternative label: Huitoto, Nüpode
alternative label: Nüpode Huitoto language
definition: Nüpode Huitoto or Nɨpode is an indigenous American language spoken in western South America. It has occasionally been referred to as Muinane Witoto, not to be confused with the related Muinane language.
in scheme: Lexvo - ISO 639-3 language codes
notation: hux
preferred label: Witoto nipode @fr

Hulaulá
type: Language
type: Concept
ISO 639-3 code: huy
alternative label: Hulaulá language
definition: Hulaulá is a modern Jewish Aramaic language, often called Neo-Aramaic or Judeo-Aramaic. It was originally spoken in Iranian Kurdistan. Most speakers now live in Israel. The name Hulaulá simply means Jewish. Speakers sometimes call their language Lishana Noshan or Lishana Akhni, both of which mean our language. To distinguish it from other dialects of Jewish Neo-Aramaic, Hulaulá is sometimes called Galiglu (mine-yours), demonstrating different use of prepositions and pronominal suffixes. Scholarly sources tend simply to call it Persian Kurdistani Jewish Neo-Aramaic.
in scheme: Lexvo - ISO 639-3 language codes
notation: huy

Hunzib
type: Language
type: Concept
ISO 639-3 code: huz
alternative label: Hunzib language
definition: Hunzib is a Northeast Caucasian language spoken by about 1840 people in southern Dagestan, Other Tsezic languages include Tsez and Hinukh. Khwarshi was previously grouped together with Tsez and Hinukh instead of with Hunzib.
in scheme: Lexvo - ISO 639-3 language codes
notation: huz
preferred label: Língua hunzib @pt

Haitian Vodoun Culture Language
type: Language
type: Concept
ISO 639-3 code: hvc
definition: Haitian Vodoun Culture Language is an unclassified language used in Haiti. It is also known as Langay and Langaj (meaning literally "language"). This language is used for religion, song, and dance purposes (it is used as a second language only). In addition to borrowings from Haitian Creole French, French, Wolof and other languages, it may also have loanwords from Amerindian languages.
in scheme: Lexvo - ISO 639-3 language codes
notation: hvc

San Dionisio Del Mar Huave
type: Language
type: Concept
ISO 639-3 code: hve
alternative label: Huave, San Dionisio Del Mar
in scheme: Lexvo - ISO 639-3 language codes
notation: hve

Middle Mongolian
type: Language
type: Concept
ISO 639-3 code: xng
alternative label: Middle Mongolian language
alternative label: Mongolian, Middle
definition: Middle Mongolian is an ancient Mongolic language formerly spoken in the Mongol Empire and later on in Greater Mongolia during the 13th to at least the early 15th century.
in scheme: Lexvo - ISO 639-3 language codes
notation: xng

Haveke
type: Language
type: Concept
ISO 639-3 code: hvk
in scheme: Lexvo - ISO 639-3 language codes
notation: hvk

Sabu
type: Language
type: Concept
ISO 639-3 code: hvn
alternative label: Hawu language
definition: The Hawu Havu language, historically Sawu and known to outsiders as Savu or Sabu (thus Havunese, Savunese, Sawunese), is the language of Savu Island in Indonesia and of Raijua Island off the western tip of Savu. Traditionally classified as a Sumba language in the Austronesian family, it may actually be a non-Austronesian (Papuan) language. (See Savu languages for details.) Dhao, once considered a dialect, is not mutually intelligible with Hawu.
in scheme: Lexvo - ISO 639-3 language codes
notation: hvn

Santa María Del Mar Huave
type: Language
type: Concept
ISO 639-3 code: hvv
alternative label: Huave, Santa María Del Mar
in scheme: Lexvo - ISO 639-3 language codes
notation: hvv

Wané
type: Language
type: Concept
ISO 639-3 code: hwa
alternative label: Wané language
definition: Wané (Hwané, Ngwané) is a minor Kru language of Ivory Coast. Its is not close enough to its nearest relative, Bakwé, to be readily intelligible, though some young Wané speak that language.
in scheme: Lexvo - ISO 639-3 language codes
notation: hwa

Hawai'i Pidgin
type: Language
type: Concept
ISO 639-3 code: hwc
alternative label: Creole English, Hawai'i
alternative label: Hawai'i Creole English
alternative label: Hawaiian Pidgin
definition: Hawaii Pidgin English, Hawaii Creole English, HCE, or simply Pidgin, is a creole language based in part on English used by many "local" residents of Hawaii. Although English and Hawaiian are the co-official languages of the state of Hawaii, Pidgin is used by many Hawaii residents in everyday conversation and is often used in advertising toward Hawaii residents. The new ISO 639-3 language code for Hawaii Pidgin (Hawaii Creole English) is hwc. In the Hawaiian language, "Hawaiian Creole English" is called "ōlelo pai ai," which literally means "pounding-taro language."
in scheme: Lexvo - ISO 639-3 language codes
notation: hwc
preferred label: Créole hawaïen @fr
preferred label: Hawaii Creole English @de
preferred label: Pidgin hawaiano @es

Hwana
type: Language
type: Concept
ISO 639-3 code: hwo
alternative label: Hwana language
definition: Hwana (also known as Hwona, Hona, Tuftera, Fiterya) is an Afro-Asiatic language spoken in Adamawa State, Nigeria.
in scheme: Lexvo - ISO 639-3 language codes
notation: hwo
preferred label: Idioma hwana @es
preferred label: Língua hwana @pt

Hya
type: Language
type: Concept
ISO 639-3 code: hya
alternative label: Hya language
definition: Hya is an Afro-Asiatic language spoken in northern Cameroon and neighboring regions of Nigeria.
in scheme: Lexvo - ISO 639-3 language codes
notation: hya

Armenian
type: Language
type: Concept
ISO 639-1 code: hy
ISO 639-2 Bibliographical code: arm
ISO 639-2 Terminological code: hye
ISO 639-3 code: hye
alternative label: arménio @pt
in scheme: Lexvo - ISO 639-3 language codes
notation: hye
preferred label: Armenisch @de
preferred label: armenio @es
preferred label: armeno @it
preferred label: arménien @fr
preferred label: armênio @pt

Iaai
type: Language
type: Concept
ISO 639-3 code: iai
alternative label: Iaai language
definition: The Iaai language (pronounced ) is a language of Ouvéa Island, New Caledonia. Although it had only 1,500 speakers as of 1996, it is becoming taught in schools in New Caledonia in an effort to preserve it.
in scheme: Lexvo - ISO 639-3 language codes
notation: iai

Iatmul
type: Language
type: Concept
ISO 639-3 code: ian
alternative label: Iatmül language
definition: Iatmül is perhaps the best known of the Ndu languages of Sepik River region of northern Papua New Guinea.
in scheme: Lexvo - ISO 639-3 language codes
notation: ian

Iapama
type: Language
type: Concept
ISO 639-3 code: iap
alternative label: Iapama language
definition: Iapama is the presumed language of an uncontacted people of Brazil. It is not known if they speak a distinct language.
in scheme: Lexvo - ISO 639-3 language codes
notation: iap

Purari
type: Language
type: Concept
ISO 639-3 code: iar
alternative label: Purari language
definition: Purari is a Papuan language of Papua New Guinea. It is also known as Koriki, Evorra, Iai,Maipua and Namau. Namau is a colonial term which means "deaf (lit.), inattentive, or stupid (Williams 1924: 4)." Today people of the Purari Delta find this term offensive. F.E. Williams reports that the "[a]n interpreter suggests that by some misunderstanding the name had its origin in the despair of an early missionary, who, finding the natives turned a deaf ear to his teaching, dubbed them all Namau." (Williams 1924: 4). Koriki, Iai, and Maipua refer to self-defining groups that make up the six groups that today compose the people who speak Purari. Along with the Baroi (formerly known as the Evorra, which was the name of a village site), Kaimari and the Vaimuru, these groups speak mutually intelligible dialects of Purari.
in scheme: Lexvo - ISO 639-3 language codes
notation: iar

Kuanhua
type: Language
type: Concept
ISO 639-3 code: xnh
in scheme: Lexvo - ISO 639-3 language codes
notation: xnh

Iban
type: Language
type: Concept
ISO 639-2 Bibliographical code: iba
ISO 639-2 Terminological code: iba
ISO 639-3 code: iba
alternative label: Iban language
alternative label: Língua iban @pt
preferred label: iban @es
definition: The Iban language (jaku Iban) is spoken by the Iban, a branch of the Dayak ethnic group formerly known as "Sea Dayak" who live in Sarawak, the Indonesian province of Kalimantan Barat and in Brunei. It belongs to the Malayo-Polynesian branch of the Austronesian language family, and is related to Malay, more closely to Sarawakian Malay. The Iban language is also a subject tested in PMR and SPM, the Malaysian public examination for Form 3 and Form 5 students respectively. Students comment that questions from these exams mostly cover the classic Iban language, making them a daunting task for many who are more fluent in the contemporary tongue. The language is mostly taught to students in rural areas with a majority Iban population, including Baleh (Kapit), Betong, Saratok, Lubok Antu and Pelagus (Kapit).
in scheme: Lexvo - ISO 639-3 language codes
notation: iba

Ibibio
type: Language
type: Concept
ISO 639-3 code: ibb
alternative label: Ibibio language
alternative label: Língua ibibio @pt
definition: Ibibio (proper) is the native language of the Ibibio people of southern Nigeria Nigeria. It is the official language of Akwa Ibom State in Nigeria.
in scheme: Lexvo - ISO 639-3 language codes
notation: ibb
preferred label: ibibio @es

Iwaidja
type: Language
type: Concept
ISO 639-3 code: ibd
alternative label: Iwaidja language
definition: Iwaidja, in phonemic spelling Iwaja, is an Australian language with about 150 speakers in northernmost Australia. Historically from the base of the Cobourg Peninsula, it is now spoken on Croker Island. It is still being learned by children.
in scheme: Lexvo - ISO 639-3 language codes
notation: ibd

Akpes
type: Language
type: Concept
ISO 639-3 code: ibe
alternative label: Akpes language
definition: Akpes is a dialect cluster spoken in Nigeria that forms an independent branch of the Volta–Niger languages.
in scheme: Lexvo - ISO 639-3 language codes
notation: ibe

Ibanag
type: Language
type: Concept
ISO 639-3 code: ibg
alternative label: Ibanag language
definition: The Ibanag language (also Ybanag or Ibanak) is spoken by up to 500,000 speakers (the Ibanag people) in the Philippines, in the northeastern provinces of Isabela and Cagayan, especially in Tuguegarao City, Solana, Cabagan, and Ilagan and with overseas immigrants in countries located in the Middle East, UK and the U.S.A.. Most of the speakers can also speak Ilocano, the lingua franca of Northern Luzon. Ibanag is derived from bannag river. It is closely related to Gaddang, Itawis, Agta, Atta, Yogad, Isneg and Malaweg.
in scheme: Lexvo - ISO 639-3 language codes
notation: ibg

Ibaloi
type: Language
type: Concept
ISO 639-3 code: ibl
in scheme: Lexvo - ISO 639-3 language codes
notation: ibl

Agoi
type: Language
type: Concept
ISO 639-3 code: ibm
alternative label: Agoi language
definition: Agoi, or Ibami, is a Upper Cross River language of Nigeria.
in scheme: Lexvo - ISO 639-3 language codes
notation: ibm

Ngarigu
type: Language
type: Concept
in scheme: Lexvo - ISO 639-3 language codes

Ibino
type: Language
type: Concept
ISO 639-3 code: ibn
in scheme: Lexvo - ISO 639-3 language codes
notation: ibn

Igbo
type: Language
type: Concept
ISO 639-1 code: ig
ISO 639-2 Bibliographical code: ibo
ISO 639-2 Terminological code: ibo
ISO 639-3 code: ibo
alternative label: Idioma igbo @es
alternative label: Igbo language
alternative label: Igbo-Sprache @de
alternative label: Lingua igbo @it
alternative label: Língua igbo @pt
preferred label: igbo @es
definition: Igbo (Igbo: Asụsụ Igbo), or Igbo proper, is a native language of the Igbo people, an ethnic group primarily located in southeastern Nigeria. There are approximately 20 million speakers that are mostly in Nigeria and are primarily of Igbo descent. Igbo is a national language of Nigeria. It is written in the Latin script, which was introduced by British colonialists. Secret societies such as the Ekpe use the Nsibidi symbols which were invented by the Ejagham and were used to represent other languages like Efik.
in scheme: Lexvo - ISO 639-3 language codes
notation: ibo
preferred label: ibo @pt

Ibuoro
type: Language
type: Concept
ISO 639-3 code: ibr
in scheme: Lexvo - ISO 639-3 language codes
notation: ibr

Ibu
type: Language
type: Concept
ISO 639-3 code: ibu
in scheme: Lexvo - ISO 639-3 language codes
notation: ibu

Ibani
type: Language
type: Concept
ISO 639-3 code: iby
in scheme: Lexvo - ISO 639-3 language codes
notation: iby

Nganakarti
type: Language
type: Concept
in scheme: Lexvo - ISO 639-3 language codes

Ede Ica
type: Language
type: Concept
ISO 639-3 code: ica
in scheme: Lexvo - ISO 639-3 language codes
notation: ica

Etkywan
type: Language
type: Concept
ISO 639-3 code: ich
alternative label: Etkywan language
definition: Etkywan (Etekwe, Itchen) is a Jukunoid language of Nigeria.
in scheme: Lexvo - ISO 639-3 language codes
notation: ich

Icelandic Sign Language
type: Language
type: Concept
ISO 639-3 code: icl
definition: The Icelandic sign language (íslenskt táknmál) is the sign language of the deaf community in Iceland. It is based on the Danish Sign Language; until 1910, deaf Icelandic people were sent to school in Denmark, but the languages have diverged since then. It is officially recognized by the state and regulated by a national committee.
in scheme: Lexvo - ISO 639-3 language codes
notation: icl

Islander Creole English
type: Language
type: Concept
ISO 639-3 code: icr
alternative label: Creole English, Islander
alternative label: San Andrés–Providencia Creole
definition: San Andrés–Providencia Creole is a Creole language spoken in the San Andrés and Providencia Department of Colombia by the natives (the Raizal ethnic group), very similar to the Miskito Coastal Creole spoken in Bluefields, the Corn Islands and the Mosquito Coast of Nicaragua. Its vocabulary originates in English language, but it has its own phonetics and many expressions from Spanish and African dialects of the Kwa languages (Twi, Ewe and Ibi languages) among others. It is not just a dialect with different phonetics and syntax. It has its own grammar distinct from English and Spanish. The language is also known as "San Andrés Creole", "Bende", and "Islander Creole English".
in scheme: Lexvo - ISO 639-3 language codes
notation: icr
preferred label: Criollo sanandresano @es

Idakho-Isukha-Tiriki
type: Language
type: Concept
ISO 639-3 code: ida
alternative label: Luidakho-Luisukha-Lutirichi
in scheme: Lexvo - ISO 639-3 language codes
notation: ida

Northern Kankanay
type: Language
type: Concept
ISO 639-3 code: xnn
alternative label: Kankanay, Northern
in scheme: Lexvo - ISO 639-3 language codes
notation: xnn

Indo-Portuguese
type: Language
type: Concept
ISO 639-3 code: idb
alternative label: Sri Lankan Portuguese Creole
definition: Sri Lanka Indo-Portuguese,Ceylonese Portuguese Creole or Sri Lankan Portuguese Creole (SLPC) is a language spoken in Sri Lanka. While the predominant languages of the island are Sinhala and Tamil, the interaction of the Portuguese and the Sri Lankans led to the evolution of a new language, Sri Lanka Portuguese Creole (SLPC), which flourished as a lingua franca on the island for over 350 years (16th to mid 19th centuries). SLPC continues to be spoken by an unknown, extremely small population. All speakers of SLPC are members of the Burgher community: descendents of the Portuguese and Dutch who originally founded families in Sri Lanka. Europeans, Eurasians, and Burghers account for 0.2% of the Sri Lankan population. Though only a small group of people actually continue to speak SLPC, the Portuguese cultural traditions are still in wide practice by the mainstream Sri Lankans who are neither of Portuguese descent nor Roman Catholics.
in scheme: Lexvo - ISO 639-3 language codes
notation: idb

Idon
type: Language
type: Concept
ISO 639-3 code: idc
alternative label: Ajiya
in scheme: Lexvo - ISO 639-3 language codes
notation: idc

Ede Idaca
type: Language
type: Concept
ISO 639-3 code: idd
in scheme: Lexvo - ISO 639-3 language codes
notation: idd

Idere
type: Language
type: Concept
ISO 639-3 code: ide
in scheme: Lexvo - ISO 639-3 language codes
notation: ide

Idi
type: Language
type: Concept
ISO 639-3 code: idi
alternative label: Idi language
definition: Idi is a language of the South-Central Papuan group, spoken by about 1,610 people Tame refers to a variety distinct from Idi.
in scheme: Lexvo - ISO 639-3 language codes
notation: idi

Ido
type: Language
type: Concept
ISO 639-1 code: io
ISO 639-2 Bibliographical code: ido
ISO 639-2 Terminological code: ido
ISO 639-3 code: ido
alternative label: Ido-Sprache @de
alternative label: Lingua ido @it
preferred label: ido @es
definition: Ido is a language created with the goal of becoming a universal second language for speakers of diverse linguistic backgrounds. Ido was specifically designed to be grammatically, orthographically, and lexicographically regular, and above all easy to learn and use. In this sense, Ido is classified as a constructed international auxiliary language.
in scheme: Lexvo - ISO 639-3 language codes
notation: ido

Indri
type: Language
type: Concept
ISO 639-3 code: idr
alternative label: Indri language
definition: Indri (Yanderika, Yandirika) is a Ubangian language of South Sudan.
in scheme: Lexvo - ISO 639-3 language codes
notation: idr

Santiago Xanica Zapotec
type: Language
type: Concept
ISO 639-3 code: zpr
alternative label: Zapotec, Santiago Xanica
in scheme: Lexvo - ISO 639-3 language codes
notation: zpr

Idesa
type: Language
type: Concept
ISO 639-3 code: ids
in scheme: Lexvo - ISO 639-3 language codes
notation: ids

Anglo-Norman
type: Language
type: Concept
ISO 639-3 code: xno
alternative label: Anglo-Norman language
definition: Anglo-Norman, also known as Anglo-Norman French, is the name traditionally given to the dialect of the Old Norman language used in England, and to some extent elsewhere in the British Isles, during the Anglo-Norman period. This dialect is closely related to Old French and is sometimes referred to generically as simply French.
in scheme: Lexvo - ISO 639-3 language codes
notation: xno
preferred label: Anglo-normand @fr
preferred label: Anglo-normando @es
preferred label: Anglonormannische Sprache @de
preferred label: Lingua anglo-normanna @it
preferred label: Língua anglo-normanda @pt

Idaté
type: Language
type: Concept
ISO 639-3 code: idt
in scheme: Lexvo - ISO 639-3 language codes
notation: idt

Idoma
type: Language
type: Concept
ISO 639-3 code: idu
alternative label: Idoma language
definition: The Idoma is an official language spoken in central Nigeria by nearly a million people.
in scheme: Lexvo - ISO 639-3 language codes
notation: idu

Amganad Ifugao
type: Language
type: Concept
ISO 639-3 code: ifa
alternative label: Ifugao, Amganad
in scheme: Lexvo - ISO 639-3 language codes
notation: ifa

Batad Ifugao
type: Language
type: Concept
ISO 639-3 code: ifb
alternative label: Ayangan Ifugao
alternative label: Ifugao language
alternative label: Ifugao, Ayangan
alternative label: Ifugao, Batad
definition: Ifugao or Batad is a Malayo-Polynesian language spoken in the Ifugao Province of the northern valleys Philippines, closely related to Bontok and Kankanai. It is a dialect cluster, and its four main varieties—such as Tuwali—are sometimes considered separate languages.
in scheme: Lexvo - ISO 639-3 language codes
notation: ifb

Ifè
type: Language
type: Concept
ISO 639-3 code: ife
alternative label: Ifè language
definition: Ifè (or Ifɛ) is a Niger–Congo language spoken by approximately 182,000 people in Togo and Benin. It is also known as Ana, Ana-Ifé, Anago, Baate and Ede Ife. It has a lexical similarity of 87%–91% with Ede Nago.
in scheme: Lexvo - ISO 639-3 language codes
notation: ife
preferred label: Ife @de
preferred label: Língua ife @pt

Ifo
type: Language
type: Concept
ISO 639-3 code: iff
in scheme: Lexvo - ISO 639-3 language codes
notation: iff

Tuwali Ifugao
type: Language
type: Concept
ISO 639-3 code: ifk
alternative label: Ifugao, Tuwali
alternative label: Tuwali language
definition: For the languages spoken in Kiangan Region, see Languages of Ifugao. Tuwali language is a native language indigenous to Ifugao. Mainly spoken in the whole province. Its only that it has different varieties that distinguishes the municipality.
in scheme: Lexvo - ISO 639-3 language codes
notation: ifk

Teke-Fuumu
type: Language
type: Concept
ISO 639-3 code: ifm
alternative label: Fuumu language
definition: Fuumu is a member of the Teke languages dialect continuum of the Congolese plateau. The two dialects, Fuumu (Ifuumu) and Wuumu (Iwuumu), are sometimes considered separate languages. They are sometimes considered part of South Teke.
in scheme: Lexvo - ISO 639-3 language codes
notation: ifm

Mayoyao Ifugao
type: Language
type: Concept
ISO 639-3 code: ifu
alternative label: Ifugao, Mayoyao
in scheme: Lexvo - ISO 639-3 language codes
notation: ifu

Keley-I Kallahan
type: Language
type: Concept
ISO 639-3 code: ify
alternative label: Kallahan, Keley-I
in scheme: Lexvo - ISO 639-3 language codes
notation: ify

Ebira
type: Language
type: Concept
ISO 639-3 code: igb
alternative label: Ebira language
definition: Ebira (Egbira) is a Nupoid language spoken by over a million people in the Kwara State, Nigeria.
in scheme: Lexvo - ISO 639-3 language codes
notation: igb
preferred label: Língua ebira @pt

Igede
type: Language
type: Concept
ISO 639-3 code: ige
alternative label: Igede language
definition: Igede is an Idomoid language spoken in Benue State and Cross River State, Nigeria, by 250,000 people.
in scheme: Lexvo - ISO 639-3 language codes
notation: ige

Igana
type: Language
type: Concept
ISO 639-3 code: igg
in scheme: Lexvo - ISO 639-3 language codes
notation: igg

Igala
type: Language
type: Concept
ISO 639-3 code: igl
alternative label: Igala language
definition: Igala is a language of the Yoruboid branch of the Volta–Niger language family, spoken by the Igala ethnic group of Nigeria. In 1989, an estimated 800,000 spoke Igala, primarily in Kogi State, Delta State and Edo State. Dialects include Ebu, Idah, Ankpa, Dekina, Ogugu, Ibaji, Ife. The Agatu, Idoma, and Bassa people use Igala for primary school. Igala is related to Yoruba. The Igala language as well as Igala culture and tradition has influenced other languages and cultures around the confluence of the Niger and Benue rivers
in scheme: Lexvo - ISO 639-3 language codes
notation: igl

Kanggape
type: Language
type: Concept
ISO 639-3 code: igm
alternative label: Kanggape language
definition: Kanggape Igom is a Ramu language of Papua New Guinea. Together with Andarum, there were something over 2,000 speakers in 1981.
in scheme: Lexvo - ISO 639-3 language codes
notation: igm

Ignaciano
type: Language
type: Concept
ISO 639-3 code: ign
in scheme: Lexvo - ISO 639-3 language codes
notation: ign

Kangri
type: Language
type: Concept
ISO 639-3 code: xnr
alternative label: Kangri language
definition: Kangri is a dialect spoken in northern India, predominantly in the Kangra district of Himachal Pradesh, by the people of the Kangra Valley. It is an Indo-Aryan dialect, related to Dogri and classified as one of the Western Pahari (पहाड़ी) group of languages, with deep vocabulary impact from Punjabi, which is spoken to the west in the state of Punjab. Kangri, along with Dogri, has been classified as a dialect of Punjabi by linguists but since the 1960s, for political reasons, both have been promoted as dialects of a separate language group called Pahari.
in scheme: Lexvo - ISO 639-3 language codes
notation: xnr

Isebe
type: Language
type: Concept
ISO 639-3 code: igo
in scheme: Lexvo - ISO 639-3 language codes
notation: igo

Glosa
type: Language
type: Concept
ISO 639-3 code: igs
alternative label: Interglossa
definition: Glosa is an international auxiliary language based on a previous draft auxiliary called Interglossa. As an isolating language, there are no inflections, so that words always remain in their dictionary form, no matter what function they have in the sentence. Consequently, grammatical functions, when not clear from the context, are taken over by a small number of operator words and by the use of word order (syntax).
in scheme: Lexvo - ISO 639-3 language codes
notation: igs

Igwe
type: Language
type: Concept
ISO 639-3 code: igw
alternative label: Igwe language
definition: Igwe is an Edoid language of Edo State, Nigeria.
in scheme: Lexvo - ISO 639-3 language codes
notation: igw

Iha Based Pidgin
type: Language
type: Concept
ISO 639-3 code: ihb
in scheme: Lexvo - ISO 639-3 language codes
notation: ihb

Ihievbe
type: Language
type: Concept
ISO 639-3 code: ihi
in scheme: Lexvo - ISO 639-3 language codes
notation: ihi

Iha
type: Language
type: Concept
ISO 639-3 code: ihp
alternative label: Iha language
definition: Iha is a Papuan language spoken on the Bomberai Peninsula.
in scheme: Lexvo - ISO 639-3 language codes
notation: ihp

Bidhawal
type: Language
type: Concept
ISO 639-3 code: ihw
alternative label: Gunai language
definition: The Gunai language (also spelt Gunnai, Ganai, Gaanay, Kurnai, Kurnay) is a dialect cluster of Indigenous Australian languages in Gippsland in south-east Victoria.
in scheme: Lexvo - ISO 639-3 language codes
notation: ihw

Nuosu
type: Language
type: Concept
ISO 639-1 code: ii
ISO 639-2 Bibliographical code: iii
ISO 639-2 Terminological code: iii
ISO 639-3 code: iii
alternative label: Nuosu language
preferred label: Sichuan Yi
alternative label: Yi, Sichuan
definition: Nuosu (Nosu), also known as Northern Yi, Liangshan Yi, and Sichuan Yi, is the prestige language of the Yi people; it has been chosen by the Chinese government as the standard Yi language (in Mandarin: Yí yǔ, 彝語/彝语) and, as such, is the only one taught in school, both in its oral and written form. It is spoken by two million people and is increasing; 60% are monolingual. Nuosu is the native Nuosu/Yi name for their own language and is not used in Mandarin Chinese; although it may sometimes be spelled out for pronunciation (nuòsū yǔ 诺苏语/諾蘇語), the Chinese characters for nuòsū have no meaning.
in scheme: Lexvo - ISO 639-3 language codes
notation: iii
preferred label: sichuan yi @es
preferred label: yi de Sichuan @fr

Thiin
type: Language
type: Concept
in scheme: Lexvo - ISO 639-3 language codes

Izon
type: Language
type: Concept
ISO 639-3 code: ijc
alternative label: Izon language
definition: Izon (Ịzọn), also known as (Central–Western) Ijo, Ijaw, Izo, and Uzo, is the dominant Ijaw language, spoken by a majority of the Ijaw people of Nigeria.
in scheme: Lexvo - ISO 639-3 language codes
notation: ijc

Biseni
type: Language
type: Concept
ISO 639-3 code: ije
alternative label: Biseni language
definition: Biseni (Buseni) is one of three small Inland Ijaw languages of Nigeria. According to Ethnologue, it is not fully intelligible with other varieties of Inland Ijaw.
in scheme: Lexvo - ISO 639-3 language codes
notation: ije

Kanashi
type: Language
type: Concept
ISO 639-3 code: xns
in scheme: Lexvo - ISO 639-3 language codes
notation: xns

Ede Ije
type: Language
type: Concept
ISO 639-3 code: ijj
in scheme: Lexvo - ISO 639-3 language codes
notation: ijj

Kalabari
type: Language
type: Concept
ISO 639-3 code: ijn
in scheme: Lexvo - ISO 639-3 language codes
notation: ijn

Southeast Ijo
type: Language
type: Concept
ISO 639-3 code: ijs
alternative label: Ijo, Southeast
alternative label: Nembe language
definition: Southeast Ijaw is an Ijaw language spoken in southern Nigeria. There are two dialects, Nembe (Nimbe) and Akassa (Akaha).
in scheme: Lexvo - ISO 639-3 language codes
notation: ijs

Eastern Canadian Inuktitut
type: Language
type: Concept
ISO 639-3 code: ike
alternative label: Inuktitut, Eastern Canadian
in scheme: Lexvo - ISO 639-3 language codes
notation: ike

Iko
type: Language
type: Concept
ISO 639-3 code: iki
in scheme: Lexvo - ISO 639-3 language codes
notation: iki

Ika
type: Language
type: Concept
ISO 639-3 code: ikk
alternative label: Ika language
definition: Ika is a Niger–Congo language of the Igbo cluster, spoken by 22,772 people in Delta State, Nigeria.
in scheme: Lexvo - ISO 639-3 language codes
notation: ikk
preferred label: Ikah @de

Ikulu
type: Language
type: Concept
ISO 639-3 code: ikl
alternative label: Kulu language
definition: The Kulu language, Ikulu, is a Plateau language of Nigeria.
in scheme: Lexvo - ISO 639-3 language codes
notation: ikl

Narragansett
type: Language
type: Concept
ISO 639-3 code: xnt
alternative label: Narragansett language
definition: Narragansett is an extinct Algonquian language formerly spoken in most of what is today Rhode Island by the Narragansett people. It was closely related to the other Algonquian languages of southern New England like Massachusett and Mohegan-Pequot. The earliest study of the language in English was by Roger Williams, founder of the Rhode Island colony, in his book A Key Into the Language of America (1643).
in scheme: Lexvo - ISO 639-3 language codes
notation: xnt

Olulumo-Ikom
type: Language
type: Concept
ISO 639-3 code: iko
alternative label: Ikom language
definition: Ikom, also known as Lulumo, is a Upper Cross River language of Nigeria. There are three varieties, Okuni, Olulumo, Ikom; Ikom is spoken by 80%.
in scheme: Lexvo - ISO 639-3 language codes
notation: iko

Ikpeshi
type: Language
type: Concept
ISO 639-3 code: ikp
in scheme: Lexvo - ISO 639-3 language codes
notation: ikp

Ikaranggal
type: Language
type: Concept
in scheme: Lexvo - ISO 639-3 language codes

Inuinnaqtun
type: Language
type: Concept
ISO 639-3 code: ikt
alternative label: Inuktitut, Western Canadian
alternative label: Western Canadian Inuktitut
in scheme: Lexvo - ISO 639-3 language codes
notation: ikt

Inuktitut
type: Language
type: Concept
ISO 639-1 code: iu
ISO 639-2 Bibliographical code: iku
ISO 639-2 Terminological code: iku
ISO 639-3 code: iku
alternative label: Lenguas inuit @es
alternative label: Lingua inuktitut @it
alternative label: Língua inuktitut @pt
definition: Inuktitut (Inuktitut syllabics: ( )) or Eastern Canadian Inuktitut, Eastern Canadian Inuit language is the name of some of the Inuit languages spoken in Canada. It is spoken in all areas north of the tree line, including parts of the provinces of Newfoundland and Labrador, Québec, to some extent in northeastern Manitoba as well as the territories of Nunavut, the Northwest Territories, and traditionally on the Arctic Ocean coast of Yukon.
in scheme: Lexvo - ISO 639-3 language codes
notation: iku
preferred label: Inukitut @de
preferred label: inuktitut @es

Iku-Gora-Ankwa
type: Language
type: Concept
ISO 639-3 code: ikv
in scheme: Lexvo - ISO 639-3 language codes
notation: ikv

Ikwere
type: Language
type: Concept
ISO 639-3 code: ikw
alternative label: Ikwerre language
definition: Ikwerre, also spelt as Ikwere, is a language spoken primarily by the Ikwerre people who inhabit Rivers State, Nigeria. According to a 1973 SIL International report, the number of Ikwerre speakers is estimated at 200,000. By taking into consideration the population of the four Ikwerre local governments (Port Harcourt, Emohua, Obia/Akpor and Ikwerre), this figure may extend to a little over a million speakers as per the 2006 National Population Commission census.
in scheme: Lexvo - ISO 639-3 language codes
notation: ikw

Ik
type: Language
type: Concept
ISO 639-3 code: ikx
alternative label: Ik language
definition: The Ik language, also known as Icetot, Icietot, Ngulak, or (derogatory) Teuso, Teuth, are one of the Kuliak languages of northeastern Uganda. The Ik people have a positive attitude toward their language, which is increasing; with Tepes being moribund, Ik may soon be the sole remaining language of its family.
in scheme: Lexvo - ISO 639-3 language codes
notation: ikx
preferred label: Icetot @de

Ikizu
type: Language
type: Concept
ISO 639-3 code: ikz
in scheme: Lexvo - ISO 639-3 language codes
notation: ikz

Ile Ape
type: Language
type: Concept
ISO 639-3 code: ila
in scheme: Lexvo - ISO 639-3 language codes
notation: ila

Ila
type: Language
type: Concept
ISO 639-3 code: ilb
alternative label: Lundwe language
definition: Ila, or Lundwe (Chiila, Shukulumbwe), is a Bantu language of Zambia.
in scheme: Lexvo - ISO 639-3 language codes
notation: ilb

Nukunul
type: Language
type: Concept
in scheme: Lexvo - ISO 639-3 language codes

Occidental
type: Language
type: Concept
ISO 639-1 code: ie
ISO 639-2 Bibliographical code: ile
ISO 639-2 Terminological code: ile
ISO 639-3 code: ile
alternative label: Idioma occidental @es
preferred label: Interlingue
alternative label: Occidental language
preferred label: interlingue @es
definition: The language Occidental, later Interlingue, is a planned language created by the Balto-German naval officer and teacher Edgar de Wahl and published in 1922.
in scheme: Lexvo - ISO 639-3 language codes
notation: ile

Garig-Ilgar
type: Language
type: Concept
ISO 639-3 code: ilg
alternative label: Ilgar language
in scheme: Lexvo - ISO 639-3 language codes
notation: ilg

Ili Turki
type: Language
type: Concept
ISO 639-3 code: ili
alternative label: Ili Turki language
definition: Ili Turki is a Turkic language spoken primarily in China. There were approximately 120 speakers of this language as of 1982.
in scheme: Lexvo - ISO 639-3 language codes
notation: ili
preferred label: Ili turki @fr

Ilongot
type: Language
type: Concept
ISO 639-3 code: ilk
alternative label: Ilongot language
definition: It is believed the Language to be associated with the headhunting goat people of buttasstrillia. Ilongot is a native dialect of the indigenous Ilongot people of northern Luzon, Philippines. The language is Austronesian and has been characterized as possessing three dialects.
in scheme: Lexvo - ISO 639-3 language codes
notation: ilk

Iranun
type: Language
type: Concept
ISO 639-3 code: ill
in scheme: Lexvo - ISO 639-3 language codes
notation: ill

Nyiyaparli
type: Language
type: Concept
in scheme: Lexvo - ISO 639-3 language codes

Iloko
type: Language
type: Concept
ISO 639-2 Bibliographical code: ilo
ISO 639-2 Terminological code: ilo
ISO 639-3 code: ilo
alternative label: Idioma ilocano @es
alternative label: Ilocano @fr
alternative label: Ilokano language
alternative label: Ilokano-Sprache @de
alternative label: Lingua ilokano @it
preferred label: ilocano @es
definition: Ilokano or Ilocano (Ilocano: Ti Pagsasao nga Iloco; also Ilocano, Iluko, Iloco, Iloco, Ylocano, and Yloco) is the third most-spoken language of the Republic of the Philippines.
in scheme: Lexvo - ISO 639-3 language codes
notation: ilo
preferred label: Ilokano @de
preferred label: ilokano @fr

International Sign
type: Language
type: Concept
ISO 639-3 code: ils
definition: International Sign (IS) (also Gestuno, International Sign Language (ISL), International Sign Pidgin and International Gesture (IG) ) is an international auxiliary language sometimes used at international meetings such as the World Federation of the Deaf (WFD) congress, events such as the Deaflympics, and informally when travelling and socialising. It can be seen as a kind of pidgin sign language, which is not as conventionalised or complex as natural sign languages and has a limited lexicon.
in scheme: Lexvo - ISO 639-3 language codes
notation: ils
preferred label: Gestuno @de
preferred label: Langue des signes internationale @fr

Ili'uun
type: Language
type: Concept
ISO 639-3 code: ilu
in scheme: Lexvo - ISO 639-3 language codes
notation: ilu

Ilue
type: Language
type: Concept
ISO 639-3 code: ilv
in scheme: Lexvo - ISO 639-3 language codes
notation: ilv

Talur
type: Language
type: Concept
ISO 639-3 code: ilw
in scheme: Lexvo - ISO 639-3 language codes
notation: ilw

Kenzi
type: Language
type: Concept
ISO 639-3 code: xnz
alternative label: Mattoki
in scheme: Lexvo - ISO 639-3 language codes
notation: xnz

Mala Malasar
type: Language
type: Concept
ISO 639-3 code: ima
alternative label: Malasar, Mala
in scheme: Lexvo - ISO 639-3 language codes
notation: ima

Imeraguen
type: Language
type: Concept
ISO 639-3 code: ime
in scheme: Lexvo - ISO 639-3 language codes
notation: ime

Anamgura
type: Language
type: Concept
ISO 639-3 code: imi
alternative label: Anamgura language
definition: Anamgura is a Papuan language of Madang Province, Papua New Guinea.
in scheme: Lexvo - ISO 639-3 language codes
notation: imi

Miluk
type: Language
type: Concept
ISO 639-3 code: iml
alternative label: Miluk language
definition: Miluk, also known as Lower Coquille from its location, is one of two Coosan languages. It shares more than half of its vocabulary with Coos proper (Hanis), though these are not always obvious, and grammatical differences cause the two languages to look quite different. Miluk started being displaced by Athabascan in the late 18th century, and many Miluk shifted to Athabascan and Hanis.
in scheme: Lexvo - ISO 639-3 language codes
notation: iml

Imonda
type: Language
type: Concept
ISO 639-3 code: imn
in scheme: Lexvo - ISO 639-3 language codes
notation: imn

Imbongu
type: Language
type: Concept
ISO 639-3 code: imo
in scheme: Lexvo - ISO 639-3 language codes
notation: imo

Imroing
type: Language
type: Concept
ISO 639-3 code: imr
in scheme: Lexvo - ISO 639-3 language codes
notation: imr

Tonga
type: Language
type: Concept
ISO 639-1 code: to
ISO 639-2 Bibliographical code: ton
ISO 639-2 Terminological code: ton
ISO 639-3 code: ton
alternative label: Idioma tongano @es
alternative label: Lingua tongana @it
alternative label: Língua tonganesa @pt
alternative label: Tonga (Tonga Islands)
alternative label: Tongaische Sprache @de
alternative label: Tongan
alternative label: Tongan language
alternative label: Tonguien @fr
alternative label: tongan (Îles Tonga) @fr
alternative label: tonganês @pt
alternative label: tongien @fr
definition: Tongan (lea fakatonga) is an Austronesian language spoken in Tonga. It has around 200,000 speakers and is a national language of Tonga. It is a VSO (verb–subject–object) language.
in scheme: Lexvo - ISO 639-3 language codes
notation: ton
preferred label: Tongaisch @de
preferred label: tonga @pt
preferred label: tongan @fr
preferred label: tongano @es

Marsi
type: Language
type: Concept
ISO 639-3 code: ims
alternative label: Marsian
definition: Marsi is the Latin exonym for a people of ancient Italy, whose chief centre was Marruvium, on the eastern shore of Lake Fucinus, drained for agricultural land in the late 19th century. The area in which they lived is now called Marsica. During the Roman Republic the people of the region spoke a language now termed Marsian in scholarly English. It is attested by several inscriptions and a few glosses. The Linguist List classifies it as one of the Umbrian Group of languages.
in scheme: Lexvo - ISO 639-3 language codes
notation: ims
preferred label: Marser @de
preferred label: Marses @fr
preferred label: Marsos @es

O'chi'chi'
type: Language
type: Concept
ISO 639-3 code: xoc
in scheme: Lexvo - ISO 639-3 language codes
notation: xoc

Milyan
type: Language
type: Concept
ISO 639-3 code: imy
in scheme: Lexvo - ISO 639-3 language codes
notation: imy

Interlingua
type: Language
type: Concept
ISO 639-1 code: ia
ISO 639-2 Bibliographical code: ina
ISO 639-2 Terminological code: ina
ISO 639-3 code: ina
alternative label: Interlingua (International Auxiliary Language Association)
preferred label: interlingua @es
alternative label: interlingua (langue auxiliaire internationale) @fr
alternative label: interlíngua @pt
definition: Interlingua (; ISO 639 language codes ia, ina) is an international auxiliary language (IAL), developed between 1937 and 1951 by the International Auxiliary Language Association (IALA). It ranks among the top three most widely used IALs (after Esperanto and perhaps Ido), and is the most widely used naturalistic IAL: in other words, its vocabulary, grammar and other characteristics are largely derived from natural languages. Interlingua was developed to combine a simple, mostly regular grammar with a vocabulary common to the widest possible range of languages, making it unusually easy to learn, at least for those whose native languages were sources of Interlingua's vocabulary and grammar. Conversely, it is used as a rapid introduction to many natural languages. though it is actively spoken by only a few hundred. The immediate comprehension of Interlingua, in turn, makes it unusually easy to learn. Speakers of other languages can also learn to speak and write Interlingua in a short time, thanks to its simple grammar and regular word formation using a small number of roots and affixes.
in scheme: Lexvo - ISO 639-3 language codes
notation: ina
preferred label: Interlíngua @pt

Inga
type: Language
type: Concept
ISO 639-3 code: inb
in scheme: Lexvo - ISO 639-3 language codes
notation: inb

Indonesian
type: Language
type: Concept
ISO 639-1 code: id
ISO 639-2 Bibliographical code: ind
ISO 639-2 Terminological code: ind
ISO 639-3 code: ind
alternative label: Idioma indonesio @es
alternative label: Indonesian language
alternative label: Indonésien @fr
alternative label: Lingua indonesiana @it
alternative label: Língua indonésia @pt
alternative label: Malaiische Sprache#Geschichte @de
definition: Indonesian (Bahasa Indonesia) is the official language of Indonesia. It is a standardized form of the Riau dialect of Malay, an Austronesian language which has been used as a lingua franca in the Indonesian archipelago for centuries.
in scheme: Lexvo - ISO 639-3 language codes
notation: ind
preferred label: Indonesisch @de
preferred label: indonesiano @it
preferred label: indonesio @es
preferred label: indonésien @fr
preferred label: indonésio @pt

Degexit'an
type: Language
type: Concept
ISO 639-3 code: ing
alternative label: Deg Xinag language
definition: The Deg Xinag language is a Northern Athabaskan language spoken by the Deg Hit’an peoples in Shageluk and Anvik and at Holy Cross along the lower Yukon River in Alaska. The language is nearly extinct, as most people are shifting to English.
in scheme: Lexvo - ISO 639-3 language codes
notation: ing
preferred label: Deg hit'an @fr
preferred label: Idioma deg xinag @es

Ingush
type: Language
type: Concept
ISO 639-2 Bibliographical code: inh
ISO 639-2 Terminological code: inh
ISO 639-3 code: inh
alternative label: Idioma ingusetio @es
alternative label: Inguschische Sprache @de
alternative label: Ingush language
alternative label: Lingua inguscia @it
alternative label: Língua inguche @pt
alternative label: ingouche @fr
definition: Ingush is a language spoken by about 413,000 people (2002), known as the Ingush, across a region covering Ingushetia, Chechnya, Kazakhstan and Russia. In Ingush, the language is called ГІалгІай Ğalğaj (pronounced ).
in scheme: Lexvo - ISO 639-3 language codes
notation: inh
preferred label: Ingouche @fr
preferred label: Inguschisch @de
preferred label: inguche @pt
preferred label: ingush @es

Coatlán Zapotec
type: Language
type: Concept
ISO 639-3 code: zps
alternative label: Tilquiapan Zapotec
alternative label: Zapotec, Coatlán
definition: Tilquiapan Zapotec (Zapoteco de San Miguel Tilquiapan) is an Oto-Manguean language of the Zapotecan branch, spoken in southern Oaxaca, Mexico.
in scheme: Lexvo - ISO 639-3 language codes
notation: zps

Jungle Inga
type: Language
type: Concept
ISO 639-3 code: inj
alternative label: Inga, Jungle
in scheme: Lexvo - ISO 639-3 language codes
notation: inj

Kokoda
type: Language
type: Concept
ISO 639-3 code: xod
alternative label: Kokoda language
definition: Kokoda is a Papuan language of the Bird's Head Peninsula of West Papua. The three dialects—Kokoda proper, Kasuweri, and Tarof—are divergent enough to sometimes be considered separate languages.
in scheme: Lexvo - ISO 639-3 language codes
notation: xod

Indonesian Sign Language
type: Language
type: Concept
ISO 639-3 code: inl
definition: Indonesian Sign Language or Bahasa Isyarat Indonesia (BISINDO), is used in Indonesia, at least on the islands of Java and Bali.
in scheme: Lexvo - ISO 639-3 language codes
notation: inl
preferred label: Língua de sinais indonésia @pt

Minaean
type: Language
type: Concept
ISO 639-3 code: inm
alternative label: Minaean language
definition: The Minaean (or, to be exact, Madhabic) language was an Old South Arabian ("Sayhadic") language spoken in Yemen between 1200 BC and AD 100. The main area of its use may be localized in al-Jawf part of North-East Yemen, first of all in the Wadi Madhab. Most of the texts in this language were composed by the Minaeans, but the other civil-temple communities of the Wadi Madhab (Nashshan, Kaminahu, Haram, and Inabba') also used this language.
in scheme: Lexvo - ISO 639-3 language codes
notation: inm

Isinai
type: Language
type: Concept
ISO 639-3 code: inn
in scheme: Lexvo - ISO 639-3 language codes
notation: inn

Inoke-Yate
type: Language
type: Concept
ISO 639-3 code: ino
in scheme: Lexvo - ISO 639-3 language codes
notation: ino

Iñapari
type: Language
type: Concept
ISO 639-3 code: inp
alternative label: Iñapari language
definition: Iñapari is a critically endangered indigenous South American language spoken by just two hundred people in Perú along the Las Piedras river near the mouth of the Sabaluyoq river. The language is already extinct in neighboring Bolivia. All forty remaining speakers are bilingual in Spanish and none have any children, which will likely lead to its extinction once the speakers die. The Iñapari language currently has a published dictionary.
in scheme: Lexvo - ISO 639-3 language codes
notation: inp
preferred label: Inapari @fr

Indian Sign Language
type: Language
type: Concept
ISO 639-3 code: ins
in scheme: Lexvo - ISO 639-3 language codes
notation: ins

Intha
type: Language
type: Concept
ISO 639-3 code: int
alternative label: Burmese dialects
definition: There are a number of mutually intelligible Burmese dialects in the Burmese language, with a largely uniform standard dialect used by most Burmese speakers, who live throughout the Irrawaddy River valley and more distinctive non-standard dialects that emerge as one toward peripheral areas of the country. These dialects include Palaw, Beik/Myeik (Merguese), and Dawei (Tavoyan) in Taninthayi Division, Yaw in Magway Division, Intha and Danu in Shan State, Rakhine (Arakanese) in Rakhine State and Marma in Bangladesh. Despite vocabulary and pronunciation differences, there is mutual intelligibility among Burmese dialects, as for the most part, they share the same four tones, consonant clusters and the Burmese script. However, several dialects differ in Burmese with respect to vocabulary, lexical particles, and rhymes.
in scheme: Lexvo - ISO 639-3 language codes
notation: int

Ineseño
type: Language
type: Concept
ISO 639-3 code: inz
in scheme: Lexvo - ISO 639-3 language codes
notation: inz

Inor
type: Language
type: Concept
ISO 639-3 code: ior
alternative label: Inor language
definition: Inor (pronounced ), sometimes called Ennemor, is a Semitic language spoken in central Ethiopia, mainly within the Gurage Zone in the Southern Nations, Nationalities and Peoples Region, and by speakers of the language who have settled in Ethiopian cities, especially Addis Ababa. In addition to the morphological complexity that is common to all Semitic languages, Inor exhibits the very complex morphophonology characteristic of West Gurage languages.
in scheme: Lexvo - ISO 639-3 language codes
notation: ior
preferred label: Língua inor @pt

Tuma-Irumu
type: Language
type: Concept
ISO 639-3 code: iou
in scheme: Lexvo - ISO 639-3 language codes
notation: iou

Iowa-Oto
type: Language
type: Concept
ISO 639-3 code: iow
alternative label: Chiwere language
definition: Chiwere (also called Iowa-Otoe-Missouria or Báxoje-Jíwere-Ñút’achi) is a Siouan language originally spoken by the Missouria, Otoe, and Iowa peoples, who originated in the Great Lakes region but later moved throughout the midwest and plains. The language is closely related to Ho-Chunk, also known as Winnebago. Christian missionaries first documented Chiwere in the 1830s, but since then virtually nothing has been published about the language. Chiwere suffered a steady decline after extended European-American contact in the 1850s, and by 1940 the language had almost totally ceased to be spoken.
in scheme: Lexvo - ISO 639-3 language codes
notation: iow
preferred label: Iowa-oto @fr

Soga
type: Language
type: Concept
ISO 639-3 code: xog
in scheme: Lexvo - ISO 639-3 language codes
notation: xog
preferred label: soga @es

Ipili
type: Language
type: Concept
ISO 639-3 code: ipi
in scheme: Lexvo - ISO 639-3 language codes
notation: ipi

Inupiaq
type: Language
type: Concept
ISO 639-1 code: ik
ISO 639-2 Bibliographical code: ipk
ISO 639-2 Terminological code: ipk
ISO 639-3 code: ipk
alternative label: inupiaque @pt
in scheme: Lexvo - ISO 639-3 language codes
notation: ipk
preferred label: Inupiak @de
preferred label: inupiak @it
preferred label: inupiaq @es

Ipiko
type: Language
type: Concept
ISO 639-3 code: ipo
alternative label: Ipiko language
definition: Ipiko (Epai, Higa, Ipikoi) is a Papuan language of Papua New Guinea, the most divergent of the Inland Gulf languages. Despite being spoken by only a few hundred people, language use is vigorous.
in scheme: Lexvo - ISO 639-3 language codes
notation: ipo

Iquito
type: Language
type: Concept
ISO 639-3 code: iqu
alternative label: Iquito language
definition: Iquito (pronounced ) is a highly endangered Zaparoan language from Peru using the Roman script. Iquito is one of 3 surviving Zaparoan languages; the other two being Záparo, with 1-3 speakers, and Arabela with about 75 speakers. The other four Zaparoan languages, Andoa, Omurano, Aushiri, and Cahuarano. Of the ethnic Iquito population of 500, as of 2006, there are 25 fluent or native speakers, all of whom are over 55 years old, and about 25 partial or passive speakers, all of whom are over the age of 25. Iquito is spoken in the Loreto Province, the regions of the Pintoyacu, Nanay, and Chambira rivers, and the villages of San Antonia and Atalaya. Iquito is also known by the names of Iquita, Ikito, Amacacore, Hamacore, Quiturran, and Puca-Uma, though Iquito is the most common title. It is used as an official language of Peru, though the few speakers are older adults, the youngest being 52 as of 2002.
in scheme: Lexvo - ISO 639-3 language codes
notation: iqu
preferred label: Idioma iquito @es

Ikwo
type: Language
type: Concept
in scheme: Lexvo - ISO 639-3 language codes

Iresim
type: Language
type: Concept
ISO 639-3 code: ire
alternative label: Iresim language
definition: Iresim (Yerisiam) is an Austronesian language in the putative Cenderawasih (Geelvink Bay) of Indonesian Papua. It is not closely related to other languages.
in scheme: Lexvo - ISO 639-3 language codes
notation: ire

Irarutu
type: Language
type: Concept
ISO 639-3 code: irh
alternative label: Irarutu language
definition: Irarutu, or Kasira, is an Austronesian language of most of the interior of the Bomberai Peninsula of New Guinea.
in scheme: Lexvo - ISO 639-3 language codes
notation: irh

Irigwe
type: Language
type: Concept
ISO 639-3 code: iri
alternative label: Rigwe language
definition: The Rigwe language, Irigwe, is a Plateau language of Nigeria.
in scheme: Lexvo - ISO 639-3 language codes
notation: iri

Iraqw
type: Language
type: Concept
ISO 639-3 code: irk
alternative label: Iraqw language
definition: Not to be confused with Iroquois language. Iraqw is a Cushitic language spoken in Tanzania in the Arusha and Manyara Regions. It is expanding in numbers, as the Iraqw people absorb neighboring ethnic groups. The language has a large number of Datooga loanwords, especially in poetic language. The Gorowa language to the south shares numerous similarities and is sometimes considered a dialect.
in scheme: Lexvo - ISO 639-3 language codes
notation: irk

Irántxe
type: Language
type: Concept
ISO 639-3 code: irn
alternative label: Irantxe language
definition: Irantxe (Iranxe, Iranshe), also known as Münkü (Mỹky), is an indigenous American language that is spoken in Mato Grosso, Brazil by about 200 people. It is generally left unclassified due to lack of data. Ethnologue (2000) idiosyncratically assigns it to the Arawakan family, but there is no published account to back this up (Fabre 2005). The most recent descriptions treat it as a language isolate, saying that it "bears no similarity with other language families" (Arruda 2003), though this may not be based on new data (Monserrat 2010).
in scheme: Lexvo - ISO 639-3 language codes
notation: irn
preferred label: Idioma irantxe @es

Ir
type: Language
type: Concept
ISO 639-3 code: irr
alternative label: Ir language
definition: Ir (also known as In or Yir) is a language spoken by a few thousand people in the east of Salavan Province, southern Laos. One of the Ta'oih languages, it is most closely related to Ong.
in scheme: Lexvo - ISO 639-3 language codes
notation: irr
preferred label: Idioma ir @es

Kominimung
type: Language
type: Concept
ISO 639-3 code: xoi
in scheme: Lexvo - ISO 639-3 language codes
notation: xoi

Irula
type: Language
type: Concept
ISO 639-3 code: iru
alternative label: Irula language
definition: Irula is a Dravidian language spoken by the Irulas who inhabit the area of the Nilgiri mountains, in the states of Tamil Nadu and Karnataka, India.
in scheme: Lexvo - ISO 639-3 language codes
notation: iru

Kamberau
type: Language
type: Concept
ISO 639-3 code: irx
in scheme: Lexvo - ISO 639-3 language codes
notation: irx

Iraya
type: Language
type: Concept
ISO 639-3 code: iry
alternative label: Iraya language
definition: The Iraya language is a language spoken by Mangyans in the province of Mindoro in the Philippines.
in scheme: Lexvo - ISO 639-3 language codes
notation: iry

Isabi
type: Language
type: Concept
ISO 639-3 code: isa
alternative label: Isabi language
definition: Isabi (Maruhia) is a minor Papuan language spoken in Madang Province, Papua New Guinea.
in scheme: Lexvo - ISO 639-3 language codes
notation: isa

Isconahua
type: Language
type: Concept
ISO 639-3 code: isc
alternative label: Isconahua language
definition: Isconahua or Iscobaquebu is an indigenous American language of the Panoan family. It is spoken by the Isconahua tribe in Peru. The Isconahua is a very isolated tribe and has very little contact with the outside world. As of 2000, there were 82 speakers.
in scheme: Lexvo - ISO 639-3 language codes
notation: isc

Isnag
type: Language
type: Concept
ISO 639-3 code: isd
alternative label: Isnag language
definition: The Isnag language (also known as Isneg) is a language spoken by around 55,000 Isnags of the Apayao Province in the Cordillera Administrative Region in the northern Philippines. Around 85% of Isnags are capable of reading the Isnag language. Many Isnag speakers also use Ilocano.
in scheme: Lexvo - ISO 639-3 language codes
notation: isd

Italian Sign Language
type: Language
type: Concept
ISO 639-3 code: ise
definition: Italian Sign Language or ISL (Lingua dei Segni Italiana, or LIS) is the visual language employed by deaf people in Italy. Deep analysis of it began in the 1980s, along the lines of William Stokoe's research on American Sign Language in the 1960s. Until recently, most of the studies about Italian Sign Language have dealt with its phonology and vocabulary. According to the European Union for the Deaf, the majority of the 60,000 Deaf use ISL.
in scheme: Lexvo - ISO 639-3 language codes
notation: ise
preferred label: Lingua dei segni italiana @it

Xokleng
type: Language
type: Concept
ISO 639-3 code: xok
alternative label: Xokleng language
definition: Xokleng is a Ge language of Brazil.
in scheme: Lexvo - ISO 639-3 language codes
notation: xok

Irish Sign Language
type: Language
type: Concept
ISO 639-3 code: isg
definition: Irish Sign Language (ISL, ) is the sign language of Ireland, used primarily in the Republic of Ireland. It is also used in Northern Ireland, though British Sign Language (BSL) is also used. Irish Sign Language is more closely related to French Sign Language than to British Sign Language, which was first used in Dublin, Ireland. It has influenced sign languages in Australia and South Africa, and has little relation to either spoken Irish or English.
in scheme: Lexvo - ISO 639-3 language codes
notation: isg
preferred label: Langue des signes irlandaise @fr

Esan
type: Language
type: Concept
ISO 639-3 code: ish
alternative label: Esan language
definition: Esan is a tonal Edoid language of Nigeria. Dictionaries and grammar texts of the Esan language are being produced, which may help the Esan appreciate their written language. There is a high level of illiteracy among the Esan, and a large number of dialects, including Ẹkpoma, Ewohimi, Ẹkpọn, and Ohordua. Most annual Esan Kings' Council meetings are largely conducted in English for this reason.
in scheme: Lexvo - ISO 639-3 language codes
notation: ish

Nkem-Nkum
type: Language
type: Concept
ISO 639-3 code: isi
alternative label: Nkem-Nkum language
definition: Isibiri is an Ekoid language of Nigeria. There are two somewhat distinct dialects, Nkem and Nkum.
in scheme: Lexvo - ISO 639-3 language codes
notation: isi

Ishkashimi
type: Language
type: Concept
ISO 639-3 code: isk
alternative label: Ishkashimi language
definition: The Ishkashimi language is one of the Pamir languages of the Southeastern Iranian language group. Its distribution is in the Gorno-Badakhshan Autonomous Province in Tajikistan, Badakhshan Province in Afghanistan and Chitral region of Pakistan.
in scheme: Lexvo - ISO 639-3 language codes
notation: isk

Icelandic
type: Language
type: Concept
ISO 639-1 code: is
ISO 639-2 Bibliographical code: ice
ISO 639-2 Terminological code: isl
ISO 639-3 code: isl
alternative label: Icelandic language
alternative label: Idioma islandés @es
alternative label: Isländische Sprache @de
alternative label: Lingua islandese @it
alternative label: Língua islandesa @pt
alternative label: islandais @fr
definition: Icelandic is a North Germanic language, the main language of Iceland. Its closest relative is Faroese.
in scheme: Lexvo - ISO 639-3 language codes
notation: isl
preferred label: Islandais @fr
preferred label: Isländisch @de
preferred label: islandese @it
preferred label: islandés @es
preferred label: islandês @pt

Masimasi
type: Language
type: Concept
ISO 639-3 code: ism
in scheme: Lexvo - ISO 639-3 language codes
notation: ism

Isanzu
type: Language
type: Concept
ISO 639-3 code: isn
alternative label: Isanzu language
definition: Isanzu is a Bantu language of spoken by the Isanzu people south of Lake Eyasi in Tanzania.
in scheme: Lexvo - ISO 639-3 language codes
notation: isn

Isoko
type: Language
type: Concept
ISO 639-3 code: iso
alternative label: Isoko language
definition: The Isoko language is spoken in the Isoko region, Nigeria, by the Isoko people. It is linguistically similar to the neighboring Urhobo language, Epie atissa language of Bayelsa state and Engenni language of Rivers state.
in scheme: Lexvo - ISO 639-3 language codes
notation: iso

Israeli Sign Language
type: Language
type: Concept
ISO 639-3 code: isr
definition: Israeli Sign Language, or ISL, is the most commonly used sign language in the deaf community of Israel. Some other sign languages are also used in Israel, among them Al-Sayyid Bedouin Sign Language.
in scheme: Lexvo - ISO 639-3 language codes
notation: isr

Istriot
type: Language
type: Concept
ISO 639-3 code: ist
alternative label: Istriot language
definition: Istriot is a Romance language spoken in the Western Region on the coast of the Istrian Peninsula, especially in the towns of Rovinj and Vodnjan , on the upper northern part of the Adriatic Sea, in Croatia.
in scheme: Lexvo - ISO 639-3 language codes
notation: ist
preferred label: Idioma istriano @es
preferred label: Istriote @fr
preferred label: Istriotische Sprache @de
preferred label: Lingua istriota @it
preferred label: Língua istriota @pt

Isu
type: Language
type: Concept
ISO 639-3 code: isu
alternative label: Isu (Menchum Division)
in scheme: Lexvo - ISO 639-3 language codes
notation: isu

Komo
type: Language
type: Concept
ISO 639-3 code: xom
alternative label: Komo (Sudan)
alternative label: Komo language
definition: The Komo language is a Nilo-Saharan language spoken by the Komo people of Ethiopia, Sudan and Southern Sudan. It is a member of the Koman languages. The language is also called Madiin, Koma, South Koma, Central Koma and Hayahaya.
in scheme: Lexvo - ISO 639-3 language codes
notation: xom

Italian
type: Language
type: Concept
ISO 639-1 code: it
ISO 639-2 Bibliographical code: ita
ISO 639-2 Terminological code: ita
ISO 639-3 code: ita
alternative label: Idioma italiano @es
alternative label: Italian language
alternative label: Italienische Sprache @de
alternative label: Lingua italiana @it
alternative label: Língua italiana @pt
alternative label: italien @fr
definition: Italian ( or lingua italiana) is a Romance language spoken mainly in Europe: Italy, Switzerland, San Marino, Vatican City, by minorities in Malta, Monaco, Croatia, Slovenia, France, Libya, Eritrea, and Somalia, and by immigrant communities in the Americas and Australia. Many speakers are native bilinguals of both standardised Italian and other regional languages.
in scheme: Lexvo - ISO 639-3 language codes
notation: ita
preferred label: Italien @fr
preferred label: Italienisch @de
preferred label: italiano @es

Binongan Itneg
type: Language
type: Concept
ISO 639-3 code: itb
alternative label: Itneg, Binongan
in scheme: Lexvo - ISO 639-3 language codes
notation: itb

Itene
type: Language
type: Concept
ISO 639-3 code: ite
alternative label: Itene language
definition: Itene was a language of the Guapore branch of Chapacuran.
in scheme: Lexvo - ISO 639-3 language codes
notation: ite

Inlaod Itneg
type: Language
type: Concept
ISO 639-3 code: iti
alternative label: Itneg, Inlaod
in scheme: Lexvo - ISO 639-3 language codes
notation: iti

Judeo-Italian
type: Language
type: Concept
ISO 639-3 code: itk
alternative label: Judeo-Italian languages
definition: Judeo-Italian languages are the varieties of Italian used between the 10th and the 20th centuries in Italy, Corfu and Zante.
in scheme: Lexvo - ISO 639-3 language codes
notation: itk
preferred label: Giudeo-italiano @it
preferred label: Lenguas judeo-italianas @es

Itelmen
type: Language
type: Concept
ISO 639-3 code: itl
alternative label: Itelmen language
definition: Itelmen, also known as Western Itelmen and formerly known as Kamchadal, is a language belonging to the Chukotko-Kamchatkan family traditionally spoken in the Kamchatka Peninsula. Fewer than a hundred native speakers, mostly elderly, in a few settlements in the southwest of Koryak Autonomous Okrug, remained in 1993. The 2002 Census counted 3,180 ethnic Itelmen, virtually all of whom are now monolingual in Russian. However, there are attempts to revive the language, and it is being taught in a number of schools in the region.
in scheme: Lexvo - ISO 639-3 language codes
notation: itl
preferred label: Idioma itelmen @es
preferred label: Itelmenische Sprache @de
preferred label: Itelmène @fr
preferred label: Língua itelmen @pt

Itu Mbon Uzo
type: Language
type: Concept
ISO 639-3 code: itm
in scheme: Lexvo - ISO 639-3 language codes
notation: itm

Itonama
type: Language
type: Concept
ISO 639-3 code: ito
alternative label: Itonama language
definition: Itonama is a moribund language isolate spoken in the Amazonian lowlands of north-eastern Bolivia. Greenberg’s (1987) classification of Itonama as Paezan, a sub-branch of Macro-Chibchan, remains unsupported and Itonama continues to be considered an isolate or unclassified language.
in scheme: Lexvo - ISO 639-3 language codes
notation: ito
preferred label: Idioma itonama @es

Iteri
type: Language
type: Concept
ISO 639-3 code: itr
alternative label: Iteri language
definition: Iteri is a Left May language of New Guinea, in the Rocky Peak Mountains of Sandaun Province. There are about 475 speakers in all.
in scheme: Lexvo - ISO 639-3 language codes
notation: itr

Isekiri
type: Language
type: Concept
ISO 639-3 code: its
alternative label: Itsekiri language
in scheme: Lexvo - ISO 639-3 language codes
notation: its
preferred label: Itsekiri @de

Maeng Itneg
type: Language
type: Concept
ISO 639-3 code: itt
alternative label: Itneg, Maeng
in scheme: Lexvo - ISO 639-3 language codes
notation: itt

Itawit
type: Language
type: Concept
ISO 639-3 code: itv
alternative label: Itawis language
definition: Itawis, Itawit, or Tawit, is a Northern Philippine language which has close relationships to Ibanag, Ilocano, and other languages of the same order. Unlike the rest of Philippine languages, Itawit and its kin use the consonants z,f,j (spelled like dy but sounds like j) and v. For example, fefeg-fan, madyan-maid, kazzing-goat, and bavi-pig.
in scheme: Lexvo - ISO 639-3 language codes
notation: itv

Ito
type: Language
type: Concept
ISO 639-3 code: itw
in scheme: Lexvo - ISO 639-3 language codes
notation: itw

Konkomba
type: Language
type: Concept
ISO 639-3 code: xon
alternative label: Konkomba language
definition: Konkomba (Kom Komba, Kpankpam) is a Gurma language spoken in northern Ghana and Togo. It is an SVO language.
in scheme: Lexvo - ISO 639-3 language codes
notation: xon

Itik
type: Language
type: Concept
ISO 639-3 code: itx
in scheme: Lexvo - ISO 639-3 language codes
notation: itx

Moyadan Itneg
type: Language
type: Concept
ISO 639-3 code: ity
alternative label: Itneg, Moyadan
in scheme: Lexvo - ISO 639-3 language codes
notation: ity

Itzá
type: Language
type: Concept
ISO 639-3 code: itz
alternative label: Itza’ language
definition: Itza' (also Itza, Petén Itzá Maya) is one of the Yucatecan branch of the Mayan languages. The other languages in the Yucatecan branch are Yucatec, Lakantun, and Mopan.
in scheme: Lexvo - ISO 639-3 language codes
notation: itz
preferred label: Idioma itzá @es
preferred label: Itzá-Sprache @de
preferred label: Língua itzá @pt
preferred label: Maya itzá @fr

Iu Mien
type: Language
type: Concept
ISO 639-3 code: ium
alternative label: Mien, Iu
in scheme: Lexvo - ISO 639-3 language codes
notation: ium

Ibatan
type: Language
type: Concept
ISO 639-3 code: ivb
in scheme: Lexvo - ISO 639-3 language codes
notation: ivb

Ivatan
type: Language
type: Concept
ISO 639-3 code: ivv
alternative label: Ivatan language
definition: The Ivatan language, also known as Ibatan (though in ISO classification Ibatan is reserved for a closely related language spoken in the Babuyan Islands, which is assigned the code [ivb] as opposed to [ivv]) or Chirin nu Ibatan (meaning, "language or dialect of the Ivatan people"), is an Austronesian language spoken exclusively in the Batanes Islands. Despite the islands' closer proximity to Taiwan than Luzon, it is important to not group the language with Formosan languages, which in fact includes ten of eleven sub-families of the Austronesian language family, whereas Ivatan is included with other Philippine languages in the Malayo-Polynesian sub-family of the Austronesian language family, an immense group of 1248 languages not restricted to the languages of the Philippines, but, as the name suggests, includes Malayic and Oceanic languages.
in scheme: Lexvo - ISO 639-3 language codes
notation: ivv

I-Wak
type: Language
type: Concept
ISO 639-3 code: iwk
in scheme: Lexvo - ISO 639-3 language codes
notation: iwk

Iwam
type: Language
type: Concept
ISO 639-3 code: iwm
alternative label: Iwam language
definition: Iwam or May River Iwam is a language of Papua New Guinea spoken in Sandaun Province.
in scheme: Lexvo - ISO 639-3 language codes
notation: iwm

Iwur
type: Language
type: Concept
ISO 639-3 code: iwo
in scheme: Lexvo - ISO 639-3 language codes
notation: iwo

Sepik Iwam
type: Language
type: Concept
ISO 639-3 code: iws
alternative label: Iwam, Sepik
in scheme: Lexvo - ISO 639-3 language codes
notation: iws

Ixcatec
type: Language
type: Concept
ISO 639-3 code: ixc
alternative label: Ixcatec language
definition: Ixcatec, also known as Xwja, is a language spoken by the people of the Mexican village of Santa María Ixcatlan, in the northern part of the state of Oaxaca. The Ixcatec language belongs to the Popolocan branch of the Oto-manguean language family.
in scheme: Lexvo - ISO 639-3 language codes
notation: ixc
preferred label: Idioma ixcateco @es
preferred label: Ixcatèque @fr

Ixil
type: Language
type: Concept
ISO 639-3 code: ixl
alternative label: Ixil language
definition: Ixil is a Mayan language. It is the primary language of the Ixil Community -- the three villages of San Juan Cotzal, Santa Maria Nebaj, and San Gaspar Chajul -- in the highlands of Guatemala. Possibly it is three different languages.
in scheme: Lexvo - ISO 639-3 language codes
notation: ixl
preferred label: Idioma ixil @es
preferred label: Ixil-Sprache @de
preferred label: Língua ixil @pt

Xukurú
type: Language
type: Concept
ISO 639-3 code: xoo
in scheme: Lexvo - ISO 639-3 language codes
notation: xoo

Iyayu
type: Language
type: Concept
ISO 639-3 code: iya
alternative label: Iyayu language
definition: Iyayu (Idoani) is an Edoid language of Ondo State, Nigeria. It is sometimes considered the same language as Uhami.
in scheme: Lexvo - ISO 639-3 language codes
notation: iya

Mesaka
type: Language
type: Concept
ISO 639-3 code: iyo
alternative label: Mesaka language
definition: Mesaka, or Ugarə, is a divergent Tivoid language of Cameroon.
in scheme: Lexvo - ISO 639-3 language codes
notation: iyo

Yaka
type: Language
type: Concept
ISO 639-3 code: iyx
alternative label: Yaka (Congo)
in scheme: Lexvo - ISO 639-3 language codes
notation: iyx

Ingrian
type: Language
type: Concept
ISO 639-3 code: izh
alternative label: Ingrian language
definition: The Ingrian language (also called Izhorian) is a Finnic language spoken by the (mainly orthodox) Izhorians of Ingria. It has approximately 500 speakers left, most of whom are aging. It should not be confused with the Southeastern dialects of the Finnish language that became the majority language of Ingria in the 17th century with the influx of Lutheran Finnish immigrants (whose descendants, Ingrian Finns, are often referred to as Ingerians). The immigration of Lutheran Finns was promoted by Swedish authorities (who gained the area in 1617 from Russia), as the local population was (and remained) orthodox.
in scheme: Lexvo - ISO 639-3 language codes
notation: izh
preferred label: Idioma ingrio @es
preferred label: Ingrien @fr
preferred label: Ischorische Sprache @de

Izi language
type: Language
type: Concept
ISO 639-3 code: izi
alternative label: Izi-Ezaa-Ikwo-Mgbo
definition: Izi (or Izzi) is an Igbo dialect spoken in Ebonyi state in Nigeria by approximately 200,000 people, or 600,000 including the closely related to Ikwo, Ezza, and Mgbo, which form a dialect cluster known as Izi-Ezaa-Ikwo-Mgbo. This language will be referred to simply as Izi.
in scheme: Lexvo - ISO 639-3 language codes
notation: izi

Izere
type: Language
type: Concept
ISO 639-3 code: izr
in scheme: Lexvo - ISO 639-3 language codes
notation: izr

Izii
type: Language
type: Concept
in scheme: Lexvo - ISO 639-3 language codes

Kopar
type: Language
type: Concept
ISO 639-3 code: xop
alternative label: Kopar language
definition: Kopar is a Lower Sepik language spoken in Papua New Guinea.
in scheme: Lexvo - ISO 639-3 language codes
notation: xop

Jamamadí
type: Language
type: Concept
ISO 639-3 code: jaa
alternative label: Jamamadí language
definition: Jamamadi (also Jamamadí, Yamamadí, Yamamandi, Yamadi, Madi, Kapaná, Canamanti, Yamamadi, Kanamanti) is an Arawan language spoken by about 200 Jamamadi people scattered over Amazonas, Brazil.
in scheme: Lexvo - ISO 639-3 language codes
notation: jaa

Hyam
type: Language
type: Concept
ISO 639-3 code: jab
alternative label: Hyam language
definition: Hyam, or Jabba, is a regionally important dialect cluster of Plateau languages in Nigeria. Hyam of Nok is the prestige dialect. Blench (2008) treats it, Sait, and Dzar as distinct languages, and notes that Yaat and Ankun may also be separate.
in scheme: Lexvo - ISO 639-3 language codes
notation: jab

Popti'
type: Language
type: Concept
ISO 639-3 code: jac
alternative label: Jakalteko
in scheme: Lexvo - ISO 639-3 language codes
notation: jac

Jahanka
type: Language
type: Concept
ISO 639-3 code: jad
in scheme: Lexvo - ISO 639-3 language codes
notation: jad

Yabem
type: Language
type: Concept
ISO 639-3 code: jae
alternative label: Yabem language
definition: Yabem or Jabêm is an Austronesian language spoken natively (in 1978) by about 2000 people at the southern tip of the Huon Peninsula in Morobe Province, Papua New Guinea. However, Yabem was adopted as local lingua franca for evangelical and educational purposes by the German Lutheran missionaries who first arrived at Simbang, a Yabem-speaking village, in 1886.
in scheme: Lexvo - ISO 639-3 language codes
notation: jae

Jara
type: Language
type: Concept
ISO 639-3 code: jaf
alternative label: Jara language
definition: Jara, also known as Jera, is a Nigerian language spoken by 46,251 people as of the year 2000. It is spoken in Borno and Gombei States, and in the Bui, Kwaya-Kusar, Akko, and Yamaltu-Deba LGAs. It is an Afro-Asiatic language, in the Biu–Mandara language family. Jara's usage is declining; it is slowly being displaced by the more common Fulfulde and Hausa languages.
in scheme: Lexvo - ISO 639-3 language codes
notation: jaf

Jah Hut
type: Language
type: Concept
ISO 639-3 code: jah
alternative label: Jah Hut language
definition: Jah Hut (Jah Het) is an Aslian Austro-Asiatic language spoken in Peninsular Malaysia by approximately 5,100 people.
in scheme: Lexvo - ISO 639-3 language codes
notation: jah
preferred label: Jah hut @fr

Zazao
type: Language
type: Concept
ISO 639-3 code: jaj
in scheme: Lexvo - ISO 639-3 language codes
notation: jaj

Jakun
type: Language
type: Concept
ISO 639-3 code: jak
alternative label: Jakun language
definition: Jakun is an Austronesian language spoken in Malaysia. Specifically it is spoken on the east coast and inland of Peninsular Malaysia, around the Pairang River, from Pekan in Pahang to Sri Gading, east to Benut, northwest to middle Muar river area around the districts of Segamat, Muar and Ledang in Johor. There are over 27,000 speakers.
in scheme: Lexvo - ISO 639-3 language codes
notation: jak

Yalahatan
type: Language
type: Concept
ISO 639-3 code: jal
in scheme: Lexvo - ISO 639-3 language codes
notation: jal

Jamaican Patois
type: Language
type: Concept
ISO 639-3 code: jam
alternative label: Creole English, Jamaican
alternative label: Jamaican Creole English
definition: Jamaican Patois, known locally as Patois (Patwa) or Jamaican, and called Jamaican Creole by linguists, is an English-lexified creole language with West African influences spoken primarily in Jamaica and the Jamaican diaspora. It is not to be confused with Jamaican English nor with the Rastafarian use of English. The language developed in the 17th century, when slaves from West and Central Africa were exposed to, learned and nativized the vernacular and dialectal forms of English spoken by their masters: British English, Scots and Hiberno English. Jamaican Patois features a creole continuum (or a linguistic continuum) —meaning that the variety of the language closest to the lexifier language (the acrolect) cannot be distinguished systematically from intermediate varieties (collectively referred to as the mesolect) nor even from the most divergent rural varieties (collectively referred to as the basilect). Jamaicans themselves usually refer to their dialect as patois, a French term without a precise linguistic definition.
in scheme: Lexvo - ISO 639-3 language codes
notation: jam
preferred label: Creolo giamaicano @it
preferred label: Créole jamaïcain @fr
preferred label: Jamaikanisch-Kreolische Sprache @de
preferred label: Patois jamaiquino @es
preferred label: Patoá jamaicano @pt

Korubo
type: Language
type: Concept
ISO 639-3 code: xor
in scheme: Lexvo - ISO 639-3 language codes
notation: xor

Jandai
type: Language
type: Concept
ISO 639-3 code: jan
in scheme: Lexvo - ISO 639-3 language codes
notation: jan

Yanyuwa
type: Language
type: Concept
ISO 639-3 code: jao
alternative label: Yanyuwa language
definition: The Yanyuwa (also Yanyula, Anyula) language is spoken by the Yanyuwa people around the settlement of Borroloola (Yanyuwa burrulula) in the Northern Territory, Australia.
in scheme: Lexvo - ISO 639-3 language codes
notation: jao
preferred label: Idioma yanyuwa @es
preferred label: Língua yaniuwa @pt

Yaqay
type: Language
type: Concept
ISO 639-3 code: jaq
alternative label: Yaqay language
definition: Yaqay (Yaqai, Jakai, Jaqai) is a Papuan language spoken in Papua New Guinea by over ten thousand people. It's also called Mapi or Sohur; dialects are Oba-Miwamon, Nambiomon-Mabur, Bapai.
in scheme: Lexvo - ISO 639-3 language codes
notation: jaq

New Caledonian Javanese
type: Language
type: Concept
ISO 639-3 code: jas
alternative label: Javanese, New Caledonian
in scheme: Lexvo - ISO 639-3 language codes
notation: jas

Jakati
type: Language
type: Concept
ISO 639-3 code: jat
alternative label: Jakati language
definition: The Jakati language is spoken in Ukraine and Afghanistan by around 30,000 people. It is related to Western Punjabi
in scheme: Lexvo - ISO 639-3 language codes
notation: jat

Yaur
type: Language
type: Concept
ISO 639-3 code: jau
alternative label: Yaur language
definition: The Yaur language, or Jaur, is a language in the putative Cenderawasih (Geelvink Bay) branch of the Austronesian family spoken in Irian Jaya. It has about 300 speakers.
in scheme: Lexvo - ISO 639-3 language codes
notation: jau

Javanese
type: Language
type: Concept
ISO 639-1 code: jv
ISO 639-2 Bibliographical code: jav
ISO 639-2 Terminological code: jav
ISO 639-3 code: jav
in scheme: Lexvo - ISO 639-3 language codes
notation: jav
preferred label: Javanisch @de
preferred label: giavanese @it
preferred label: javanais @fr
preferred label: javanés @es
preferred label: javanês @pt

Kowaki
type: Language
type: Concept
ISO 639-3 code: xow
in scheme: Lexvo - ISO 639-3 language codes
notation: xow

Jambi Malay
type: Language
type: Concept
ISO 639-3 code: jax
alternative label: Malay, Jambi
definition: Jambi Malay is a variant of the Malay language spoken in the Jambi province of Indonesia.
in scheme: Lexvo - ISO 639-3 language codes
notation: jax

Yan-nhangu
type: Language
type: Concept
ISO 639-3 code: jay
alternative label: Yan-nhangu language
definition: Yan-nhaŋu (alternatively Yan-nhangu, Yanhangu, Jarnango) is an indigenous Australian language spoken by about 15 people the traditional owners of the seas and Crocodile Islands, off the coast of the Northern Territory. The Yan-nhaŋu language belongs to the Yolŋu Matha language group of the Yolŋu people of Arnhem Land in northern Australia.
in scheme: Lexvo - ISO 639-3 language codes
notation: jay

Jawe
type: Language
type: Concept
ISO 639-3 code: jaz
in scheme: Lexvo - ISO 639-3 language codes
notation: jaz

Judeo-Berber
type: Language
type: Concept
ISO 639-3 code: jbe
alternative label: Judeo-Berber language
definition: Judeo-Berber is a term used primarily for the Berber varieties traditionally spoken by the Jewish communities of certain parts of central and southern Morocco. Speakers emigrated to Israel in the 1950s and 1960s. While mutually comprehensible with the Tamazight spoken by most inhabitants of the area (Galand-Pernet et al. 1970:14), these dialects are distinguished by the use of Hebrew loanwords and the pronunciation of š as s (as in many Jewish Moroccan Arabic dialects).
in scheme: Lexvo - ISO 639-3 language codes
notation: jbe
preferred label: Judeo-Bereber @es
preferred label: Judeu-berbere @pt
preferred label: Judäo-Berberische Sprache @de
preferred label: Judéo-berbère @fr

Badjiri
type: Language
type: Concept
in scheme: Lexvo - ISO 639-3 language codes

Arandai
type: Language
type: Concept
ISO 639-3 code: jbj
in scheme: Lexvo - ISO 639-3 language codes
notation: jbj

Barikewa
type: Language
type: Concept
ISO 639-3 code: jbk
in scheme: Lexvo - ISO 639-3 language codes
notation: jbk

Pirriya
type: Language
type: Concept
in scheme: Lexvo - ISO 639-3 language codes

Lingua nefusi
type: Language
type: Concept
ISO 639-3 code: jbn
alternative label: Nafusi language
definition: Nafusi (also spelled Nefusi, Berber name: Maziɣ or Tanfusit) is the Berber language of the Nafusa Mountains (Drar n infusen), a large area in northwestern Libya. This variety of the Berber language is spoken by the Ibadite communities around Jadu, Nalut (Lalut), and Yafran. According to the Ethnologue, it has some 184,000 speakers in Libya (controversially including Zuara Berber.) The dialect of Yefren in the east differs somewhat from that of Nalut and Jadu in the west. A number of Old Nafusi phrases appear in Ibadite manuscripts as early as the 12th century, representing some of the earliest manuscript records of Berber.
in scheme: Lexvo - ISO 639-3 language codes
notation: jbn
preferred label: Nafusi

Lojban
type: Language
type: Concept
ISO 639-2 Bibliographical code: jbo
ISO 639-2 Terminological code: jbo
ISO 639-3 code: jbo
alternative label: Lingua lojban @it
preferred label: lojban @fr
definition: Lojban (pronounced ) is a constructed, syntactically unambiguous human language based on predicate logic, succeeding the project of Loglan. The name "Lojban" is a combination of loj and ban, which are short forms of logji (logic) and bangu (language), respectively.
in scheme: Lexvo - ISO 639-3 language codes
notation: jbo

Jofotek-Bromnya
type: Language
type: Concept
ISO 639-3 code: jbr
in scheme: Lexvo - ISO 639-3 language codes
notation: jbr

Jabutí
type: Language
type: Concept
ISO 639-3 code: jbt
alternative label: Djeoromitxi language
definition: Djeoromitxi or Jabutí is an nearly extinct Yabutian language that as of 1990 was spoken by only five people in Rondônia, Brazil, at the headwaters of the Rio Branco.
in scheme: Lexvo - ISO 639-3 language codes
notation: jbt
preferred label: Lenguas yabutí @es
preferred label: Língua jabuti @pt

Jukun Takum
type: Language
type: Concept
ISO 639-3 code: jbu
alternative label: Jukun Takum language
definition: Jukun (Njikum), or more precisely Jukun Takum, is a Jukunoid language of Cameroon used as a trade language in Nigeria. Though there are only a few thousand native speakers, and only a dozen in Nigeria (as of 2000), it is spoken as a second language in Nigeria by tens of thousands (40,000 reported in 1979).
in scheme: Lexvo - ISO 639-3 language codes
notation: jbu

Pecheneg
type: Language
type: Concept
ISO 639-3 code: xpc
alternative label: Pecheneg language
definition: Pecheneg language is the extinct Turkic language spoken by the Pechenegs in Eastern Europe.
in scheme: Lexvo - ISO 639-3 language codes
notation: xpc
preferred label: Lingua pecenega @it
preferred label: Petchénègue @fr

Yawijibaya
type: Language
type: Concept
ISO 639-3 code: jbw
in scheme: Lexvo - ISO 639-3 language codes
notation: jbw

Jamaican Country Sign Language
type: Language
type: Concept
ISO 639-3 code: jcs
in scheme: Lexvo - ISO 639-3 language codes
notation: jcs

Krymchak
type: Language
type: Concept
ISO 639-3 code: jct
alternative label: Krymchak language
definition: The Krymchak language (кърымчах тыльы) is a Turkic language spoken in Crimea by the Krymchak people. It is often considered to be a Crimean Tatar dialect. The language is sometimes referred to as Judeo-Crimean Tatar.
in scheme: Lexvo - ISO 639-3 language codes
notation: jct
preferred label: Krimtschakische Sprache @de
preferred label: Lingua krymchak @it

Jad
type: Language
type: Concept
ISO 639-3 code: jda
in scheme: Lexvo - ISO 639-3 language codes
notation: jda

Jadgali
type: Language
type: Concept
ISO 639-3 code: jdg
in scheme: Lexvo - ISO 639-3 language codes
notation: jdg

Judeo-Tat
type: Language
type: Concept
ISO 639-3 code: jdt
alternative label: Juhuri language
definition: Juhuri, Juwuri or Judæo-Tat (çuhuri / жугьури / ז'אוּהאוּראִ) is a form of the Tat language and is the traditional language of the Mountain Jews of the eastern Caucasus Mountains, especially Azerbaijan and Dagestan, now mainly spoken in Israel.
in scheme: Lexvo - ISO 639-3 language codes
notation: jdt
preferred label: Juhuri @fr

Jebero
type: Language
type: Concept
ISO 639-3 code: jeb
alternative label: Jebero language
definition: Jebero (Chebero, Xebero, Xihuila) is an indigenous American language spoken by the Jebero people of Peru. It is only spoken by older adults, though there is interest in reviving the language.
in scheme: Lexvo - ISO 639-3 language codes
notation: jeb

Jerung
type: Language
type: Concept
ISO 639-3 code: jee
in scheme: Lexvo - ISO 639-3 language codes
notation: jee

Jeng
type: Language
type: Concept
ISO 639-3 code: jeg
alternative label: Jeng language
definition: Jeng (or Cheng) is a Mon–Khmer language spoken by over seven thousand people in Attopu Province, southern Laos.
in scheme: Lexvo - ISO 639-3 language codes
notation: jeg

Jeh
type: Language
type: Concept
ISO 639-3 code: jeh
alternative label: Jeh language
definition: Jeh (also known as Die or Gie) is a language spoken by more than fifteen thousand people in Vietnam. There are also several thousand speakers in the provinces of Xekong and Attapu in Laos.
in scheme: Lexvo - ISO 639-3 language codes
notation: jeh

Yei
type: Language
type: Concept
ISO 639-3 code: jei
alternative label: Yei language
definition: Yey (Yei, Jei, Je, Yei-Nan) is a Papuan language of Papua New Guinea. The Upper and Lower Yey dialects are only mutually intelligible with difficulty.
in scheme: Lexvo - ISO 639-3 language codes
notation: jei

Jeri Kuo
type: Language
type: Concept
ISO 639-3 code: jek
in scheme: Lexvo - ISO 639-3 language codes
notation: jek

San Vicente Coatlán Zapotec
type: Language
type: Concept
ISO 639-3 code: zpt
alternative label: Zapotec, San Vicente Coatlán
in scheme: Lexvo - ISO 639-3 language codes
notation: zpt

Yelmek
type: Language
type: Concept
ISO 639-3 code: jel
alternative label: Yelmek language
definition: Yelmek (Jelmik) is a language of the proposed South-Central Papuan family in West Papua.
in scheme: Lexvo - ISO 639-3 language codes
notation: jel

Liberia Kpelle
type: Language
type: Concept
ISO 639-3 code: xpe
alternative label: Kpelle, Liberia
in scheme: Lexvo - ISO 639-3 language codes
notation: xpe

Dza
type: Language
type: Concept
ISO 639-3 code: jen
alternative label: Jen language
definition: Dza, Jen, is an Adamawa language of Nigeria.
in scheme: Lexvo - ISO 639-3 language codes
notation: jen
preferred label: Jen @de

Jere
type: Language
type: Concept
ISO 639-3 code: jer
in scheme: Lexvo - ISO 639-3 language codes
notation: jer

Manem
type: Language
type: Concept
ISO 639-3 code: jet
in scheme: Lexvo - ISO 639-3 language codes
notation: jet

Jonkor Bourmataguil
type: Language
type: Concept
ISO 639-3 code: jeu
alternative label: Jonkor Bourmataguil language
definition: Jonkor Bourmataguil (also known as Djongor Bourmataguil, Dougne, Karakir) is an Afro-Asiatic language spoken in Chad.
in scheme: Lexvo - ISO 639-3 language codes
notation: jeu

Ngbee
type: Language
type: Concept
ISO 639-3 code: jgb
alternative label: Ngbee language
definition: Ngbee is an extinct Bantu language of uncertain affiliation. Guthrie assigned to the Nyali cluster. Ethnologue leaves it unclassified.
in scheme: Lexvo - ISO 639-3 language codes
notation: jgb

Judeo-Georgian
type: Language
type: Concept
ISO 639-3 code: jge
alternative label: Judaeo-Georgian
definition: Judaeo-Georgian (also known as Kivruli and Gruzinic) is the traditional language spoken by the Georgian Jews, the ancient Jewish community of the Caucasus nation of Georgia.
in scheme: Lexvo - ISO 639-3 language codes
notation: jge
preferred label: Giudeo-georgiano @it
preferred label: Gruzínico @es
preferred label: Judäo-Georgisch @de

Gwak
type: Language
type: Concept
ISO 639-3 code: jgk
in scheme: Lexvo - ISO 639-3 language codes
notation: jgk

Ngomba
type: Language
type: Concept
ISO 639-3 code: jgo
in scheme: Lexvo - ISO 639-3 language codes
notation: jgo

Phrygian
type: Language
type: Concept
ISO 639-3 code: xpg
alternative label: Phrygian language
definition: The Phrygian language was the Indo-European language of the Phrygians, spoken in Asia Minor during Classical Antiquity (ca. 8th century BC to 5th century AD).
in scheme: Lexvo - ISO 639-3 language codes
notation: xpg
preferred label: Idioma frigio @es
preferred label: Lingua frigia @it
preferred label: Língua frígia @pt
preferred label: Phrygische Sprache @de

Jehai
type: Language
type: Concept
ISO 639-3 code: jhi
alternative label: Jehai language
definition: Jahai (Jehai) is an aboriginal Mon–Khmer language spoken in Malaya. The small number of speakers is increasing.
in scheme: Lexvo - ISO 639-3 language codes
notation: jhi

Jhankot Sign Language
type: Language
type: Concept
ISO 639-3 code: jhs
definition: Jhankot Sign Language is an indigenous sign language of the village of Jhankot in western Nepal. The Deaf make up 10% of the village, and Jhankot SL is widely known by the hearing community.
in scheme: Lexvo - ISO 639-3 language codes
notation: jhs

Jina
type: Language
type: Concept
ISO 639-3 code: jia
alternative label: Jina language
definition: Jina (Zina) is a minor Afro-Asiatic language of Cameroon. The Muxule variety may be a distinct language.
in scheme: Lexvo - ISO 639-3 language codes
notation: jia

Jibu
type: Language
type: Concept
ISO 639-3 code: jib
alternative label: Jibu language
definition: Jibu is a Jukunoid language of Nigeria.
in scheme: Lexvo - ISO 639-3 language codes
notation: jib

Tol
type: Language
type: Concept
ISO 639-3 code: jic
alternative label: Jicaque language
definition: (Eastern) Jicaque, also known as Tol, Tolupan, and Torupan, is a language spoken by some 300 Tolupan people in La Montaña del Flor, Honduras. In the 16th century it extended to cover much of western Yoro. There are two Tolan languages, Eastern Jicaque or Tol and Western Jicaque, which had been spoken around El Palmar, Deptment of Cortés, but which is now extinct. These are close enough to be considered dialects of a single language by some linguists.
in scheme: Lexvo - ISO 639-3 language codes
notation: jic
preferred label: Jicaquean @de
preferred label: Langues jicaques @fr
preferred label: Lenguas jicaque-tol @es

Bu
type: Language
type: Concept
ISO 639-3 code: jid
in scheme: Lexvo - ISO 639-3 language codes
notation: jid

Jilbe
type: Language
type: Concept
ISO 639-3 code: jie
alternative label: Jilbe language
definition: Jilbe (also known as Zoulbou) is an Afro-Asiatic language spoken in a single village in Borno State, Nigeria.
in scheme: Lexvo - ISO 639-3 language codes
notation: jie

Djingili
type: Language
type: Concept
ISO 639-3 code: jig
alternative label: Jingulu language
definition: Jingulu is an Australian language spoken by the Jingili people in the Northern Territory of Australia, historically around the township of Elliot. It is an endangered language with only between 10 and 15 speakers in 1997,
in scheme: Lexvo - ISO 639-3 language codes
notation: jig

sTodsde
type: Language
type: Concept
ISO 639-3 code: jih
alternative label: Shangzhai
in scheme: Lexvo - ISO 639-3 language codes
notation: jih

Jiiddu
type: Language
type: Concept
ISO 639-3 code: jii
alternative label: Jiiddu language
definition: Jiiddu (also known as Jiddu, Af-Jiiddu) is an Afro-Asiatic language spoken in Somalia in the Lower Shabeelle Bay and Middle Jubba regions.
in scheme: Lexvo - ISO 639-3 language codes
notation: jii

Jilim
type: Language
type: Concept
ISO 639-3 code: jil
alternative label: Jilim language
definition: Jilim is a Rai Coast language spoken in Madang Province, Papua New Guinea.
in scheme: Lexvo - ISO 639-3 language codes
notation: jil

Jimi
type: Language
type: Concept
ISO 639-3 code: jim
alternative label: Jimi (Cameroon)
alternative label: Jimi language
definition: Jimi (also known as Djimi, Jimjimen, 'Um Falin) is an Afro-Asiatic language spoken in Cameroon in Far North Province on the Nigerian border in and around Bourrha. Dialects are Djimi, Jimo, Malabu, Wadi, and Zumo. ISO 639-3 refers to this Jimi as to distinguish it from the West Chadic Jimi (Nigeria).
in scheme: Lexvo - ISO 639-3 language codes
notation: jim

Jiamao
type: Language
type: Concept
ISO 639-3 code: jio
alternative label: Jiamao language
definition: Jiamao is one of the Hlai languages of the Li people. In the 1980s it was spoken by 50,000 people in central and south-central Hainan Island, mostly in Jiamao Township, Baoting County. It shares less than half of its lexicon with standard Hlai. Graham Thurgood has suggested that Jiamao was originally a non-Hlai (possibly Austro-Asiatic) language.
in scheme: Lexvo - ISO 639-3 language codes
notation: jio

Lavrung
type: Language
type: Concept
ISO 639-3 code: jiq
alternative label: Guanyinqiao
alternative label: Lavrung language
definition: Lavrung is a Jiarongic language of China. It used to go by its Chinese name, Guanyinqiao, in Ethnologue.
in scheme: Lexvo - ISO 639-3 language codes
notation: jiq

Jita
type: Language
type: Concept
ISO 639-3 code: jit
alternative label: Jita language
definition: Jita is a Bantu language of Tanzania.
in scheme: Lexvo - ISO 639-3 language codes
notation: jit

Youle Jinuo
type: Language
type: Concept
ISO 639-3 code: jiu
alternative label: Jinuo, Youle
in scheme: Lexvo - ISO 639-3 language codes
notation: jiu

Pictish
type: Language
type: Concept
ISO 639-3 code: xpi
alternative label: Pictish language
definition: Pictish is a term used for the extinct language or languages thought to have been spoken by the Picts, the people of northern and central Scotland in the Early Middle Ages. The idea that a distinct Pictish language was perceived at some point is attested clearly in Bede's early 8th-century Historia ecclesiastica gentis Anglorum, which names Pictish as a language distinct from both Welsh and Gaelic.
in scheme: Lexvo - ISO 639-3 language codes
notation: xpi
preferred label: Idioma picto @es
preferred label: Lingua pittica @it
preferred label: Línguas pictas @pt
preferred label: Picte @fr

Shuar
type: Language
type: Concept
ISO 639-3 code: jiv
alternative label: Shuar language
definition: Shuar, also known as Chiwaro, Jibaro, Jivaro, Shuara, or Xivaro, is a Jivaroan language spoken in the Southeastern jungle of the Morona-Santiago Province in Ecuador.
in scheme: Lexvo - ISO 639-3 language codes
notation: jiv
preferred label: Idioma shuar @es

Buyuan Jinuo
type: Language
type: Concept
ISO 639-3 code: jiy
alternative label: Jinuo, Buyuan
in scheme: Lexvo - ISO 639-3 language codes
notation: jiy

Bankal
type: Language
type: Concept
ISO 639-3 code: jjr
in scheme: Lexvo - ISO 639-3 language codes
notation: jjr

Mobwa Karen
type: Language
type: Concept
ISO 639-3 code: jkm
alternative label: Karen, Mobwa
in scheme: Lexvo - ISO 639-3 language codes
notation: jkm

Kubo
type: Language
type: Concept
ISO 639-3 code: jko
in scheme: Lexvo - ISO 639-3 language codes
notation: jko

Paku Karen
type: Language
type: Concept
ISO 639-3 code: jkp
alternative label: Karen, Paku
in scheme: Lexvo - ISO 639-3 language codes
notation: jkp

Idioma koro
type: Language
type: Concept
ISO 639-3 code: jkr
alternative label: Koro (India)
alternative label: Koro language
definition: Koro is a possibly Tibeto-Burman language spoken by approximately 800–1,200 people in the East Kameng district at the western end of Arunachal Pradesh, India. Few speakers are under 20 years old. Although it has resemblances to Tani farther to the east, it appears to be at least a separate branch of Tibeto-Burman. Researchers hypothesize it may have originated from a group of people enslaved and brought to the area.
in scheme: Lexvo - ISO 639-3 language codes
notation: jkr
preferred label: Koro
preferred label: Lingua Koro @it

Labir
type: Language
type: Concept
ISO 639-3 code: jku
in scheme: Lexvo - ISO 639-3 language codes
notation: jku

Ngile
type: Language
type: Concept
ISO 639-3 code: jle
alternative label: Ngile language
definition: Ngile, also Daloka (Taloka) [a dialect], is a Niger–Congo language in the Talodi family spoken in Kordofan, Sudan. It is 80% lexically similar with Dengebu, which is also spoken by the Mesakin / Masakin people.
in scheme: Lexvo - ISO 639-3 language codes
notation: jle

Jamaican Sign Language
type: Language
type: Concept
ISO 639-3 code: jls
in scheme: Lexvo - ISO 639-3 language codes
notation: jls

Dima
type: Language
type: Concept
ISO 639-3 code: jma
in scheme: Lexvo - ISO 639-3 language codes
notation: jma

Zumbun
type: Language
type: Concept
ISO 639-3 code: jmb
alternative label: Zumbun language
definition: Zumbun (also Jimbin, Jimbinawa) is an Afro-Asiatic language spoken in Bauchi State, Nigeria.
in scheme: Lexvo - ISO 639-3 language codes
notation: jmb

Machame
type: Language
type: Concept
ISO 639-3 code: jmc
alternative label: Machame language
definition: The Machame language, Kimashame, is a Bantu language of Tanzania, spoken by approximately 300,000 Chaga people. It is spoken in the Chaga area of the Kilimanjaro region, and forms a dialect continuum with other Chaga languages.
in scheme: Lexvo - ISO 639-3 language codes
notation: jmc
preferred label: machame @es

Yamdena
type: Language
type: Concept
ISO 639-3 code: jmd
alternative label: Yamdena language
definition: Yamdena is an Austronesian language of the Maluku Islands in Indonesia.
in scheme: Lexvo - ISO 639-3 language codes
notation: jmd

Jimi
type: Language
type: Concept
ISO 639-3 code: jmi
alternative label: Jimi (Nigeria)
alternative label: Jimi language
definition: Jimi (also known as Bi-Gimu) is an Afro-Asiatic language spoken in Jimi village in Bauchi State, Nigeria. ISO 639-3 refers to this Jimi as to distinguish it from the Biu–Mandara Jimi (Cameroon).
in scheme: Lexvo - ISO 639-3 language codes
notation: jmi

Mpalitjanh
type: Language
type: Concept
ISO 639-3 code: xpj
in scheme: Lexvo - ISO 639-3 language codes
notation: xpj

Jumli
type: Language
type: Concept
ISO 639-3 code: jml
in scheme: Lexvo - ISO 639-3 language codes
notation: jml

Makuri Naga
type: Language
type: Concept
ISO 639-3 code: jmn
alternative label: Naga, Makuri
in scheme: Lexvo - ISO 639-3 language codes
notation: jmn

Kamara
type: Language
type: Concept
ISO 639-3 code: jmr
in scheme: Lexvo - ISO 639-3 language codes
notation: jmr

Mashi
type: Language
type: Concept
ISO 639-3 code: jms
alternative label: Mashi (Nigeria)
in scheme: Lexvo - ISO 639-3 language codes
notation: jms

Mouwase
type: Language
type: Concept
ISO 639-3 code: jmw
in scheme: Lexvo - ISO 639-3 language codes
notation: jmw

Western Juxtlahuaca Mixtec
type: Language
type: Concept
ISO 639-3 code: jmx
alternative label: Mixtec, Western Juxtlahuaca
in scheme: Lexvo - ISO 639-3 language codes
notation: jmx

Jangshung
type: Language
type: Concept
ISO 639-3 code: jna
in scheme: Lexvo - ISO 639-3 language codes
notation: jna

Kulina Pano
type: Language
type: Concept
ISO 639-3 code: xpk
alternative label: Kulino language
alternative label: Pano, Kulina
definition: Kulino is a Panoan language of Brazil.
in scheme: Lexvo - ISO 639-3 language codes
notation: xpk

Jandavra
type: Language
type: Concept
ISO 639-3 code: jnd
in scheme: Lexvo - ISO 639-3 language codes
notation: jnd

Yangman
type: Language
type: Concept
ISO 639-3 code: jng
in scheme: Lexvo - ISO 639-3 language codes
notation: jng

Janji
type: Language
type: Concept
ISO 639-3 code: jni
in scheme: Lexvo - ISO 639-3 language codes
notation: jni

Yemsa
type: Language
type: Concept
ISO 639-3 code: jnj
alternative label: Yemsa language
definition: Yemsa is the language of the Yem people of the former Kingdom of Yamma, known as Kingdom of Janjero to the Amhara. It is a member of the Omotic group of languages, most closely related to Kaffa. It is distinctive in having a several levels of lexicon contingent on social hierarchy, rather like Japanese and Javanese. The estimated number of speakers varies wildly from about 1000 (Bender,1976) to half a million (Aklilu, 1993).
in scheme: Lexvo - ISO 639-3 language codes
notation: jnj
preferred label: Yem @de

Rawat
type: Language
type: Concept
ISO 639-3 code: jnl
alternative label: Rawat language
definition: Rawat (Raute), or "Janggali" (Jungle), is a possibly Tibeto-Burman language of Nepal, with maybe a thousand speakers in India. The name Rawat is cognate with Raute.
in scheme: Lexvo - ISO 639-3 language codes
notation: jnl

Jaunsari
type: Language
type: Concept
ISO 639-3 code: jns
in scheme: Lexvo - ISO 639-3 language codes
notation: jns

Joba
type: Language
type: Concept
ISO 639-3 code: job
in scheme: Lexvo - ISO 639-3 language codes
notation: job

Wojenaka
type: Language
type: Concept
ISO 639-3 code: jod
in scheme: Lexvo - ISO 639-3 language codes
notation: jod

Jorá
type: Language
type: Concept
ISO 639-3 code: jor
in scheme: Lexvo - ISO 639-3 language codes
notation: jor

Jordanian Sign Language
type: Language
type: Concept
ISO 639-3 code: jos
in scheme: Lexvo - ISO 639-3 language codes
notation: jos

Jowulu
type: Language
type: Concept
ISO 639-3 code: jow
alternative label: Jowulu language
definition: Jowulu, also known as Jɔ or ambiguously as Samogho, is a minor Mande language of Mali.
in scheme: Lexvo - ISO 639-3 language codes
notation: jow

Jewish Palestinian Aramaic
type: Language
type: Concept
ISO 639-3 code: jpa
alternative label: Aramaic, Jewish Palestinian
definition: The Jewish Palestinian Aramaic, also called Galilean Aramaic, was a Western Aramaic language spoken by the Jews in Palestine in the early first millennium. Its closest relatives are the Samaritan Aramaic and Christian Palestinian Aramaic. The language is notable for being that spoken by Jesus.
in scheme: Lexvo - ISO 639-3 language codes
notation: jpa
preferred label: Jüdisch-Palästinisches Aramäisch @de

Pumpokol
type: Language
type: Concept
ISO 639-3 code: xpm
alternative label: Pumpokol language
definition: Pumpokol is one of the Yeniseian languages. It has been extinct since the 18th century.
in scheme: Lexvo - ISO 639-3 language codes
notation: xpm
preferred label: Poumpokole @fr

Japanese
type: Language
type: Concept
ISO 639-1 code: ja
ISO 639-2 Bibliographical code: jpn
ISO 639-2 Terminological code: jpn
ISO 639-3 code: jpn
alternative label: Idioma japonés @es
alternative label: Japanese language
alternative label: Japanische Sprache @de
alternative label: Japonais @fr
alternative label: Lingua giapponese @it
alternative label: Língua japonesa @pt
in scheme: Lexvo - ISO 639-3 language codes
notation: jpn
preferred label: Japanisch @de
preferred label: giapponese @it
preferred label: japonais @fr
preferred label: japonés @es
preferred label: japonês @pt

Judeo-Persian
type: Language
type: Concept
ISO 639-2 Bibliographical code: jpr
ISO 639-2 Terminological code: jpr
ISO 639-3 code: jpr
in scheme: Lexvo - ISO 639-3 language codes
notation: jpr
preferred label: Jüdisch-Persisch @de
preferred label: giudeo persiano @it
preferred label: judaico-persa @pt
preferred label: judeo-persa @es
preferred label: judéo-persan @fr

Idioma jacaru
type: Language
type: Concept
ISO 639-3 code: jqr
alternative label: Jaqaru language
definition: Jaqaru (Haq'aru) is a language of the Aymara family. It is also known as Jaqi and Aru. It is spoken in the districts of Tupe and Catahuasi in the province of Yauyos, within the Peruvian department of Lima. Most of the 2000 ethnic Jaqaru have migrated to Lima.
in scheme: Lexvo - ISO 639-3 language codes
notation: jqr
preferred label: Jaqaru

Jarai
type: Language
type: Concept
ISO 639-3 code: jra
alternative label: Jarai language
definition: The Jarai language is a Malayo-Polynesian language spoken by the Jarai people of Vietnam and Cambodia. The speakers of Jarai number approximately 332,557. They are the largest of the upland ethnic groups of Vietnam's Central Highlands known as Degar or Montagnards.
in scheme: Lexvo - ISO 639-3 language codes
notation: jra
preferred label: Jaraï @fr

Judeo-Arabic
type: Language
type: Concept
ISO 639-2 Bibliographical code: jrb
ISO 639-2 Terminological code: jrb
ISO 639-3 code: jrb
alternative label: Judeo-Arabic languages
alternative label: Jüdisch-Arabisch @de
alternative label: Línguas judaico-árabes @pt
alternative label: giudeo arabo @it
alternative label: judeo-árabe @es
alternative label: judéo-arabe @fr
definition: The Judeo-Arabic languages (, ), are a continuum of Arabic dialects spoken by Jews living or formerly living in the Arab world; the term also refers more or less to Classical Arabic written in the Hebrew script, particularly in the Middle Ages. Just as with the rest of the Arab world, Arab Jews had different dialects depending on where they lived. This phenomenon may be compared to cases such as different forms of Yiddish (Judeo-German) such as Western Yiddish and Eastern Yiddish, or forms of Ladino (Judeo-Spanish) in areas such as the Balkans, Thessaloníki/Istanbul, Morocco, etc.
in scheme: Lexvo - ISO 639-3 language codes
notation: jrb
preferred label: Giudeo-Arabo @it
preferred label: Judeoárabe @es
preferred label: Judäo-Arabisch @de
preferred label: Judéo-arabe @fr
preferred label: judaico-arábico @pt

Jiru
type: Language
type: Concept
ISO 639-3 code: jrr
in scheme: Lexvo - ISO 639-3 language codes
notation: jrr

Jorto
type: Language
type: Concept
ISO 639-3 code: jrt
alternative label: Jorto language
definition: Jorto is an Afro-Asiatic language spoken in Plateau State, Nigeria.
in scheme: Lexvo - ISO 639-3 language codes
notation: jrt

Japrería
type: Language
type: Concept
ISO 639-3 code: jru
in scheme: Lexvo - ISO 639-3 language codes
notation: jru

Japanese Sign Language
type: Language
type: Concept
ISO 639-3 code: jsl
in scheme: Lexvo - ISO 639-3 language codes
notation: jsl
preferred label: Japanische Gebärdensprache @de
preferred label: Língua de Sinais Japonesa @pt

Júma
type: Language
type: Concept
ISO 639-3 code: jua
in scheme: Lexvo - ISO 639-3 language codes
notation: jua

Wannu
type: Language
type: Concept
ISO 639-3 code: jub
in scheme: Lexvo - ISO 639-3 language codes
notation: jub

Jurchen
type: Language
type: Concept
ISO 639-3 code: juc
alternative label: Jurchen language
definition: Jurchen language is an extinct language. It was spoken by Jurchen people of eastern Manchuria, the creators of the Jin Empire in the northeastern China of the 12th–13th centuries. It is classified as a Southwestern Tungusic language.
in scheme: Lexvo - ISO 639-3 language codes
notation: juc

Kapinawá
type: Language
type: Concept
ISO 639-3 code: xpn
alternative label: Kapinawá language
definition: Kapinawâ is an extinct unclassified language of eastern Brazil.
in scheme: Lexvo - ISO 639-3 language codes
notation: xpn

Worodougou
type: Language
type: Concept
ISO 639-3 code: jud
in scheme: Lexvo - ISO 639-3 language codes
notation: jud

Hõne
type: Language
type: Concept
ISO 639-3 code: juh
in scheme: Lexvo - ISO 639-3 language codes
notation: juh

Ngadjuri
type: Language
type: Concept
ISO 639-3 code: jui
in scheme: Lexvo - ISO 639-3 language codes
notation: jui

Wapan
type: Language
type: Concept
ISO 639-3 code: juk
alternative label: Wapan language
definition: Wapan or Jukun Wapan, also known as Wukari after the local town, is a major Jukunoid language of Nigeria.
in scheme: Lexvo - ISO 639-3 language codes
notation: juk

Jirel
type: Language
type: Concept
ISO 639-3 code: jul
in scheme: Lexvo - ISO 639-3 language codes
notation: jul

Jumjum
type: Language
type: Concept
ISO 639-3 code: jum
alternative label: Jumjum language
definition: Jumjum is a Luo language of South Sudan. It forms a dialect continuum with Mabaan.
in scheme: Lexvo - ISO 639-3 language codes
notation: jum

Juang
type: Language
type: Concept
ISO 639-3 code: jun
alternative label: Juang language
definition: The Juang language is a language spoken primarily by the Juang people of eastern India.
in scheme: Lexvo - ISO 639-3 language codes
notation: jun

Jiba
type: Language
type: Concept
ISO 639-3 code: juo
in scheme: Lexvo - ISO 639-3 language codes
notation: juo

Hupdë
type: Language
type: Concept
ISO 639-3 code: jup
in scheme: Lexvo - ISO 639-3 language codes
notation: jup

Jurúna
type: Language
type: Concept
ISO 639-3 code: jur
alternative label: Jurúna language
definition: The Jurúna language is spoken in Brazil. Specifically it is spoken in the North Mato Grosso, Xingú Park. In 2001 there were 278 native speakers.
in scheme: Lexvo - ISO 639-3 language codes
notation: jur

Jumla Sign Language
type: Language
type: Concept
ISO 639-3 code: jus
definition: Jumla Sign Language is an indigenous sign language of the town of Jumla in western Nepal. Ethnologue reports that there is a Nepalese Sign Language school in Jumla, and that the students come from a 1–2-day walk away and do not speak Jumla Sign Language.
in scheme: Lexvo - ISO 639-3 language codes
notation: jus

Pochutec
type: Language
type: Concept
ISO 639-3 code: xpo
alternative label: Pochutec language
definition: Pochutec is an extinct Uto-Aztecan language of the Nahuan (or Aztecan) branch which was spoken in and around the town of Pochutla on the Pacific coast of Oaxaca, Mexico. In 1917 it was documented in a monograph by Franz Boas, who considered the language nearly extinct. In the 1970s another investigator found two speakers around Pochutla who still remembered a few of the words recorded by Boas.
in scheme: Lexvo - ISO 639-3 language codes
notation: xpo
preferred label: Idioma pochuteco @es

Jutish
type: Language
type: Concept
ISO 639-3 code: jut
alternative label: Jutlandic dialect
definition: Jutlandic or Jutish (Danish: jysk or, in old spelling, jydsk; ) is a term for the western dialects of Danish, spoken on the peninsula of Jutland.
in scheme: Lexvo - ISO 639-3 language codes
notation: jut
preferred label: Juto @es
preferred label: Jütisch @de

Ju
type: Language
type: Concept
ISO 639-3 code: juu
alternative label: Ju language
definition: Ju is a minor Chadic language of Nigeria.
in scheme: Lexvo - ISO 639-3 language codes
notation: juu

Wãpha
type: Language
type: Concept
ISO 639-3 code: juw
in scheme: Lexvo - ISO 639-3 language codes
notation: juw

Juray
type: Language
type: Concept
ISO 639-3 code: juy
alternative label: Juray language
definition: Juray is a Munda language of India. It is very close to Sora.
in scheme: Lexvo - ISO 639-3 language codes
notation: juy

Javindo
type: Language
type: Concept
ISO 639-3 code: jvd
alternative label: Javindo language
definition: Javindo, also known by the pejorative name Krontjong, was a Dutch-based creole language spoken on Java, Indonesia. The name Javindo is a portmanteau of Java and Indo, the Dutch word for a person of mixed Indonesian and Dutch descent. This contact language developed from communication between Javanese speaking mothers and Dutch speaking fathers in Indo families. Its main speakers were Indo Eurasian people. Grammar was based on Javanese while the vocabulary was based on Dutch. Dutch lexicon was pronounced in a Javanese manner.
in scheme: Lexvo - ISO 639-3 language codes
notation: jvd

Caribbean Javanese
type: Language
type: Concept
ISO 639-3 code: jvn
alternative label: Javanese, Caribbean
in scheme: Lexvo - ISO 639-3 language codes
notation: jvn

Jwira-Pepesa
type: Language
type: Concept
ISO 639-3 code: jwi
alternative label: Jwira-Pepesa language
definition: Jwira and Pepesa are a pair of Central Tano dialects of Ghana.
in scheme: Lexvo - ISO 639-3 language codes
notation: jwi

Jiarong
type: Language
type: Concept
ISO 639-3 code: jya
alternative label: Jiarong language
definition: Jiarong (Gyarong, rGyalrong) is a Jiarongic dialect continuum of China.
in scheme: Lexvo - ISO 639-3 language codes
notation: jya
preferred label: Rgyalrong de l'est @fr

Judeo-Yemeni Arabic
type: Language
type: Concept
ISO 639-3 code: jye
alternative label: Arabic, Judeo-Yemeni
definition: Judeo-Yemeni Arabic (also known as Judeo-Yemeni, Yemenite Judeo-Arabic) is a variety of Arabic spoken by Jews living or formerly living in Yemen. 50,000 speakers now live in Israel, 1,000 remain in Yemen.
in scheme: Lexvo - ISO 639-3 language codes
notation: jye

Jaya
type: Language
type: Concept
ISO 639-3 code: jyy
in scheme: Lexvo - ISO 639-3 language codes
notation: jyy

Kara-Kalpak
type: Language
type: Concept
ISO 639-2 Bibliographical code: kaa
ISO 639-2 Terminological code: kaa
ISO 639-3 code: kaa
alternative label: Idioma karakalpako @es
alternative label: Karakalpak @fr
alternative label: Karakalpak language
alternative label: Karakalpakische Sprache @de
alternative label: Lingua karakalpaka @it
definition: Karakalpak is a Turkic language mainly spoken by Karakalpaks in Karakalpakstan (Uzbekistan), as well as by Bashkirs and Nogay. Ethnic Karakalpaks who live in the viloyatlar of Uzbekistan tend to speak local Uzbek dialects.
in scheme: Lexvo - ISO 639-3 language codes
notation: kaa
preferred label: Karakalpakisch @de
preferred label: kara-kalpak @it
preferred label: karakalpak @fr
preferred label: karakalpako @es

Yalálag Zapotec
type: Language
type: Concept
ISO 639-3 code: zpu
alternative label: Zapotec, Yalálag
in scheme: Lexvo - ISO 639-3 language codes
notation: zpu

Kabyle
type: Language
type: Concept
ISO 639-2 Bibliographical code: kab
ISO 639-2 Terminological code: kab
ISO 639-3 code: kab
alternative label: Idioma cabilio @es
alternative label: Kabyle language
alternative label: Kabylische Sprache @de
alternative label: Lingua cabila @it
alternative label: Língua cabila @pt
definition: Kabyle or Kabylian (In Kabyle: Taqbaylit, ) is a Berber language spoken by the Kabyle people north and northeast of Algeria. Estimates about the number of speakers range from 5 million to about 7 million speakers (INALCO) worldwide, the majority in Algeria.
in scheme: Lexvo - ISO 639-3 language codes
notation: kab
preferred label: Kabylisch @de
preferred label: cabila @es
preferred label: kabyle @fr

Puyo-Paekche
type: Language
type: Concept
ISO 639-3 code: xpp
in scheme: Lexvo - ISO 639-3 language codes
notation: xpp

Kachin
type: Language
type: Concept
ISO 639-2 Bibliographical code: kac
ISO 639-2 Terminological code: kac
ISO 639-3 code: kac
alternative label: Jingpho
in scheme: Lexvo - ISO 639-3 language codes
notation: kac
preferred label: Kachin-Sprache @de
preferred label: kachin @es

Adara
type: Language
type: Concept
ISO 639-3 code: kad
alternative label: Kadara language
definition: Kadara is a Plateau language of Nigeria.
in scheme: Lexvo - ISO 639-3 language codes
notation: kad

Ketangalan
type: Language
type: Concept
ISO 639-3 code: kae
alternative label: Ketangalan language
definition: Ketagalan (Ketangalan, Tangalan) was a Formosan language spoken south of modern-day Taipei in northern Taiwan.
in scheme: Lexvo - ISO 639-3 language codes
notation: kae

Katso
type: Language
type: Concept
ISO 639-3 code: kaf
in scheme: Lexvo - ISO 639-3 language codes
notation: kaf

Kajaman
type: Language
type: Concept
ISO 639-3 code: kag
in scheme: Lexvo - ISO 639-3 language codes
notation: kag

Kara
type: Language
type: Concept
ISO 639-3 code: kah
alternative label: Fer language
alternative label: Kara (Central African Republic)
definition: The Fer language, also Dam Fer or Fertit, one of several languages called Kara ("Kara of Birao"), is a Central Sudanic language spoken by some five thousand people in the northern Central African Republic near the Sudanese and Chadian borders, in the region known as Dar Runga.
in scheme: Lexvo - ISO 639-3 language codes
notation: kah

Karekare
type: Language
type: Concept
ISO 639-3 code: kai
alternative label: Karekare language
definition: Karekare (also known as Karaikarai, Karai Karai, Kerekere, Kerrikerri) is an Afro-Asiatic language spoken in Bauchi State and Yobe State, Nigeria. Dialects include Birkai, Jalalam, and Kwarta Mataci.
in scheme: Lexvo - ISO 639-3 language codes
notation: kai

Mohegan-Pequot
type: Language
type: Concept
ISO 639-3 code: xpq
alternative label: Mohegan-Pequot language
definition: Mohegan-Pequot (also known as Mohegan-Pequot-Montauk, Secatogue, Stockbridge, and Shinnecock-Poosepatuck; dialects include Mohegan, Pequot, Montauk, Niantic, and Shinnecock) is an extinct Algonquian language formerly spoken in parts of present-day New England and Long Island.
in scheme: Lexvo - ISO 639-3 language codes
notation: xpq
preferred label: Mohegan @fr

Jju
type: Language
type: Concept
ISO 639-3 code: kaj
alternative label: Kaje @de
alternative label: Kaje language
definition: Jju, or Kaje, is a regionally important Plateau language of Nigeria. According to Blench (2008), it appears to be a variety of Tyap, though speakers are ethnically distinct.
in scheme: Lexvo - ISO 639-3 language codes
notation: kaj
preferred label: jju @es
preferred label: kai @it

Kayapa Kallahan
type: Language
type: Concept
ISO 639-3 code: kak
alternative label: Kallahan, Kayapa
in scheme: Lexvo - ISO 639-3 language codes
notation: kak

Kalaallisut
type: Language
type: Concept
ISO 639-1 code: kl
ISO 639-2 Bibliographical code: kal
ISO 639-2 Terminological code: kal
ISO 639-3 code: kal
alternative label: Greenlandic
alternative label: Greenlandic language
alternative label: Groenlandais @fr
alternative label: Grönländische Sprache @de
alternative label: Idioma groenlandés @es
alternative label: Lingua groenlandese @it
alternative label: Língua groenlandesa @pt
definition: Greenlandic is an Eskimo–Aleut language spoken by about 57,000 people in Greenland. It is closely related to the Inuit languages in Canada, such as Inuktitut. The main dialect, Kalaallisut or West Greenlandic, has been the official language of the Greenlandic autonomous territory since June 2009; this is a move by the Greenlandic government to strengthen the language in its competition with the colonial language, Danish. Other dialects are East Greenlandic (Tunumiisut) and the Thule dialect Inuktun or Polar Eskimo.
in scheme: Lexvo - ISO 639-3 language codes
notation: kal
preferred label: Grönländisch @de
preferred label: groenlandais @fr
preferred label: groenlandés @es
preferred label: groenlandês @pt
preferred label: kalaallisut @it

Kamba
type: Language
type: Concept
ISO 639-2 Bibliographical code: kam
ISO 639-2 Terminological code: kam
ISO 639-3 code: kam
alternative label: Kamba (Kenya)
in scheme: Lexvo - ISO 639-3 language codes
notation: kam
preferred label: kamba @es

Kannada
type: Language
type: Concept
ISO 639-1 code: kn
ISO 639-2 Bibliographical code: kan
ISO 639-2 Terminological code: kan
ISO 639-3 code: kan
alternative label: Idioma canarés @es
alternative label: Lingua kannada @it
alternative label: Língua canaresa @pt
alternative label: canarim @pt
preferred label: kannada @it
definition: Kannada ( , ) or , is a language spoken in India predominantly in the state of Karnataka. Kannada, whose native speakers are called Kannadigas (, ) and number roughly 50 million, It is one of the scheduled languages of India and the official and administrative language of the state of Karnataka.
in scheme: Lexvo - ISO 639-3 language codes
notation: kan
preferred label: canarés @es
preferred label: canarês @pt

Xaasongaxango
type: Language
type: Concept
ISO 639-3 code: kao
in scheme: Lexvo - ISO 639-3 language codes
notation: kao

Bezhta
type: Language
type: Concept
ISO 639-3 code: kap
alternative label: Bezhta language
definition: The Bezhta (or Bezheta) language (Bezhta: бежкьалас миц, bežƛʼalas mic, ), also known as Kapucha (from the name of a large village ), belongs to the Tsezic group of the North Caucasian language family. It is spoken by about 6,200 people in southern Dagestan, Russia
in scheme: Lexvo - ISO 639-3 language codes
notation: kap
preferred label: Língua bezhta @pt

Capanahua
type: Language
type: Concept
ISO 639-3 code: kaq
alternative label: Capanahua language
definition: Capanahua or Kapanawa is a declining indigenous American language of the Panoan family spoken in western South America by a few hundred aboriginal people. The language is spoken by the 400 strong Capanahua people, around the area of the Tapiche-Buncuya river, where it is the official language. There is one dialect called Pahenbaquebo; and the closest related language is Shipibo with which is shared 50 to 60 percent comprehensibility. If a Capanahua speaker talks to another Capanahua speaker in Spanish it is considered insulting, and applying the stigmatizing label of outsider. The language is in decline, since there are few speakers and almost no children can speak it. Capanahua is used in two bilingual schools, somewhat in other primary schools, but not in secondary schools. There is 5 to 10 percent literacy in Spanish compared to 10 percent literacy in the native mother tongue. The language has a written grammar, a dictionary, and uses Roman script when written. Capanahua speakers and people are referred to derogatorily as "Capachos".
in scheme: Lexvo - ISO 639-3 language codes
notation: kaq

Kashmiri
type: Language
type: Concept
ISO 639-1 code: ks
ISO 639-2 Bibliographical code: kas
ISO 639-2 Terminological code: kas
ISO 639-3 code: kas
alternative label: Cachemiri @fr
alternative label: Idioma cachemir @es
alternative label: Kaschmirisch @de
alternative label: Kashmiri language
alternative label: Lingua kashmiri @it
alternative label: Língua caxemira @pt
alternative label: caxemirense @pt
preferred label: kashmiri @it
definition: Kashmiri ( Koshur) is a language from the Dardic sub-group and it is spoken primarily in the Kashmir Valley, in Jammu and Kashmir. There are approximately 5,554,496 speakers in Jammu and Kashmir, according to the Census of 2001. Most of the 105,000 speakers or so in Pakistan are émigrés from the Kashmir Valley after the partition of India. They include a few speakers residing in border villages in Neelum District.
in scheme: Lexvo - ISO 639-3 language codes
notation: kas
preferred label: cachemiro @es
preferred label: caxemira @pt
preferred label: kâshmîrî @fr

Georgian
type: Language
type: Concept
ISO 639-1 code: ka
ISO 639-2 Bibliographical code: geo
ISO 639-2 Terminological code: kat
ISO 639-3 code: kat
alternative label: Georgian language
alternative label: Georgische Sprache @de
alternative label: Géorgien @fr
alternative label: Idioma georgiano @es
alternative label: Lingua georgiana @it
alternative label: Língua georgiana @pt
definition: Georgian (, ) is the native language of the Georgians and the official language of Georgia, a country in the Caucasus.
in scheme: Lexvo - ISO 639-3 language codes
notation: kat
preferred label: Georgisch @de
preferred label: georgiano @es
preferred label: géorgien @fr

Kanuri
type: Language
type: Concept
ISO 639-1 code: kr
ISO 639-2 Bibliographical code: kau
ISO 639-2 Terminological code: kau
ISO 639-3 code: kau
alternative label: Idioma kanuri @es
alternative label: Kanuri language
alternative label: Kanuri-Sprache @de
alternative label: Lingua kanuri @it
alternative label: Língua kanuri @pt
alternative label: kanouri @fr
definition: Kanuri is a dialect continuum spoken by some four million people, as of 1987, in Nigeria, Niger, Chad and Cameroon, as well as small minorities in southern Libya and by a diaspora in Sudan. It belongs to the Western Saharan subphylum of Nilo-Saharan. Kanuri is the language associated with the Kanem and Bornu empires which dominated the Lake Chad region for a thousand years.
in scheme: Lexvo - ISO 639-3 language codes
notation: kau
preferred label: canúri @pt
preferred label: kanuri @es

Katukína
type: Language
type: Concept
ISO 639-3 code: kav
alternative label: Katukína language
definition: Katukína is a Katukinian language spoken by only one person in 1976 in Acre, Brazil. It is probably extinct.
in scheme: Lexvo - ISO 639-3 language codes
notation: kav
preferred label: Katukina @fr

Parthian
type: Language
type: Concept
ISO 639-3 code: xpr
alternative label: Parthian language
definition: The Parthian language, also known as Arsacid Pahlavi and Pahlavanik, is a now-extinct ancient Northwestern Iranian language spoken in Parthia, a region of northeastern ancient Persia during the rule of the Parthian empire.
in scheme: Lexvo - ISO 639-3 language codes
notation: xpr
preferred label: Idioma parto @es
preferred label: Língua parta @pt
preferred label: Parthe @fr
preferred label: Parthische Sprache @de

Kawi
type: Language
type: Concept
ISO 639-2 Bibliographical code: kaw
ISO 639-2 Terminological code: kaw
ISO 639-3 code: kaw
alternative label: Old Javanese
definition: Old Javanese is the oldest phase of the Javanese language that was spoken in areas in what is now the eastern part of Central Java and the whole of East Java.
in scheme: Lexvo - ISO 639-3 language codes
notation: kaw
preferred label: kawi @es

Kao
type: Language
type: Concept
ISO 639-3 code: kax
in scheme: Lexvo - ISO 639-3 language codes
notation: kax

Kamayurá
type: Language
type: Concept
ISO 639-3 code: kay
alternative label: Kamayurá language
definition: The Kamayurá language (Kamaiurá in Portuguese) belongs to the Tupi–Guarani family , and is spoken by the Kamayurá people of Brazil – who numbered about 290 individuals as of the year 2004.
in scheme: Lexvo - ISO 639-3 language codes
notation: kay

Kazakh
type: Language
type: Concept
ISO 639-1 code: kk
ISO 639-2 Bibliographical code: kaz
ISO 639-2 Terminological code: kaz
ISO 639-3 code: kaz
alternative label: Idioma kazajo @es
alternative label: Kasachische Sprache @de
alternative label: Kazakh language
alternative label: Lingua kazaka @it
alternative label: Língua cazaque @pt
alternative label: kazakh @fr
definition: Kazakh (also Qazaq and variants, natively , , ; pronounced ) is a Turkic language which belongs to the Kipchak (or Western Turkic) branch of the Turkic languages, closely related to Nogai and Karakalpak.
in scheme: Lexvo - ISO 639-3 language codes
notation: kaz
preferred label: Kasachisch @de
preferred label: cazaque @pt
preferred label: kazajo @es
preferred label: kazako @it

Kalarko
type: Language
type: Concept
ISO 639-3 code: kba
in scheme: Lexvo - ISO 639-3 language codes
notation: kba

Kaxuiâna
type: Language
type: Concept
ISO 639-3 code: kbb
in scheme: Lexvo - ISO 639-3 language codes
notation: kbb

Kadiwéu
type: Language
type: Concept
ISO 639-3 code: kbc
alternative label: Kadiweu language
definition: Kadiweu is a Mataco–Guaicuru language spoken by 1,200-1,800 people in Brazil. It is mainly a subject–verb–object language and its ISO 639-3 code is kbc.
in scheme: Lexvo - ISO 639-3 language codes
notation: kbc
preferred label: Cadiueus @pt
preferred label: Caduveo @es

Kabardian
type: Language
type: Concept
ISO 639-2 Bibliographical code: kbd
ISO 639-2 Terminological code: kbd
ISO 639-3 code: kbd
alternative label: Idioma cabardiano @es
alternative label: Kabardian language
alternative label: Kabardinische Sprache @de
alternative label: Lingua cabarda @it
alternative label: kabardien @fr
alternative label: kabardin @fr
definition: The Kabardian language, also known as East Circassian (see: Circassian language), is a Northwest Caucasian language, closely related to the Adyghe language. It is spoken mainly in the Russian republics of Kabardino-Balkaria and Karachay–Cherkessia (the native territories) and in Turkey and the Middle East (the extensive post-war diaspora). It has 47 or 48 consonant phonemes of which 22 or 23 are fricatives, depending upon whether one counts as phonemic, but this is contrasted with just three phonemic vowels. It is one of very few languages to possess a clear phonemic distinction between ejective affricates and ejective fricatives.
in scheme: Lexvo - ISO 639-3 language codes
notation: kbd
preferred label: Kabarde @fr
preferred label: Kabardinisch @de
preferred label: kabardia @it
preferred label: kabardiano @es

Kanju
type: Language
type: Concept
ISO 639-3 code: kbe
in scheme: Lexvo - ISO 639-3 language codes
notation: kbe

Kakauhua
type: Language
type: Concept
ISO 639-3 code: kbf
alternative label: Kakauhua language
definition: Kakauhua (also known as Kaukaue, Cacahua) is an extinct Alacalufan language formerly spoken in Chile.
in scheme: Lexvo - ISO 639-3 language codes
notation: kbf

Khamba
type: Language
type: Concept
ISO 639-3 code: kbg
in scheme: Lexvo - ISO 639-3 language codes
notation: kbg

Camsá
type: Language
type: Concept
ISO 639-3 code: kbh
alternative label: Camsá language
definition: Camsá (also Sibundoy, Coche, Kamsá, Kamemtxa, Kamse, Camëntsëá) is a language isolate of Colombia.
in scheme: Lexvo - ISO 639-3 language codes
notation: kbh

Kaptiau
type: Language
type: Concept
ISO 639-3 code: kbi
in scheme: Lexvo - ISO 639-3 language codes
notation: kbi

Kari
type: Language
type: Concept
ISO 639-3 code: kbj
alternative label: Kari language
definition: Kare (Kari) is a poorly documented Congolese Bantu language of uncertain affiliation. There are scattered speakers in the CAR>
in scheme: Lexvo - ISO 639-3 language codes
notation: kbj

Grass Koiari
type: Language
type: Concept
ISO 639-3 code: kbk
alternative label: Koiari, Grass
in scheme: Lexvo - ISO 639-3 language codes
notation: kbk

Kanembu
type: Language
type: Concept
ISO 639-3 code: kbl
alternative label: Kanembou @fr
alternative label: Kanembu language
alternative label: Língua kanembu @pt
definition: Kanembu is a Nilo-Saharan language spoken in Chad by the Kanembu people. It is closely related to Kanuri.
in scheme: Lexvo - ISO 639-3 language codes
notation: kbl
preferred label: kanembou @fr
preferred label: kanembu @es

Pisidian
type: Language
type: Concept
ISO 639-3 code: xps
alternative label: Pisidian language
definition: The Pisidian language is a member of the extinct Anatolian branch of the Indo-European language family spoken in Pisidia, a region of ancient Asia Minor. Known from some two dozen short inscriptions, it appears to be closely related to Lycian and Sidetic.
in scheme: Lexvo - ISO 639-3 language codes
notation: xps
preferred label: Lingua pisidica @it
preferred label: Pisidien @fr
preferred label: Pisidische Sprache @de

Iwal
type: Language
type: Concept
ISO 639-3 code: kbm
alternative label: Iwal language
definition: Iwal (also called Kaiwa from Jabêm Kai Iwac Iwac highlanders) is an Austronesian language spoken by about 1,900 people from nine villages in Morobe Province, Papua New Guinea (Cobb & Wroge 1990). Although it appears most closely related to the South Huon Gulf languages, it is the most conservative member of its subgroup.
in scheme: Lexvo - ISO 639-3 language codes
notation: kbm

Kare
type: Language
type: Concept
ISO 639-3 code: kbn
alternative label: Kare (Central African Republic)
alternative label: Kare language
definition: Kare is an Mbum language of the Central African Republic There are a few thousand speakers in Cameroon.
in scheme: Lexvo - ISO 639-3 language codes
notation: kbn
preferred label: Karang @de

Keliko
type: Language
type: Concept
ISO 639-3 code: kbo
alternative label: Kaliko language
definition: Keliko (Kaliko) is a Central Sudanic language of the Democratic Republic of the Congo and South Sudan.
in scheme: Lexvo - ISO 639-3 language codes
notation: kbo

Kabiyè
type: Language
type: Concept
ISO 639-3 code: kbp
alternative label: Kabye language
definition: Kabiyè (also Kabiyé, Kabiye, Kabyé, Kabye) is a Grusi language spoken primarily in northern Togo, and also by smaller numbers of people in Benin and Ghana. It is one of two national languages of Togo.
in scheme: Lexvo - ISO 639-3 language codes
notation: kbp
preferred label: Kabiyé @de
preferred label: Língua kabiyé @pt

Kamano
type: Language
type: Concept
ISO 639-3 code: kbq
alternative label: Kamono language
definition: Kamono (Kamano-Kafe) is a Papuan language spoken in Eastern Highlands Province, Papua New Guinea.
in scheme: Lexvo - ISO 639-3 language codes
notation: kbq

Kafa
type: Language
type: Concept
ISO 639-3 code: kbr
alternative label: Kafa language
definition: Kaffa is an Afroasiatic language spoken in Ethiopia around Bonga in the Keficho Shekicho Zone. The language is also called Kafi nono.
in scheme: Lexvo - ISO 639-3 language codes
notation: kbr
preferred label: Kaffa @de

Kande
type: Language
type: Concept
ISO 639-3 code: kbs
in scheme: Lexvo - ISO 639-3 language codes
notation: kbs

Abadi
type: Language
type: Concept
ISO 639-3 code: kbt
in scheme: Lexvo - ISO 639-3 language codes
notation: kbt

Kabutra
type: Language
type: Concept
ISO 639-3 code: kbu
in scheme: Lexvo - ISO 639-3 language codes
notation: kbu

Dera
type: Language
type: Concept
ISO 639-3 code: kbv
alternative label: Dera (Indonesia)
alternative label: Dera language
definition: Dera (Dra) Mangguar and Kamberataro (Komberatoro) is a Senagi language of Papua New Guinea and Indonesia.
in scheme: Lexvo - ISO 639-3 language codes
notation: kbv

Kaiep
type: Language
type: Concept
ISO 639-3 code: kbw
in scheme: Lexvo - ISO 639-3 language codes
notation: kbw

Ap Ma
type: Language
type: Concept
ISO 639-3 code: kbx
alternative label: Kambot language
definition: Kambot Ap Ma (Ap Ma Botin, Botin), also Karaube, is a Ramu language of Papua New Guinea.
in scheme: Lexvo - ISO 639-3 language codes
notation: kbx

Manga Kanuri
type: Language
type: Concept
ISO 639-3 code: kby
alternative label: Kanuri, Manga
in scheme: Lexvo - ISO 639-3 language codes
notation: kby

Duhwa
type: Language
type: Concept
ISO 639-3 code: kbz
alternative label: Duhwa language
definition: Duhwa (also known as Karfa, Kerifa, Nzuhwi) is an Afro-Asiatic language spoken in Nasarawa State, Nigeria.
in scheme: Lexvo - ISO 639-3 language codes
notation: kbz

Punthamara
type: Language
type: Concept
in scheme: Lexvo - ISO 639-3 language codes

Khanty
type: Language
type: Concept
ISO 639-3 code: kca
alternative label: Khanty language
definition: Khanty or Xanty language, also known previously as the Ostyak language, is a language of the Khant peoples. It is spoken in Khanty–Mansi and Yamalo-Nenets autonomous okrugs, as well as in Aleksandrovsky and Kargosoksky districts of Tomsk Oblast in Russia. According to the 1994 Salminen and 1994 Janhunen study, there were 12,000 Khanty-speaking people in Russia.
in scheme: Lexvo - ISO 639-3 language codes
notation: kca
preferred label: Chantische Sprache @de
preferred label: Idioma janti @es
preferred label: Lingua chanty @it

Kawacha
type: Language
type: Concept
ISO 639-3 code: kcb
in scheme: Lexvo - ISO 639-3 language codes
notation: kcb

Lubila
type: Language
type: Concept
ISO 639-3 code: kcc
in scheme: Lexvo - ISO 639-3 language codes
notation: kcc

Ngkâlmpw Kanum
type: Language
type: Concept
ISO 639-3 code: kcd
alternative label: Kanum, Ngkâlmpw
in scheme: Lexvo - ISO 639-3 language codes
notation: kcd

Kaivi
type: Language
type: Concept
ISO 639-3 code: kce
in scheme: Lexvo - ISO 639-3 language codes
notation: kce

Punic
type: Language
type: Concept
ISO 639-3 code: xpu
alternative label: Punic language
definition: The Punic language or Carthagian language is an extinct Semitic language formerly spoken in the Mediterranean region of North Africa and several Mediterranean islands, by people of the Punic or Berber culture.
in scheme: Lexvo - ISO 639-3 language codes
notation: xpu
preferred label: Idioma púnico @es
preferred label: Lingua punica @it
preferred label: Língua púnica @pt

Ukaan
type: Language
type: Concept
ISO 639-3 code: kcf
alternative label: Ukaan language
definition: Ukaan (also Ikan, Anyaran, Auga, or Kakumo) is an undocumented and sparsely described Niger–Congo language or dialect cluster of uncertain affiliation. Roger Blench suspects, based on wordlists, that it may be closest to the (East) Benue–Congo languages (or, equivalently, the most divergent of the Benue–Congo languages).
in scheme: Lexvo - ISO 639-3 language codes
notation: kcf

Tyap
type: Language
type: Concept
ISO 639-3 code: kcg
alternative label: Katab language
definition: Tyap, or Katab, is a regionally important dialect cluster of Plateau languages in Nigeria, named after its prestige dialect. Other dialects are Gworok, Atakar, Kacicere, Sholio, Kafancan. According to Blench (2008), Jju, with an even larger number of speakers, appears to be a Tyap variety, though speakers are ethnically distinct.
in scheme: Lexvo - ISO 639-3 language codes
notation: kcg
preferred label: tyap @es

Vono
type: Language
type: Concept
ISO 639-3 code: kch
in scheme: Lexvo - ISO 639-3 language codes
notation: kch

Kamantan
type: Language
type: Concept
ISO 639-3 code: kci
alternative label: Kamantan language
definition: Kamanton (Kamantan) is a Plateau language of Nigeria.
in scheme: Lexvo - ISO 639-3 language codes
notation: kci

Cobiana
type: Language
type: Concept
ISO 639-3 code: kcj
alternative label: Kobiana language
definition: Kobiana (Cobiana) or Buy (Uboi) is a Senegambian language of Senegal and Guinea-Bissau.
in scheme: Lexvo - ISO 639-3 language codes
notation: kcj
preferred label: Kobiana

Kalanga
type: Language
type: Concept
ISO 639-3 code: kck
alternative label: Kalanga language
definition: The Kalanga language, or Ikalanga/TjiKalanga, is a Bantu language spoken by the Kalanga people, 300,000 in Botswana and 700,000 in Zimbabwe (Ethnologue). It is a Bantu language known for its extensive phoneme inventory, which includes palatalized, velarized, aspirated, and breathy voiced consonants. It is closely related to Shona.
in scheme: Lexvo - ISO 639-3 language codes
notation: kck

Kela
type: Language
type: Concept
ISO 639-3 code: kcl
alternative label: Kala
alternative label: Kela (Papua New Guinea)
alternative label: Kela language
definition: Kela is an Austronesian language spoken by about 2500 people (in 1997) in several villages along the south coast of the Huon Gulf between Salamaua Peninsula and the Paiawa River, Morobe Province, Papua New Guinea. The principal villages are Keila/Kêla, Logui/Laugwêc, Laukanu, Lababia, Buso, and Kui. Linguistically, Kela belongs to the North Huon Gulf languages and Kela-speakers appear to have arrived on the southern coast of the Gulf relatively recently, beginning perhaps as late as the 17th century (Bradshaw 1997).
in scheme: Lexvo - ISO 639-3 language codes
notation: kcl

Gula
type: Language
type: Concept
ISO 639-3 code: kcm
alternative label: Gula (Central African Republic)
alternative label: Tar Gula language
definition: The Gula language, or Tar Gula, of the Central African Republic, commonly known as Kara, is a Central Sudanic language or dialect cluster. The term "Kara" is also attached to numerous ethnic groups of the region and their languages, and so is often ambiguous.
in scheme: Lexvo - ISO 639-3 language codes
notation: kcm

Nubi
type: Language
type: Concept
ISO 639-3 code: kcn
alternative label: Nubi language
definition: The Nubi language (also called Ki-Nubi) is a Sudanese Arabic-based creole language spoken in Uganda around Bombo, and in Kenya around Kibera, by the descendants of Emin Pasha's Sudanese soldiers who were settled there by the British colonial administration. It was spoken by about 15,000 people in Uganda in 1991 (according to the census), and an estimated 10,000 in Kenya; another source estimates about 50,000 speakers as of 2001. 90% of the lexicon derives from Arabic, but the grammar has been simplified, as has the sound system. Nubi has the prefixing, suffixing and compounding processes also present in Arabic.
in scheme: Lexvo - ISO 639-3 language codes
notation: kcn

Kinalakna
type: Language
type: Concept
ISO 639-3 code: kco
in scheme: Lexvo - ISO 639-3 language codes
notation: kco

Kanga
type: Language
type: Concept
ISO 639-3 code: kcp
alternative label: Kanga language
definition: Kanga is a Kadu language spoken in Kordofan.
in scheme: Lexvo - ISO 639-3 language codes
notation: kcp

Kamo
type: Language
type: Concept
ISO 639-3 code: kcq
alternative label: Kamo language
definition: Kamo is one of the Savanna languages of eastern Nigeria.
in scheme: Lexvo - ISO 639-3 language codes
notation: kcq

Katla
type: Language
type: Concept
ISO 639-3 code: kcr
alternative label: Katla language
definition: The Katla language, Kaalak, is a Kordofanian language, closely related to a neighboring language called Tima, but otherwise quite divergent within the Niger–Congo family.
in scheme: Lexvo - ISO 639-3 language codes
notation: kcr

Koenoem
type: Language
type: Concept
ISO 639-3 code: kcs
alternative label: Koenoem language
definition: Koenoem is an Afro-Asiatic language spoken in Plateau State, Nigeria.
in scheme: Lexvo - ISO 639-3 language codes
notation: kcs

Puyo
type: Language
type: Concept
ISO 639-3 code: xpy
alternative label: Buyeo language
in scheme: Lexvo - ISO 639-3 language codes
notation: xpy

Kaian
type: Language
type: Concept
ISO 639-3 code: kct
in scheme: Lexvo - ISO 639-3 language codes
notation: kct

Kami
type: Language
type: Concept
ISO 639-3 code: kcu
alternative label: Kami (Tanzania)
in scheme: Lexvo - ISO 639-3 language codes
notation: kcu

Kete
type: Language
type: Concept
ISO 639-3 code: kcv
in scheme: Lexvo - ISO 639-3 language codes
notation: kcv

Kabwari
type: Language
type: Concept
ISO 639-3 code: kcw
alternative label: Kabwari language
definition: Bwari, or Kabwari, is a minor Bantu language of the Democratic Republic of the Congo.
in scheme: Lexvo - ISO 639-3 language codes
notation: kcw

Kachama-Ganjule
type: Language
type: Concept
ISO 639-3 code: kcx
alternative label: Kachama-Ganjule language
definition: Kachama-Ganjule is an Afroasiatic language spoken in Ethiopia on islands in Lake Chamo and Lake Abaya. Kachama is spoken on Gidicho island in Lake Abaya, whereas Ganjule was originally spoken on a small island in Lake Chamo. Now the Ganjule speakers have relocated to the west shore of the Lake. There still are about 1000 monolinguals in this language. The language is also called Gatsame, Geteme, Gatame and Harro. __NOTOC__
in scheme: Lexvo - ISO 639-3 language codes
notation: kcx

Korandje
type: Language
type: Concept
ISO 639-3 code: kcy
alternative label: Korandje language
definition: Korandje (kwạṛa n dzyəy, ) is by far the most northerly of the Songhay languages. It is spoken around the oasis of Tabelbala by about 3000 people; its name literally means "village's language". While retaining a basically Songhay structure, it is extremely heavily influenced by Berber and Arabic; about 20% of the 100-word Swadesh list of basic vocabulary consists of loans from Arabic or Berber, and the proportion of the lexicon as a whole is considerably higher.
in scheme: Lexvo - ISO 639-3 language codes
notation: kcy
preferred label: Korandjé @fr

Konongo
type: Language
type: Concept
ISO 639-3 code: kcz
in scheme: Lexvo - ISO 639-3 language codes
notation: kcz

Worimi
type: Language
type: Concept
ISO 639-3 code: kda
alternative label: Worimi language
definition: Worimi or Gadjang (also spelt Kattang, Kutthung, Gadhang, Gadang) is an extinct Australian Aboriginal language. It was the traditional language of the Worimi people, whose descendants now speak English.
in scheme: Lexvo - ISO 639-3 language codes
notation: kda

Kutu
type: Language
type: Concept
ISO 639-3 code: kdc
in scheme: Lexvo - ISO 639-3 language codes
notation: kdc

Yankunytjatjara
type: Language
type: Concept
ISO 639-3 code: kdd
alternative label: Yankunytjatjara language
definition: Yankunytjatjara (also Yankuntatjara, Jangkundjara, Kulpantja) is an Australian Aboriginal language. It is one of the Wati languages, belonging to the large Southwest branch of the Pama–Nyungan family. It is one of the many varieties of the Western Desert Language, all of which are mutually intelligible.
in scheme: Lexvo - ISO 639-3 language codes
notation: kdd

Karakhanid
type: Language
type: Concept
ISO 639-3 code: xqa
in scheme: Lexvo - ISO 639-3 language codes
notation: xqa

Makonde
type: Language
type: Concept
ISO 639-3 code: kde
in scheme: Lexvo - ISO 639-3 language codes
notation: kde
preferred label: makonde @es

Mamusi
type: Language
type: Concept
ISO 639-3 code: kdf
in scheme: Lexvo - ISO 639-3 language codes
notation: kdf

Seba
type: Language
type: Concept
ISO 639-3 code: kdg
in scheme: Lexvo - ISO 639-3 language codes
notation: kdg

Tem
type: Language
type: Concept
ISO 639-3 code: kdh
alternative label: Tem language
definition: Tem (Temba), or Kotokoli (Cotocoli), is a Gur language spoken in Togo, Ghana, and Benin. It is used by neighboring peoples. According to the Ethnologue there are 307 000 native speakers.
in scheme: Lexvo - ISO 639-3 language codes
notation: kdh

Kumam
type: Language
type: Concept
ISO 639-3 code: kdi
alternative label: Kumam language
definition: Kumam is a Luo language of Uganda.
in scheme: Lexvo - ISO 639-3 language codes
notation: kdi

Karamojong
type: Language
type: Concept
ISO 639-3 code: kdj
alternative label: Karamojong language
definition: The Karamojong Language (ŋaKarimojoŋ, ŋaKaramojoŋ, Karimojong or Ngakarimojong) is a Nilo-Saharan language spoken mainly in the Karamoja subregion of north-eastern Uganda.
in scheme: Lexvo - ISO 639-3 language codes
notation: kdj
preferred label: Karimojong @fr

Chichicapan Zapotec
type: Language
type: Concept
ISO 639-3 code: zpv
alternative label: Zapotec, Chichicapan
in scheme: Lexvo - ISO 639-3 language codes
notation: zpv

Numèè
type: Language
type: Concept
ISO 639-3 code: kdk
alternative label: Kwényi
alternative label: Numee
in scheme: Lexvo - ISO 639-3 language codes
notation: kdk

Qatabanian
type: Language
type: Concept
ISO 639-3 code: xqt
alternative label: Qatabanian language
in scheme: Lexvo - ISO 639-3 language codes
notation: xqt

Tsikimba
type: Language
type: Concept
ISO 639-3 code: kdl
alternative label: Kimba language
definition: The Kimba language, Tsikimba, is a Kainji language of Nigeria spoken by the Kambari people.
in scheme: Lexvo - ISO 639-3 language codes
notation: kdl

Kagoma
type: Language
type: Concept
ISO 639-3 code: kdm
alternative label: Kagoma language
definition: Gyong, or Kagoma, is a Plateau language of Nigeria.
in scheme: Lexvo - ISO 639-3 language codes
notation: kdm

Kunda
type: Language
type: Concept
ISO 639-3 code: kdn
alternative label: Kunda language
definition: Kunda is a Bantu language of Zimbabwe and Zambia, with a few thousand speakers in Mozambique.
in scheme: Lexvo - ISO 639-3 language codes
notation: kdn

Kaningdon-Nindem
type: Language
type: Concept
ISO 639-3 code: kdp
in scheme: Lexvo - ISO 639-3 language codes
notation: kdp

Koch
type: Language
type: Concept
ISO 639-3 code: kdq
alternative label: Koch language
definition: Koch is a Tibeto-Burman language spoken by the Koch people of both the Republic of India and Bangladesh.
in scheme: Lexvo - ISO 639-3 language codes
notation: kdq

Karaim
type: Language
type: Concept
ISO 639-3 code: kdr
alternative label: Karaim language
definition: The Karaim language (Crimean dialect: къарай тили, Trakai dialect: karaj tili, Turkish dialect:Karay Dili) is a Turkic language with Hebrew influences, in a similar manner to Yiddish or Ladino. It is spoken by Crimean Karaites (also known as Karaims and Qarays) – ethnic Turkic adherents of Karaite Judaism in Crimea, Lithuania, Poland and western Ukraine. It has six remaining active speakers. The three main dialects are those of Crimea, Trakai-Vilnius and Lutsk-Halych.
in scheme: Lexvo - ISO 639-3 language codes
notation: kdr
preferred label: Karaimische Sprache @de
preferred label: Karaïm @fr
preferred label: Lingua caraima @it
preferred label: Língua karaim @pt

Kuy
type: Language
type: Concept
ISO 639-3 code: kdt
alternative label: Kuy language
definition: Kuy language (also known as Kui, Soui or Kuay; Thai: ภาษากุย) is a Katuic language, part of the larger Austroasiatic family.
in scheme: Lexvo - ISO 639-3 language codes
notation: kdt

Kadaru
type: Language
type: Concept
ISO 639-3 code: kdu
in scheme: Lexvo - ISO 639-3 language codes
notation: kdu

Koneraw
type: Language
type: Concept
ISO 639-3 code: kdw
alternative label: Koneraw language
definition: Koneraw is a Trans–New Guinea language spoken in West New Guinea. It was missed by classifications of Papuan languages until recently, but is clearly close to Mombum.
in scheme: Lexvo - ISO 639-3 language codes
notation: kdw

Kam
type: Language
type: Concept
ISO 639-3 code: kdx
alternative label: Nyingwom language
definition: The Kam language, or Nyingwom (Nyiwom, Yimwom), is one of the Savanna languages spoken in eastern Nigeria.
in scheme: Lexvo - ISO 639-3 language codes
notation: kdx
preferred label: Nyingwom @de

Krahô
type: Language
type: Concept
ISO 639-3 code: xra
in scheme: Lexvo - ISO 639-3 language codes
notation: xra

Keder
type: Language
type: Concept
ISO 639-3 code: kdy
alternative label: Keijar
in scheme: Lexvo - ISO 639-3 language codes
notation: kdy

Kwaja
type: Language
type: Concept
ISO 639-3 code: kdz
in scheme: Lexvo - ISO 639-3 language codes
notation: kdz

Kabuverdianu
type: Language
type: Concept
ISO 639-3 code: kea
alternative label: Cape Verdean Creole
alternative label: Creolo capoverdiano @it
alternative label: Criollo caboverdiano @es
alternative label: Crioulo cabo-verdiano @pt
alternative label: Créole du Cap-Vert @fr
alternative label: Kapverdisches Kreol @de
alternative label: cabo-verdiano @pt
definition: Cape Verdean Creole is a creole language of Portuguese basis, spoken on the islands of Cape Verde. It is the native language of virtually all Cape Verdeans, and it is used as a second language by the Cape Verdean diaspora.
in scheme: Lexvo - ISO 639-3 language codes
notation: kea
preferred label: capoverdiano @it
preferred label: capverdien @fr
preferred label: criollo caboverdiano @es
preferred label: kabuverdianu @pt

Kélé
type: Language
type: Concept
ISO 639-3 code: keb
alternative label: Kele language
definition: The Kele language of Gabon is spoken by the Kele people, an ethnic group in Gabon with an estimated population of 10,774. Speakers of the language are scattered in Middle Ogooue Province, Mimongo area.
in scheme: Lexvo - ISO 639-3 language codes
notation: keb

Keiga
type: Language
type: Concept
ISO 639-3 code: kec
alternative label: Keiga language
definition: Keiga or Yega is a Kadu language spoken in Kordofan. Dialects are Demik (Rofik) and Keiga proper (Aigang).
in scheme: Lexvo - ISO 639-3 language codes
notation: kec

Kerewe
type: Language
type: Concept
ISO 639-3 code: ked
in scheme: Lexvo - ISO 639-3 language codes
notation: ked

Eastern Keres
type: Language
type: Concept
ISO 639-3 code: kee
alternative label: Keres, Eastern
in scheme: Lexvo - ISO 639-3 language codes
notation: kee

Kar language
type: Language
type: Concept
ISO 639-3 code: xrb
alternative label: Eastern Karaboro
alternative label: Karaboro, Eastern
definition: Kar (Kler), or Eastern Karaboro, is a central Senufo of Burkina Faso. Kar speakers have moderate comprehension of Western Karaboro, but the reverse is not the case.
in scheme: Lexvo - ISO 639-3 language codes
notation: xrb

Kpessi
type: Language
type: Concept
ISO 639-3 code: kef
in scheme: Lexvo - ISO 639-3 language codes
notation: kef

Tese
type: Language
type: Concept
ISO 639-3 code: keg
alternative label: Keiga Jirru language
definition: Keiga Jirru is an Eastern Sudanic language spoken in the Nuba Hills of Sudan.
in scheme: Lexvo - ISO 639-3 language codes
notation: keg

Keak
type: Language
type: Concept
ISO 639-3 code: keh
in scheme: Lexvo - ISO 639-3 language codes
notation: keh

Kei
type: Language
type: Concept
ISO 639-3 code: kei
alternative label: Kei language
definition: Kei (also called Kai, Saumlaki or Veveu evav) is an Indonesian language spoken by approximately inhabitants (2000) of the Moluccas. They live on the islands of Kai Besar and Kai Kecil, as well as neighbouring islands, in the regency of Kabupaten Maluku Tenggara Barat.
in scheme: Lexvo - ISO 639-3 language codes
notation: kei

Kadar
type: Language
type: Concept
ISO 639-3 code: kej
in scheme: Lexvo - ISO 639-3 language codes
notation: kej

Kekchí
type: Language
type: Concept
ISO 639-3 code: kek
alternative label: Q’eqchi’ language
definition: The Qeqchi language, also spelled Kekchi, is one of the Mayan languages, natively spoken within Qeqchi communities in Guatemala and Belize. In Guatemala, Qeqchi is spoken in the departments of Alta Verapaz, Petén, Izabal, Baja Verapaz, and El Quiché. Several Maya communities in the Toledo District of Belize use this language as their first language, and the majority of Mayas in Toledo speak Qeqchi.
in scheme: Lexvo - ISO 639-3 language codes
notation: kek
preferred label: Idioma quekchí @es
preferred label: Kekchí-Sprache @de
preferred label: Língua queqchi @pt
preferred label: Q'eqchi' @fr

Kela
type: Language
type: Concept
ISO 639-3 code: kel
alternative label: Kela (Democratic Republic of Congo)
alternative label: Kela language
definition: Kela (Ikela, Okela), or Lemba, is a Bantu language spoken by several hundred thousand people in the Kasai, Democratic Republic of Congo.
in scheme: Lexvo - ISO 639-3 language codes
notation: kel

Kemak
type: Language
type: Concept
ISO 639-3 code: kem
alternative label: Kemak language
definition: Kemak is a language spoken in East Timor. An alternate name is Ema. It is most closely related to Tocodede and Mambai. It has the status of one of the national languages in the East Timor constitution, besides the official languages of Portuguese and Tetum. The number of speakers has fallen in recent years.
in scheme: Lexvo - ISO 639-3 language codes
notation: kem
preferred label: Língua quémaque @pt

Kenyang
type: Language
type: Concept
ISO 639-3 code: ken
alternative label: Nyang language
definition: The Nyang language (Kenyang, Banyang, Manyang) is the principal Southern Bantoid language of the Mamfe family.
in scheme: Lexvo - ISO 639-3 language codes
notation: ken

Kakwa
type: Language
type: Concept
ISO 639-3 code: keo
in scheme: Lexvo - ISO 639-3 language codes
notation: keo

Kaikadi
type: Language
type: Concept
ISO 639-3 code: kep
alternative label: Kaikadi language
definition: The Kaikadi language is a Dravidian language related to Tamil, spoken by about 23,000 people of the nomad Kaikadi tribe.
in scheme: Lexvo - ISO 639-3 language codes
notation: kep

Kamar
type: Language
type: Concept
ISO 639-3 code: keq
in scheme: Lexvo - ISO 639-3 language codes
notation: keq

Gundungurra
type: Language
type: Concept
in scheme: Lexvo - ISO 639-3 language codes

Kera
type: Language
type: Concept
ISO 639-3 code: ker
alternative label: Kera language
definition: Kera is an East Chadic language spoken by 45,000 people in Southwest Chad and 6,000 people in North Cameroon.
in scheme: Lexvo - ISO 639-3 language codes
notation: ker

Kugbo
type: Language
type: Concept
ISO 639-3 code: kes
in scheme: Lexvo - ISO 639-3 language codes
notation: kes

Ket
type: Language
type: Concept
ISO 639-3 code: ket
alternative label: Ket language
definition: The Ket language, formerly known as Yenisei Ostyak, is a Siberian language long thought to be an isolate, the sole surviving language of a Yeniseian language family. It is spoken along the middle Yenisei basin by the Ket people.
in scheme: Lexvo - ISO 639-3 language codes
notation: ket
preferred label: Idioma ket @es
preferred label: Jenisseische Sprachen#Das Ketische @de
preferred label: Kete @fr
preferred label: Lingua ket @it

Akebu
type: Language
type: Concept
ISO 639-3 code: keu
alternative label: Kebu language
definition: Akebu or Kebu (also Kabu; in ) is one of the Ghana–Togo Mountain languages spoken by the Akebu people of southern Togo and southeastern Ghana. It is a language with nominal classes (and a tonal language?). Akebu is closely related to the Animere language.
in scheme: Lexvo - ISO 639-3 language codes
notation: keu
preferred label: Akébou @fr

Kanikkaran
type: Language
type: Concept
ISO 639-3 code: kev
alternative label: Kanikkaran language
in scheme: Lexvo - ISO 639-3 language codes
notation: kev

Kreye
type: Language
type: Concept
ISO 639-3 code: xre
alternative label: Kreye language
definition: Kreye is a Gê language that is spoken by about 30 individuals in Maranhão and Pará, Brazil. It is considered an endangered language.
in scheme: Lexvo - ISO 639-3 language codes
notation: xre

West Kewa
type: Language
type: Concept
ISO 639-3 code: kew
alternative label: Kewa, West
in scheme: Lexvo - ISO 639-3 language codes
notation: kew

Kukna
type: Language
type: Concept
ISO 639-3 code: kex
alternative label: Karnataka Konkani
definition: Karnataka Konkani refers to the various dialects of Konkani language spoken in the state of Karnataka,and some parts of Kerala. Konkani is spoken by a remarkable number of Goan migrants who have settled in North Kanara, Udupi, South Kanara and many other places in North and south Karnataka for the last few centuries.Konkani families migrated to North Canara and South Canara during three separate occasions:
in scheme: Lexvo - ISO 639-3 language codes
notation: kex

Kupia
type: Language
type: Concept
ISO 639-3 code: key
in scheme: Lexvo - ISO 639-3 language codes
notation: key

Kukele
type: Language
type: Concept
ISO 639-3 code: kez
alternative label: Kele language
definition: The Kele language, Kukele (Bakele, Ukele), is a Upper Cross River language of Nigeria.
in scheme: Lexvo - ISO 639-3 language codes
notation: kez

Kodagu
type: Language
type: Concept
ISO 639-3 code: kfa
alternative label: Kodava language
definition: Kodava Takk or Kodava takka, (Kannada script: ಕೊಡವ ತಕ್‌) is the original language of the south Karnataka district of Kodagu. The language is often called Kodava or Coorg language in English. The number of speakers is estimated at up to about 500,000. It is the primary language of Kodavas, but a large portion of other communities and tribes in Kodagu also use Kodava Takk. It belongs to the Dravidian language family, and is related to and influenced by Tulu, Kannada, Malayalam and Tamil. A majority of the words are common between Kodava Takk and Beary bashe, a dialect which is a mixture of Tulu and Malayalam spoken by the Beary and Belchada community.
in scheme: Lexvo - ISO 639-3 language codes
notation: kfa
preferred label: Kodava

Kolami language
type: Language
type: Concept
ISO 639-3 code: kfb
alternative label: Kolami, Northwestern
alternative label: Northwestern Kolami
definition: Kolami is a tribal Central Dravidian language used in Andhra Pradesh and Maharashtra states of India. It takes route from the central branch of Dravidian Language tree and falls under Kolami–Paraji group of languages.
in scheme: Lexvo - ISO 639-3 language codes
notation: kfb
preferred label: Kolami @de

Konda-Dora
type: Language
type: Concept
ISO 639-3 code: kfc
alternative label: Konda language
definition: Konda, also known as Konda-Dora, is one of the Dravidian languages spoken in India. It is spoken by the scheduled tribe of the Konda-Dora.
in scheme: Lexvo - ISO 639-3 language codes
notation: kfc

Korra Koraga
type: Language
type: Concept
ISO 639-3 code: kfd
alternative label: Koraga language
alternative label: Koraga, Korra
definition: Koraga language (Kannada Script: ಕೊರಗ ), also called, Koragar, Koragara, Korangi or Korra Koraga is a Dravidian language spoken by the Koraga tribe, a Scheduled tribe people of Tulu Nadu, region in South West, India, Tulu Nadu comprises the districts of Udupi and Dakshina Kannada in Karnataka State and Kasaragod district of Kerala State. The language is related to Tulu and Kannada but is not intelligible with either of them. The language is also not intelligible with Muddu Koraga, a language spoken by the Koraga tribe in Kerala.
in scheme: Lexvo - ISO 639-3 language codes
notation: kfd

Kota
type: Language
type: Concept
ISO 639-3 code: kfe
alternative label: Kota (India)
alternative label: Kota language
definition: Kota is a language of the Dravidian language family, spoken by 1,400 native speakers and 2,000 total speakers in the Nilgiri hills of Tamil Nadu state, India.
in scheme: Lexvo - ISO 639-3 language codes
notation: kfe

Koya
type: Language
type: Concept
ISO 639-3 code: kff
alternative label: Koya language
definition: Koya (also Koi, Koi Gondi, Kavor, Koa, Koitar, Koyato, Kaya, Koyi, Raj Koya) is a South Central Dravidian language of the Kui-Gondi subgroup. It is variously written in the Oriya, Telugu, Devanagari or Latin script. With 270,994 registered native speakers, it figures at rank 37 in the 1991 Indian census.
in scheme: Lexvo - ISO 639-3 language codes
notation: kff
preferred label: Língua koya @pt

Kudiya
type: Language
type: Concept
ISO 639-3 code: kfg
in scheme: Lexvo - ISO 639-3 language codes
notation: kfg

Minang
type: Language
type: Concept
in scheme: Lexvo - ISO 639-3 language codes

Kurichiya
type: Language
type: Concept
ISO 639-3 code: kfh
in scheme: Lexvo - ISO 639-3 language codes
notation: kfh

Kannada Kurumba
type: Language
type: Concept
ISO 639-3 code: kfi
alternative label: Kurumba, Kannada
definition: Kannada Kurumba language is a Dravidian language spoken by the tribal Kuruba Gowda subcastes of Jenu Kuruba, Kadu Kuruba and Betta Kuruba of South India. These people are spread around the borders of three states of Karnataka, Tamil Nadu and Kerala. The language is also sometimes called as "Jenu Nudi"(Honey language). The language has never been written, apart from recent efforts to write the language using Kannada script. It is considered as a dialect of Kannada with Tamil and Malayalam words interspread.
in scheme: Lexvo - ISO 639-3 language codes
notation: kfi

Kemiehua
type: Language
type: Concept
ISO 639-3 code: kfj
alternative label: Kemie language
definition: Kemiehua, is a poorly classified Mon–Khmer language spoken by a thousand people in China. Li (2005) proposes that it's a Mangic language. It has a subject–object–verb word order.
in scheme: Lexvo - ISO 639-3 language codes
notation: kfj
preferred label: Kemie @fr

Kinnauri
type: Language
type: Concept
ISO 639-3 code: kfk
alternative label: Kinnauri language
definition: Kinnauri, also known as Kanauri, Kanor, Koonawur, or Kunawar is a Tibeto-Burman language (Sino-Tibetan stock) spoken in the Kinnaur district of the Indian state of Himachal Pradesh.
in scheme: Lexvo - ISO 639-3 language codes
notation: kfk
preferred label: Língua kinnauri @pt

Kung
type: Language
type: Concept
ISO 639-3 code: kfl
in scheme: Lexvo - ISO 639-3 language codes
notation: kfl

Krikati-Timbira
type: Language
type: Concept
ISO 639-3 code: xri
in scheme: Lexvo - ISO 639-3 language codes
notation: xri

Khunsari
type: Language
type: Concept
ISO 639-3 code: kfm
alternative label: Khunsari language
definition: Khunsari dialect is a Central dialect within the South Median branch of Northwestern Iranian languages, spoken in Khansar, a town in the west of Isfahan Province of Iran. Some of the oldest isoglosses include the development of Aryan palatals to fricatives: OIr. *dz > z: mossar “big”, kissar “small”, heze “yesterday”, zun- “know”, zumā “son-in-law” (but yešt “ugly” < SW *a-dushta-, cf. NPers. zesht < NW *a-zushta- “ungeliebt”); *tsw > sp: isba, espa “dog” (< Median spaka-), espid “white”, ešpiž “louse”.
in scheme: Lexvo - ISO 639-3 language codes
notation: kfm

Kuk
type: Language
type: Concept
ISO 639-3 code: kfn
in scheme: Lexvo - ISO 639-3 language codes
notation: kfn

Koro
type: Language
type: Concept
ISO 639-3 code: kfo
alternative label: Koro (Côte d'Ivoire)
in scheme: Lexvo - ISO 639-3 language codes
notation: kfo
preferred label: koro @es

Korwa
type: Language
type: Concept
ISO 639-3 code: kfp
in scheme: Lexvo - ISO 639-3 language codes
notation: kfp

Korku
type: Language
type: Concept
ISO 639-3 code: kfq
alternative label: Korku language
definition: The Korku language is the language of the Korku tribe of central India. It belongs to the Kolarian or Munda family, isolated in the midst of a Dravidian (Gondi) population. The Korkus are also closely associated with the Nihali people, many of whom have traditionally lived in special quarters of Korku villages. Korku is spoken by approximately 478,000 people, mainly in four districts of southern Madhya Pradesh (Khandwa, Harda, Betul, Hoshangabad) and three districts of northern Maharashtra (Rajura and Korpana tahsils of Chandrapur district, Manikgarh pahad area near Gadchandur in Chandrapur district) (Amravati, Buldana, Akola). Korku is spoken in a reducing number of villages and is gradually being replaced by Hindi.
in scheme: Lexvo - ISO 639-3 language codes
notation: kfq

Kachchi
type: Language
type: Concept
ISO 639-3 code: kfr
alternative label: Kutchi language
definition: Kutchi (also spelt Cutchi, Kutchhi or Kachchhi, (, , , ) is an Indo-Aryan Language spoken in the Kutch region of the Indian state of Gujarat as well as in Sindh.
in scheme: Lexvo - ISO 639-3 language codes
notation: kfr
preferred label: Kutchi @fr
preferred label: Língua kutchi @pt

Bilaspuri
type: Language
type: Concept
ISO 639-3 code: kfs
in scheme: Lexvo - ISO 639-3 language codes
notation: kfs

Armazic
type: Language
type: Concept
ISO 639-3 code: xrm
in scheme: Lexvo - ISO 639-3 language codes
notation: xrm

Kanjari
type: Language
type: Concept
ISO 639-3 code: kft
in scheme: Lexvo - ISO 639-3 language codes
notation: kft

Katkari
type: Language
type: Concept
ISO 639-3 code: kfu
in scheme: Lexvo - ISO 639-3 language codes
notation: kfu

Kurmukar
type: Language
type: Concept
ISO 639-3 code: kfv
in scheme: Lexvo - ISO 639-3 language codes
notation: kfv

Kharam Naga
type: Language
type: Concept
ISO 639-3 code: kfw
alternative label: Naga, Kharam
in scheme: Lexvo - ISO 639-3 language codes
notation: kfw

Kullu Pahari
type: Language
type: Concept
ISO 639-3 code: kfx
alternative label: Kullu Pahari language
alternative label: Pahari, Kullu
in scheme: Lexvo - ISO 639-3 language codes
notation: kfx

Kumaoni
type: Language
type: Concept
ISO 639-3 code: kfy
alternative label: Kumaoni language
definition: The Kumaoni (कुमाँऊनी (Devanagari)) are a people of the Kumaon Division of Uttarakhand, a region in the Indian Himalayas. Their Kumaoni language (कुमाँऊनी भाषा (Devanagari)) is one of the Central Pahari languages.
in scheme: Lexvo - ISO 639-3 language codes
notation: kfy

Zaniza Zapotec
type: Language
type: Concept
ISO 639-3 code: zpw
alternative label: Zapotec, Zaniza
in scheme: Lexvo - ISO 639-3 language codes
notation: zpw

Koromfé
type: Language
type: Concept
ISO 639-3 code: kfz
alternative label: Koromfe language
definition: Koromfe is a Gur language spoken in a U-shaped area around the town of Djibo, in the north of Burkina Faso and southeastern Mali, bordering Dogon Country.
in scheme: Lexvo - ISO 639-3 language codes
notation: kfz
preferred label: Koromfe @de

Arin
type: Language
type: Concept
ISO 639-3 code: xrn
alternative label: Arin language
definition: Arin was a Yeniseian language spoken in Russia along the Yenisei River between Yeniseysk and Krasnoyarsk. It is classified as a Southern Yeniseian language, along with Kott and Assan.
in scheme: Lexvo - ISO 639-3 language codes
notation: xrn
preferred label: Arine @fr

Koyaga
type: Language
type: Concept
ISO 639-3 code: kga
in scheme: Lexvo - ISO 639-3 language codes
notation: kga

Kawe
type: Language
type: Concept
ISO 639-3 code: kgb
in scheme: Lexvo - ISO 639-3 language codes
notation: kgb

Kasseng
type: Language
type: Concept
ISO 639-3 code: kgc
in scheme: Lexvo - ISO 639-3 language codes
notation: kgc

Kataang
type: Language
type: Concept
ISO 639-3 code: kgd
alternative label: Kataang dialect
definition: Kataang (Katang) is a dialect of the Bru language ( ) spoken in Laos.
in scheme: Lexvo - ISO 639-3 language codes
notation: kgd

Komering
type: Language
type: Concept
ISO 639-3 code: kge
alternative label: Komering language
definition: Komering is a Malayo-Polynesian language spoken in Indonesia, in the southern part of Sumatra.
in scheme: Lexvo - ISO 639-3 language codes
notation: kge

Kube
type: Language
type: Concept
ISO 639-3 code: kgf
alternative label: Kube language
definition: Kube (Hube), also Mongi, is a Papuan language spoken in Morobe Province, Papua New Guinea. Dialects are Kurungtufu, Yoangen (Yoanggeng).
in scheme: Lexvo - ISO 639-3 language codes
notation: kgf

Idioma kusunda
type: Language
type: Concept
ISO 639-3 code: kgg
alternative label: Kusunda language
definition: Kusunda is a language isolate spoken by a handful of people in western Nepal. It has only recently been described in any detail.
in scheme: Lexvo - ISO 639-3 language codes
notation: kgg
preferred label: Kusunda
preferred label: Lingua kusunda @it

Selangor Sign Language
type: Language
type: Concept
ISO 639-3 code: kgi
definition: Selangor Sign Language (SSL), also known as Kuala Lumpur Sign Language (KLSL), is a sign language used in Malaysia. It was originally based on American Sign Language (ASL) but has diverged significantly enough to now be considered a language in its own right. Kuala Lumpur was formerly located in the state of Selangor before it became a federal territory in 1974.
in scheme: Lexvo - ISO 639-3 language codes
notation: kgi
preferred label: Língua de sinais de Selangor @pt

Gamale Kham
type: Language
type: Concept
ISO 639-3 code: kgj
alternative label: Kham, Gamale
in scheme: Lexvo - ISO 639-3 language codes
notation: kgj

Kaiwá
type: Language
type: Concept
ISO 639-3 code: kgk
in scheme: Lexvo - ISO 639-3 language codes
notation: kgk

Kunggari
type: Language
type: Concept
ISO 639-3 code: kgl
in scheme: Lexvo - ISO 639-3 language codes
notation: kgl

Karipúna
type: Language
type: Concept
ISO 639-3 code: kgm
in scheme: Lexvo - ISO 639-3 language codes
notation: kgm

Karranga
type: Language
type: Concept
in scheme: Lexvo - ISO 639-3 language codes

Karingani
type: Language
type: Concept
ISO 639-3 code: kgn
in scheme: Lexvo - ISO 639-3 language codes
notation: kgn

Krongo
type: Language
type: Concept
ISO 639-3 code: kgo
alternative label: Krongo language
definition: Krongo, also spelled Korongo or Kurungu and known as Dimodongo, Kadumodi, or Tabanya after local towns, is a Kadu language spoken in Kordofan.
in scheme: Lexvo - ISO 639-3 language codes
notation: kgo

Kaingang
type: Language
type: Concept
ISO 639-3 code: kgp
alternative label: Kaingang language
definition: The Kaingang language (also spelled Kaingáng) is an indigenous language spoken in the South of Brazil, belonging to the Gê language family. The Kaingang nation has about 30,000 people, and about from 60% to 65% speak the language. The majority also speaks Portuguese.
in scheme: Lexvo - ISO 639-3 language codes
notation: kgp
preferred label: Idioma kaingáng @es
preferred label: Língua caingangue @pt

Kamoro
type: Language
type: Concept
ISO 639-3 code: kgq
alternative label: Kamoro language
definition: The Kamoro language is an Asmat–Kamoro language spoken in New Guinea by approximately 8,000 people.
in scheme: Lexvo - ISO 639-3 language codes
notation: kgq

Abun
type: Language
type: Concept
ISO 639-3 code: kgr
alternative label: Abun language
definition: Abun, also known as Yimbun, A Nden, Manif, Karon, is a West Papuan language of New Guinea. It is not closely related to any other language, and though Ross (2005) assigned it to the West Papuan family, based on similarities in pronouns, Ethnologue (2009) removed it as a language isolate.
in scheme: Lexvo - ISO 639-3 language codes
notation: kgr

Raetic
type: Language
type: Concept
ISO 639-3 code: xrr
alternative label: Raetic language
definition: Raetic (also Rhaetic, Rhaetian) is an extinct language spoken in the ancient region of Raetia in the Eastern Alps in pre-Roman and Roman times. It is documented by a limited number of short inscriptions (found through Northern Italy and West Austria) in two variants of the Etruscan alphabet. Its linguistic categorization is not clearly established, and it presents a confusing mixture of what appear to be Etruscan, Indo-European, and uncertain other elements.
in scheme: Lexvo - ISO 639-3 language codes
notation: xrr
preferred label: Idioma rético @es
preferred label: Langue rhétienne @fr
preferred label: Lingua retica @it
preferred label: Rätische Sprache @de

Kumbainggar
type: Language
type: Concept
ISO 639-3 code: kgs
alternative label: Kumbainggar language
definition: Kumbainggar language (also called Gumbaingari, Gumbaynggir, Kumbaingeri, Gambalamam, Baanbay) is an aboriginal Australian language. It is spoken in New South Wales, Grafton and north coast.
in scheme: Lexvo - ISO 639-3 language codes
notation: kgs

Somyev
type: Language
type: Concept
ISO 639-3 code: kgt
alternative label: Somyev language
definition: Somyev (Somyewe), also known as Kila, is a nearly extinct Mambiloid language of Nigeria, spoken by a caste of blacksmiths that live among the Mambila.
in scheme: Lexvo - ISO 639-3 language codes
notation: kgt

Kobol
type: Language
type: Concept
ISO 639-3 code: kgu
in scheme: Lexvo - ISO 639-3 language codes
notation: kgu

Karas
type: Language
type: Concept
ISO 639-3 code: kgv
alternative label: Karas language
definition: Karas is a divergent Trans–New Guinea language spoken on Karas Island off the Bomberai Peninsula, that appears to be most closely related to the West Bomberai languages.
in scheme: Lexvo - ISO 639-3 language codes
notation: kgv

Karon Dori
type: Language
type: Concept
ISO 639-3 code: kgw
alternative label: Karon Dori language
definition: Karon Dori is a Papuan language of the Bird's Head Peninsula of West Papua.
in scheme: Lexvo - ISO 639-3 language codes
notation: kgw

Kamaru
type: Language
type: Concept
ISO 639-3 code: kgx
in scheme: Lexvo - ISO 639-3 language codes
notation: kgx

Kyerung
type: Language
type: Concept
ISO 639-3 code: kgy
in scheme: Lexvo - ISO 639-3 language codes
notation: kgy

Khasi
type: Language
type: Concept
ISO 639-2 Bibliographical code: kha
ISO 639-2 Terminological code: kha
ISO 639-3 code: kha
alternative label: Khasi language
alternative label: Khasi-Sprache @de
alternative label: Língua khasi @pt
definition: Khasi is an Austro-Asiatic language spoken primarily in Meghalaya state in India by the Khasi people. Khasi is part of the Austroasiatic family of languages, and is fairly closely related to the Munda branch of that family, which is spoken in east–central India.
in scheme: Lexvo - ISO 639-3 language codes
notation: kha
preferred label: khasi @es

Lü
type: Language
type: Concept
ISO 639-3 code: khb
alternative label: Tai Lü language
definition: Tai Lü ᦑᦺᦟᦹᧉ (or Tai Lɯ, Tai Lue, Tai Le ; Xishuangbanna Dai; Chinese: 傣仂语 Dǎilèyǔ; Thai: ภาษาไทลื้อ (Phasa Thai Leu, ); Vietnamese: Lự or Lữ) is a language spoken by about 670,000 people in South East Asia. This includes 250,000 people in China, 200,000 in Burma, 134,000 in Thailand, and 5,000 in Vietnam. The language is similar to other Tai languages.
in scheme: Lexvo - ISO 639-3 language codes
notation: khb
preferred label: Tai Lü @de

Tukang Besi North
type: Language
type: Concept
ISO 639-3 code: khc
in scheme: Lexvo - ISO 639-3 language codes
notation: khc

Bädi Kanum
type: Language
type: Concept
ISO 639-3 code: khd
alternative label: Kanum, Bädi
in scheme: Lexvo - ISO 639-3 language codes
notation: khd

Korowai
type: Language
type: Concept
ISO 639-3 code: khe
alternative label: Korowai language
definition: Korowai (Kolufaup) is a Papuan language of Papua New Guinea.
in scheme: Lexvo - ISO 639-3 language codes
notation: khe

Khuen
type: Language
type: Concept
ISO 639-3 code: khf
in scheme: Lexvo - ISO 639-3 language codes
notation: khf

Khams Tibetan
type: Language
type: Concept
ISO 639-3 code: khg
alternative label: Khams Tibetan language
alternative label: Tibetan, Khams
definition: Khams Tibetan (; also called Kham kä) is the Tibetan language used by the majority of the people in the Kham region of eastern Tibet (E. Tibet Autonomous Region, S. Qinghai, W. Sichuan, Yunnan). It is one of the four main spoken languages of Tibetan, the other three being those of U-Tsang (ü kä), Amdo (am kä) and Western Tibetan (tö kä). All four Tibetan language groups share the same written script, but their pronunciations, vocabularies and grammars are different. These differences may have emerged due to geographical isolation of the regions of Tibet. Khams Tibetan is used alongside Central Tibetan and Amdo Tibetan in broadcasting, but shares the classical Tibetan orthography with them. Khams Tibetan is, however, not intelligible with Amdo, Central Tibetan, or Ladakhi. Like Central Tibetan, it is a tonal language.
in scheme: Lexvo - ISO 639-3 language codes
notation: khg

Kehu
type: Language
type: Concept
ISO 639-3 code: khh
alternative label: Kehu language
definition: Kehu (Keu) is an unclassified and nearly extinct language of New Guinea.
in scheme: Lexvo - ISO 639-3 language codes
notation: khh

Aranama-Tamique
type: Language
type: Concept
ISO 639-3 code: xrt
alternative label: Aranama language
definition: Aranama (Araname), also known as Tamique, is an extinct unclassified language of Texas. It was spoken by the Aranama and Tamique peoples at the Franciscan mission of Espíritu Santo de Zúñiga. It is only known from a two-word phrase from a non-native speaker. Variations on the name are Taranames, Jaranames ~ Xaranames ~ Charinames, Chaimamé, Hanáma ~ Hanáme.
in scheme: Lexvo - ISO 639-3 language codes
notation: xrt

Kuturmi
type: Language
type: Concept
ISO 639-3 code: khj
in scheme: Lexvo - ISO 639-3 language codes
notation: khj

Halh Mongolian
type: Language
type: Concept
ISO 639-3 code: khk
alternative label: Mongolian, Halh
in scheme: Lexvo - ISO 639-3 language codes
notation: khk

Lusi
type: Language
type: Concept
ISO 639-3 code: khl
alternative label: Lusi language
definition: Lusi is an Austronesian languages of New Britain. Kaliai is a dialect.
in scheme: Lexvo - ISO 639-3 language codes
notation: khl

Khmer
type: Language
type: Concept
ISO 639-1 code: km
ISO 639-2 Bibliographical code: khm
ISO 639-2 Terminological code: khm
ISO 639-3 code: khm
alternative label: Central Khmer
alternative label: Khmer, Central
alternative label: khmer central @fr
in scheme: Lexvo - ISO 639-3 language codes
notation: khm
preferred label: Kambodschanisch @de
preferred label: cmer @pt
preferred label: jemer @es
preferred label: khmer @fr

Khandesi
type: Language
type: Concept
ISO 639-3 code: khn
in scheme: Lexvo - ISO 639-3 language codes
notation: khn

Sakan
type: Language
type: Concept
ISO 639-2 Bibliographical code: kho
ISO 639-2 Terminological code: kho
ISO 639-3 code: kho
alternative label: Khotanese
alternative label: Língua kothanesa @pt
alternative label: Língua saka @pt
alternative label: Saka language
alternative label: Sakische Sprache @de
alternative label: khotanais @fr
definition: Saka or Sakan is a Middle Iranian language attested from the medieval Buddhist kingdoms of Khotan and Tumxuk in what in now Xinjiang, China. Both dialects share features with modern Wakhi and Pashto. Many Prakrit terms were borrowed from Khotanese into the Tocharian languages.
in scheme: Lexvo - ISO 639-3 language codes
notation: kho
preferred label: Khotanais @fr
preferred label: Sakisch @de
preferred label: khotanese @it
preferred label: khotanês @pt
preferred label: kotanés @es

Kapori
type: Language
type: Concept
ISO 639-3 code: khp
alternative label: Kapauri
alternative label: Kapori language
definition: Kapori is a former language isolate related to the small family of Kaure languages in the classification of Malcolm Ross (2005).
in scheme: Lexvo - ISO 639-3 language codes
notation: khp

Koyra Chiini
type: Language
type: Concept
ISO 639-3 code: khq
alternative label: Koyra Chiini Songhay
alternative label: Songhay, Koyra Chiini
definition: Koyra Chiini (, literally "town language"), or Western Songhay, is a variety of Songhai in Mali, spoken by about 200,000 people (as of 1999) along the Niger River in Timbuktu and upriver from it in the towns of Diré, Tonka, Goundam, and Niafunké, as well as in the Saharan town of Araouane to its north. In this area, Koyra Chiini is the dominant language and the lingua franca, although minorities speaking Hassaniya Arabic, Tamashek, and Fulani are found. Djenné Chiini , the Songhai variety spoken in Djenné, is mutually comprehensible, but has noticeable differences with Koyra Chiini proper - in particular, two extra vowels ( and ) and syntactic differences related to focalization. East of Timbuktu, Koyra Chiini gives way relatively abruptly to another Songhai language, Koyraboro Senni.
in scheme: Lexvo - ISO 639-3 language codes
notation: khq
preferred label: koyra chiini @es
preferred label: songhay @fr

Kharia
type: Language
type: Concept
ISO 639-3 code: khr
alternative label: Kharia language
definition: The Kharia language is an Austro-Asiatic language that is primarily spoken by indigenous Kharia people of eastern India.
in scheme: Lexvo - ISO 639-3 language codes
notation: khr

Kasua
type: Language
type: Concept
ISO 639-3 code: khs
in scheme: Lexvo - ISO 639-3 language codes
notation: khs

Khamti
type: Language
type: Concept
ISO 639-3 code: kht
in scheme: Lexvo - ISO 639-3 language codes
notation: kht

Marriammu
type: Language
type: Concept
ISO 639-3 code: xru
in scheme: Lexvo - ISO 639-3 language codes
notation: xru

Nkhumbi
type: Language
type: Concept
ISO 639-3 code: khu
alternative label: Nkumbi language
definition: Nkumbi, or Khumbi, is a Bantu language of Angola.
in scheme: Lexvo - ISO 639-3 language codes
notation: khu

Khvarshi
type: Language
type: Concept
ISO 639-3 code: khv
alternative label: Khwarshi language
definition: Khwarshi, also spelled Khvarshi, is a Northeast Caucasian language spoken in the Tsumadinsky-, Kizilyurtovsky- and Khasavyurtovsky districts of Dagestan by the Khwarshi people. The exact number of speakers is not known, but the linguist Zaira Khalilova, who has carried out fieldwork in the period from 2005 to 2009, gives the figure 8,500. Other sources give much lower figures, such as Ethnologue with the figure 1,870 and the latest population census of Russia with the figure 1,872. The low figures are because many Khwarshi have registered themselves as being Avar speakers, The syllabic structure of Khwarshi is also quite simple, with (C)V(C) being the most common structure, of which V(C) is only permitted word-initially.
in scheme: Lexvo - ISO 639-3 language codes
notation: khv

Khowar
type: Language
type: Concept
ISO 639-3 code: khw
alternative label: Khowar language
definition: For the ethnic group, see under Chitrali people. Khowar , also known as Chitrali, is a Dardic language spoken by 400,000 people in Chitral in Khyber Pakhtunkhwa, in the Ghizer district of Gilgit-Baltistan (including the Yasin Valley, Phandar Ishkoman and Gupis), and in parts of Upper Swat. Speakers of Khowar have also migrated heavily to Pakistan's major urban centres with Islamabad, Lahore and Karachi, having sizeable populations. It is spoken as a second language in the rest of Gilgit and Hunza. There are believed to be small numbers of Khowar speakers in Afghanistan, China, Tajikistan and Istanbul.
in scheme: Lexvo - ISO 639-3 language codes
notation: khw
preferred label: Língua khovar @pt

Kanu
type: Language
type: Concept
ISO 639-3 code: khx
in scheme: Lexvo - ISO 639-3 language codes
notation: khx

Kele
type: Language
type: Concept
ISO 639-3 code: khy
alternative label: Kele (Democratic Republic of Congo)
alternative label: Kele language
definition: The Kele language, or Lokele, is a Bantu language spoken in Zaire and the Congo by the Kele people.
in scheme: Lexvo - ISO 639-3 language codes
notation: khy

Keapara
type: Language
type: Concept
ISO 639-3 code: khz
in scheme: Lexvo - ISO 639-3 language codes
notation: khz

Kim
type: Language
type: Concept
ISO 639-3 code: kia
alternative label: Kim language
definition: Kim of southern Chad is an Mbum language spoken by 15,000 people. It was once mistakenly classified as Chadic. There is strong dialectical divergence; Garap (Éré), Gerep (Djouman, Jumam), Kolop (Kilop, Kolobo), and Kosop (Kwasap, Kim) may actually be distinct languages.
in scheme: Lexvo - ISO 639-3 language codes
notation: kia

Karawa
type: Language
type: Concept
ISO 639-3 code: xrw
in scheme: Lexvo - ISO 639-3 language codes
notation: xrw

Koalib
type: Language
type: Concept
ISO 639-3 code: kib
alternative label: Koalib language
definition: Koalib (also called Kwalib, Abri, Lgalige, Nirere, and Rere) is a Niger–Congo language in the Heiban family spoken in the Sudan. The Koalib Nuba, Turum, and Umm Heitan ethnic groups speak this language.
in scheme: Lexvo - ISO 639-3 language codes
notation: kib

Kickapoo
type: Language
type: Concept
ISO 639-3 code: kic
in scheme: Lexvo - ISO 639-3 language codes
notation: kic

Koshin
type: Language
type: Concept
ISO 639-3 code: kid
alternative label: Koshin language
definition: Koshin is a Bantoid language of Cameroon. It is traditionally classified as a Western Beboid language, but that has not been demonstrated to be a valid family.
in scheme: Lexvo - ISO 639-3 language codes
notation: kid
preferred label: Koschin @de

Kibet
type: Language
type: Concept
ISO 639-3 code: kie
in scheme: Lexvo - ISO 639-3 language codes
notation: kie

Eastern Parbate Kham
type: Language
type: Concept
ISO 639-3 code: kif
alternative label: Kham, Eastern Parbate
in scheme: Lexvo - ISO 639-3 language codes
notation: kif

Kimaama
type: Language
type: Concept
ISO 639-3 code: kig
alternative label: Kimaghima
in scheme: Lexvo - ISO 639-3 language codes
notation: kig

Kilmeri
type: Language
type: Concept
ISO 639-3 code: kih
alternative label: Kilmeri language
definition: Kilmeri is a Papuan language of Papua New Guinea near the border with Indonesian Papua. It is not being learned by children.
in scheme: Lexvo - ISO 639-3 language codes
notation: kih

Sabaean
type: Language
type: Concept
ISO 639-3 code: xsa
alternative label: Sabaean language
definition: Sabaean (Sabaic), also known as Himyarite (Himyaritic), was an Old South Arabian language spoken in Yemen from c. 1000 BC to the 6th century AD, by the Sabaeans; it was used as a written language by some other peoples (sha‘bs) of Ancient Yemen, including the Hashidites, Sirwahites, Humlanites, Ghaymanites, Himyarites, Radmanites etc. It was written in the South Arabian alphabet.
in scheme: Lexvo - ISO 639-3 language codes
notation: xsa
preferred label: Idioma sabeo @es

Kitsai
type: Language
type: Concept
ISO 639-3 code: kii
alternative label: Kitsai language
definition: The Kitsai (also Kichai) language is an extinct member of the Caddoan language family. It was spoken in Oklahoma by the Kichai tribe and became extinct in the 1930s. It is thought to be related to Wichita but more closely to Pawnee. The Kichai people today are enrolled in the Wichita and Affiliated Tribes (Wichita, Keechi, Waco and Tawakonie), headquartered in Anadarko, Oklahoma.
in scheme: Lexvo - ISO 639-3 language codes
notation: kii

Kilivila
type: Language
type: Concept
ISO 639-3 code: kij
in scheme: Lexvo - ISO 639-3 language codes
notation: kij

Gikuyu
type: Language
type: Concept
ISO 639-1 code: ki
ISO 639-2 Bibliographical code: kik
ISO 639-2 Terminological code: kik
ISO 639-3 code: kik
alternative label: Gikuyu language
alternative label: Idioma kikuyu @es
preferred label: Kikuyu
alternative label: Kikuyu-Sprache @de
alternative label: Língua kikuyu @pt
definition: Gikuyu or Kikuyu (, pronounced ) is a language of the Bantu family spoken primarily by the Kikuyu people of Kenya. Numbering about 6 million (22% of Kenya's population), they are the largest ethnic group in Kenya. Gikuyu is spoken in the area between Nyeri and Nairobi. Gikuyu is one of the five languages of the Thagichu subgroup of the Bantu languages, which stretches from Kenya to Tanzania. The Gikuyu people usually identify their lands by the surrounding mountain ranges in Central Kenya which they call Kirinyaga.
in scheme: Lexvo - ISO 639-3 language codes
notation: kik
preferred label: kikuyu @es
preferred label: quicuio @pt

Kariya
type: Language
type: Concept
ISO 639-3 code: kil
alternative label: Kariya language
definition: Kariya is an Afroasiatic language spoken in a single village of Bauchi State, Nigeria.
in scheme: Lexvo - ISO 639-3 language codes
notation: kil

Karagas
type: Language
type: Concept
ISO 639-3 code: kim
alternative label: Tofa language
definition: Tofa, also known as Tofalar or Karagas, is one of the Turkic languages spoken in Russia's Irkutsk Oblast by the Tofalars. It is a moribund language; in 2001 only 28 people were reported to speak it.
in scheme: Lexvo - ISO 639-3 language codes
notation: kim
preferred label: Tofalar @fr
preferred label: Tofalarische Sprache @de

Kinyarwanda
type: Language
type: Concept
ISO 639-1 code: rw
ISO 639-2 Bibliographical code: kin
ISO 639-2 Terminological code: kin
ISO 639-3 code: kin
alternative label: Idioma kiñarwanda @es
alternative label: Lingua kinyarwanda @it
alternative label: Língua kinyarwanda @pt
definition: Kinyarwanda (also sometimes known as Rwanda, Ruanda or Rwandan), is a dialect of the Rwanda-Rundi language spoken by some 12 million people in Rwanda, where it is the official language, and adjacent parts of southern Uganda. (The Kirundi dialect is the official language of neighboring Burundi.)
in scheme: Lexvo - ISO 639-3 language codes
notation: kin
preferred label: Ruandisch @de
preferred label: kinyarwanda @es
preferred label: rwanda @fr

Kiowa
type: Language
type: Concept
ISO 639-3 code: kio
alternative label: Kiowa language
definition: Kiowa is a Kiowa–Tanoan language spoken by the Kiowa Tribe of Oklahoma in primarily Caddo, Kiowa, and Comanche counties. The Kiowa tribal center is located in Carnegie. Like most North American languages, Kiowa is an endangered language.
in scheme: Lexvo - ISO 639-3 language codes
notation: kio

Sheshi Kham
type: Language
type: Concept
ISO 639-3 code: kip
alternative label: Kham, Sheshi
in scheme: Lexvo - ISO 639-3 language codes
notation: kip

Kosare
type: Language
type: Concept
ISO 639-3 code: kiq
alternative label: Kosadle
in scheme: Lexvo - ISO 639-3 language codes
notation: kiq

Kyrgyz
type: Language
type: Concept
ISO 639-1 code: ky
ISO 639-2 Bibliographical code: kir
ISO 639-2 Terminological code: kir
ISO 639-3 code: kir
alternative label: Idioma kirguís @es
alternative label: Kirghiz
alternative label: Kirghize @fr
alternative label: Kirgisische Sprache @de
alternative label: Kyrgyz language
alternative label: Lingua chirghisa @it
alternative label: Língua quirguiz @pt
alternative label: kirghize @fr
definition: Kyrgyz or Kirgiz, also Kirghiz, Kyrghiz, Qyrghiz (, , ) is a Turkic language and one of the two official languages of Kyrgyzstan, the other being Russian. It is a member of the Kazakh-Nogai subgroup of the Kypchak languages, and modern day language convergence has resulted in an increasing degree of mutual intelligibility between Kyrgyz and Kazakh.
in scheme: Lexvo - ISO 639-3 language codes
notation: kir
preferred label: Kirgisisch @de
preferred label: kirghiso @it
preferred label: kirghiz @es
preferred label: quirguiz @pt

Kis
type: Language
type: Concept
ISO 639-3 code: kis
in scheme: Lexvo - ISO 639-3 language codes
notation: kis

Agob
type: Language
type: Concept
ISO 639-3 code: kit
alternative label: Agob language
definition: Agöb, or Dabu, is a language of the South-Central Papuan family, spoken in the Western Province of Papua New Guinea. It forms a dialect chain with Idi; the Idi and Agob dialects are at the ends of the chain.
in scheme: Lexvo - ISO 639-3 language codes
notation: kit

Sambal
type: Language
type: Concept
ISO 639-3 code: xsb
alternative label: Botolan language
definition: Botolan is a Sambalic language spoken by 32,867 (SIL 2000) Sambal, primarily in the Zambal municipalities of Botolan and Cabangan in the Philippines.
in scheme: Lexvo - ISO 639-3 language codes
notation: xsb

Kirmanjki
type: Language
type: Concept
ISO 639-3 code: kiu
alternative label: Kirmanjki (individual language)
in scheme: Lexvo - ISO 639-3 language codes
notation: kiu

Kimbu
type: Language
type: Concept
ISO 639-3 code: kiv
alternative label: Kimbu language
definition: Kimbu is a Bantu language of Tanzania.
in scheme: Lexvo - ISO 639-3 language codes
notation: kiv

Northeast Kiwai
type: Language
type: Concept
ISO 639-3 code: kiw
alternative label: Kiwai, Northeast
in scheme: Lexvo - ISO 639-3 language codes
notation: kiw

Khiamniungan Naga
type: Language
type: Concept
ISO 639-3 code: kix
alternative label: Khiamniungan language
alternative label: Naga, Khiamniungan
definition: Khiamniungan (Khiamngan, Khiamniungan) is a Tibeto-Burman language of north-eastern India.
in scheme: Lexvo - ISO 639-3 language codes
notation: kix

Kirikiri
type: Language
type: Concept
ISO 639-3 code: kiy
in scheme: Lexvo - ISO 639-3 language codes
notation: kiy

Kisi
type: Language
type: Concept
ISO 639-3 code: kiz
alternative label: Kisi language
definition: Kisi is a Bantu language of Tanzania. Though only half or so of the Kisi people speak the language, use is vigorous where it is still spoken.
in scheme: Lexvo - ISO 639-3 language codes
notation: kiz

Mlap
type: Language
type: Concept
ISO 639-3 code: kja
in scheme: Lexvo - ISO 639-3 language codes
notation: kja

Kanjobal
type: Language
type: Concept
ISO 639-3 code: kjb
preferred label: Q'anjob'al
alternative label: Q’anjob’al language
definition: Qanjobal (also Kanjobal) is a Mayan language spoken primarily in Guatemala and part of Mexico. According to 1998 estimates compiled by SIL International in Ethnologue, there were approximately 77,700 native speakers, primarily in the Huehuetenango Department of Guatemala. Qanjobal is a member of the Qanjobalan branch of the Mayan language family. The Mayan language family includes 31 languages, two of which are now extinct. The Qanjobalan branch includes not only Qanjobal itself but also Chuj, Akatek, and Jakaltek, also spoken in Guatemala. The Qanjobalan languages are noted for being among the most conservative of the Mayan language family, although they do include some interesting innovations.
in scheme: Lexvo - ISO 639-3 language codes
notation: kjb
preferred label: Idioma q'anjob'al @es
preferred label: Kanjobal-Sprache @de
preferred label: Língua canjobal @pt

Coastal Konjo
type: Language
type: Concept
ISO 639-3 code: kjc
alternative label: Konjo, Coastal
in scheme: Lexvo - ISO 639-3 language codes
notation: kjc

Southern Kiwai
type: Language
type: Concept
ISO 639-3 code: kjd
alternative label: Kiwai, Southern
in scheme: Lexvo - ISO 639-3 language codes
notation: kjd

San Baltazar Loxicha Zapotec
type: Language
type: Concept
ISO 639-3 code: zpx
alternative label: Zapotec, San Baltazar Loxicha
in scheme: Lexvo - ISO 639-3 language codes
notation: zpx

Kisar
type: Language
type: Concept
ISO 639-3 code: kje
in scheme: Lexvo - ISO 639-3 language codes
notation: kje

Scythian
type: Language
type: Concept
ISO 639-3 code: xsc
alternative label: Scythian languages
definition: Scythian languages ( or ) refers to all the languages spoken by all the peoples of a vast region of Eurasia named Scythia extending from the Vistula river in East Europe to Sakastan and Mongolia in Central Asia during ancient times. Included also are some languages of eastern Iran and the Central Asian subcontinent. These peoples were at some time by some ancient authors designated as "Scythians" with the form of the name customarily known to them. Languages of many different groups and families must have been spoken by the Scythians. Their modes of subsistence varied from sedentary and agricultural to nomadic and pastoral. They were both warriors and merchants.
in scheme: Lexvo - ISO 639-3 language codes
notation: xsc
preferred label: Langues scythes @fr
preferred label: Línguas citas @pt

Khalaj
type: Language
type: Concept
ISO 639-3 code: kjf
in scheme: Lexvo - ISO 639-3 language codes
notation: kjf

Khmu
type: Language
type: Concept
ISO 639-3 code: kjg
alternative label: Khmu language
definition: Khmu is the language of the Khmu people of the northern Laos region. It is also spoken in adjacent areas of Vietnam, Thailand and China. Khmu lends its name to the Khmuic branch of the Austro-Asiatic language family, the latter of which also includes Khmer and Vietnamese. Within Austro-Asiatic, Khmu is often cited as being most closely related to the Palaungic and Khasic languages. The name "Khmu" can also be seen romanized as Kmhmu, Khmu', Kammu, or Khamuk in various publications or alternatively referred to by the name of a local dialect.
in scheme: Lexvo - ISO 639-3 language codes
notation: kjg

Khakas
type: Language
type: Concept
ISO 639-3 code: kjh
alternative label: Fuyü Gïrgïs dialect
definition: Fuyü Gïrgïs or Fu-Yu Kirgiz, also known as Manchurian Kirghiz, is the easternmost Turkic language. It is spoken in northeastern China's Heilongjiang province, in and around Fuyu County, Qiqihar, which is located approximately 300 km northwest of Harbin. Fuyü Gïrgïs is spoken by a small number of passive speakers, who are classified as Kyrgyz nationality. However, it is not a dialect of Kyrgyz, but of Khakas; the people migrated from Russia in 1761, and the name may be due to the survival of a common tribal name. Girgis is probably a member of the Siberian Turkic languages and related to the Khakas language.
in scheme: Lexvo - ISO 639-3 language codes
notation: kjh
preferred label: Gïrgïs de Fu-Yü @fr

Zabana
type: Language
type: Concept
ISO 639-3 code: kji
in scheme: Lexvo - ISO 639-3 language codes
notation: kji

Khinalugh
type: Language
type: Concept
ISO 639-3 code: kjj
alternative label: Khinalug language
definition: Khinalug (also spelled Khinalig, Xinalug(h) or Khinalugh) is a Northeast Caucasian language spoken by about 1,500 people in the villages of Khinalug and Gülüstan in the mountains of Quba Rayon, northern Azerbaijan. It forms its own independent branch within the Northeast Caucasian language family.
in scheme: Lexvo - ISO 639-3 language codes
notation: kjj
preferred label: Chinalugische Sprache @de
preferred label: Khinalug @fr
preferred label: Língua khinalug @pt

Highland Konjo
type: Language
type: Concept
ISO 639-3 code: kjk
alternative label: Konjo, Highland
in scheme: Lexvo - ISO 639-3 language codes
notation: kjk

Western Parbate Kham
type: Language
type: Concept
ISO 639-3 code: kjl
alternative label: Kham, Western Parbate
in scheme: Lexvo - ISO 639-3 language codes
notation: kjl

Kháng
type: Language
type: Concept
ISO 639-3 code: kjm
in scheme: Lexvo - ISO 639-3 language codes
notation: kjm

Kunjen
type: Language
type: Concept
ISO 639-3 code: kjn
alternative label: Kunjen language
definition: Kunjen is a Paman language spoken on the Cape York Peninsula of Queensland, Australia, by the Uw Olkola and Uw Oykangand people. The two dialects, Uw Olkola and Uw Oykangand, are very close, being mutually intelligible and sharing 97% of their core vocabulary.
in scheme: Lexvo - ISO 639-3 language codes
notation: kjn

Harijan Kinnauri
type: Language
type: Concept
ISO 639-3 code: kjo
alternative label: Kinnauri, Harijan
in scheme: Lexvo - ISO 639-3 language codes
notation: kjo

Pwo Eastern Karen
type: Language
type: Concept
ISO 639-3 code: kjp
alternative label: Eastern Pwo language
alternative label: Karen, Pwo Eastern
definition: Eastern Pwo, or Phlou, is a Karen language spoken by over a million people in Burma and by about 50,000 in Thailand, where it has been called Southern Pwo. It is not intelligible with other varieties of Pwo.
in scheme: Lexvo - ISO 639-3 language codes
notation: kjp

Western Keres
type: Language
type: Concept
ISO 639-3 code: kjq
alternative label: Keres, Western
in scheme: Lexvo - ISO 639-3 language codes
notation: kjq

Kurudu
type: Language
type: Concept
ISO 639-3 code: kjr
in scheme: Lexvo - ISO 639-3 language codes
notation: kjr

East Kewa
type: Language
type: Concept
ISO 639-3 code: kjs
alternative label: Kewa, East
in scheme: Lexvo - ISO 639-3 language codes
notation: kjs

Sidetic
type: Language
type: Concept
ISO 639-3 code: xsd
alternative label: Sidetic language
definition: The Sidetic language is a member of the extinct Anatolian branch of the Indo-European language family known from legends of coins dating to the period of approx. the 5th to 3rd centuries BC found in Side at the Pamphylian coast. The Greek historian Arrian mentions the existence of a peculiar indigenous language in the city of Side. Sidetic was probably closely related to Lydian, Carian and Lycian.
in scheme: Lexvo - ISO 639-3 language codes
notation: xsd
preferred label: Lingua sidetica @it
preferred label: Sidetische Sprache @de
preferred label: Sidétique @fr

Phrae Pwo Karen
type: Language
type: Concept
ISO 639-3 code: kjt
alternative label: Karen, Phrae Pwo
in scheme: Lexvo - ISO 639-3 language codes
notation: kjt

Kashaya
type: Language
type: Concept
ISO 639-3 code: kju
alternative label: Kashaya language
definition: Kashaya (also Southwestern Pomo, Kashia) is a name for a branch of Pomo people whose historical home is the Pacific Coastline of what is now Sonoma County, California, and also their severely endangered Pomoan language. The Pomoan languages have been classified as part of the Hokan language family, although this proposal is controversial. The name Kashaya corresponds to words in neighboring languages with meanings such as "skillful" and "expert gambler". It is spoken by the Kashia Band of Pomo Indians of the Stewarts Point Rancheria.
in scheme: Lexvo - ISO 639-3 language codes
notation: kju

Ramopa
type: Language
type: Concept
ISO 639-3 code: kjx
in scheme: Lexvo - ISO 639-3 language codes
notation: kjx

Erave
type: Language
type: Concept
ISO 639-3 code: kjy
in scheme: Lexvo - ISO 639-3 language codes
notation: kjy

Bumthangkha
type: Language
type: Concept
ISO 639-3 code: kjz
alternative label: Bumthang language
definition: The Bumthang language (Dzongkha: བུམ་ཐང་ཁ་; Wylie: Bum-thang-kha; also called "Bhumtam," "Bumtang(kha)," "Bumtanp," "Bumthapkha," and "Kebumtamp") is an East Bodish language spoken by about 36,500 people in Bumthang and surrounding districts in central Bhutan. Van Driem (1993) describes Bumthangkha as the dominant language of central Bhutan.
in scheme: Lexvo - ISO 639-3 language codes
notation: kjz

Kakanda
type: Language
type: Concept
ISO 639-3 code: kka
in scheme: Lexvo - ISO 639-3 language codes
notation: kka

Kwerisa
type: Language
type: Concept
ISO 639-3 code: kkb
in scheme: Lexvo - ISO 639-3 language codes
notation: kkb

Odoodee
type: Language
type: Concept
ISO 639-3 code: kkc
alternative label: Odoodee language
definition: Odoodee (Ododei) is a Trans–New Guinea language of New Guinea, spoken in the plains east of the Strickland River.
in scheme: Lexvo - ISO 639-3 language codes
notation: kkc

Kinuku
type: Language
type: Concept
ISO 639-3 code: kkd
in scheme: Lexvo - ISO 639-3 language codes
notation: kkd

Kakabe
type: Language
type: Concept
ISO 639-3 code: kke
in scheme: Lexvo - ISO 639-3 language codes
notation: kke

Kalaktang Monpa
type: Language
type: Concept
ISO 639-3 code: kkf
alternative label: Monpa, Kalaktang
in scheme: Lexvo - ISO 639-3 language codes
notation: kkf

Mabaka Valley Kalinga
type: Language
type: Concept
ISO 639-3 code: kkg
alternative label: Kalinga, Mabaka Valley
in scheme: Lexvo - ISO 639-3 language codes
notation: kkg

Khün
type: Language
type: Concept
ISO 639-3 code: kkh
alternative label: Khün language
definition: The Khün language or Tai Khün language (Tai Khün: Dai Kun, ; Thai: ไทเขิน ) is the language of the Tai Khün people of Kengtung, Shan state, Myanmar. It is a Tai language, closely related to Thai and Lao.
in scheme: Lexvo - ISO 639-3 language codes
notation: kkh

Kagulu
type: Language
type: Concept
ISO 639-3 code: kki
in scheme: Lexvo - ISO 639-3 language codes
notation: kki

Sempan
type: Language
type: Concept
ISO 639-3 code: xse
alternative label: Sempan language
definition: Sempan or Nararapi is a language spoken in Western New Guinea.
in scheme: Lexvo - ISO 639-3 language codes
notation: xse

Kako
type: Language
type: Concept
ISO 639-3 code: kkj
alternative label: Kako language
preferred label: kako @es
definition: Kako or Mkako or Mkaka, is a Bantu language spoken mainly in Cameroon, but also has speakers in the Central African Republic and Congo. The main population centers of Kako speakers includes Batouri and Ndélélé in the East Region of Cameroon.
in scheme: Lexvo - ISO 639-3 language codes
notation: kkj

Kokota
type: Language
type: Concept
ISO 639-3 code: kkk
alternative label: Kokota language
definition: Kokota is an Austronesian language spoken by perhaps as many as 1,200 people in three villages on Santa Isabel in the Solomon Islands. The villages of Goveo and Sisiga lie on the north coast, while Hurepelo lies on the south coast. People in all three villages use the language daily, but may eventually switch to neighboring Cheke Holo to the west, a language spoken by many more people who have recently settled between Goveo and Sisiga (Palmer 2009:1-2).
in scheme: Lexvo - ISO 639-3 language codes
notation: kkk

Kosarek Yale
type: Language
type: Concept
ISO 639-3 code: kkl
alternative label: Yale, Kosarek
in scheme: Lexvo - ISO 639-3 language codes
notation: kkl

Kiong
type: Language
type: Concept
ISO 639-3 code: kkm
in scheme: Lexvo - ISO 639-3 language codes
notation: kkm

Kon Keu
type: Language
type: Concept
ISO 639-3 code: kkn
in scheme: Lexvo - ISO 639-3 language codes
notation: kkn

Karko
type: Language
type: Concept
ISO 639-3 code: kko
in scheme: Lexvo - ISO 639-3 language codes
notation: kko

Gugubera
type: Language
type: Concept
ISO 639-3 code: kkp
in scheme: Lexvo - ISO 639-3 language codes
notation: kkp

Kaiku
type: Language
type: Concept
ISO 639-3 code: kkq
alternative label: Kaiku language
definition: Kaiku is a Bantu language of the Democratic Republic of the Congo.
in scheme: Lexvo - ISO 639-3 language codes
notation: kkq

Kir-Balar
type: Language
type: Concept
ISO 639-3 code: kkr
alternative label: Kir-Balar language
definition: Kir-Balar (also known as Kir, Kirr) is an Afro-Asiatic language spoken in Bauchi State, Nigeria.
in scheme: Lexvo - ISO 639-3 language codes
notation: kkr

Giiwo
type: Language
type: Concept
ISO 639-3 code: kks
alternative label: Giiwo language
definition: Giiwo (also known as Bu Giiwo, Kirfi, Kirifi, Kirifawa) is an Afro-Asiatic language spoken in Nigeria.
in scheme: Lexvo - ISO 639-3 language codes
notation: kks

Koi
type: Language
type: Concept
ISO 639-3 code: kkt
in scheme: Lexvo - ISO 639-3 language codes
notation: kkt

Shamang
type: Language
type: Concept
ISO 639-3 code: xsh
in scheme: Lexvo - ISO 639-3 language codes
notation: xsh

Tumi
type: Language
type: Concept
ISO 639-3 code: kku
in scheme: Lexvo - ISO 639-3 language codes
notation: kku

Kangean
type: Language
type: Concept
ISO 639-3 code: kkv
alternative label: Kangean language
definition: Kangean is a language spoken in Indonesia, in the Kangean Islands which lie to the east of Madura Island. It is barely intelligible with Madurese proper.
in scheme: Lexvo - ISO 639-3 language codes
notation: kkv

Teke-Kukuya
type: Language
type: Concept
ISO 639-3 code: kkw
alternative label: Kukuya language
definition: The Kukuya language, Kikukuya , also transcribed Kukẅa and known as Southern Teke, is a member of the Teke dialect continuum of the Congolese plateau. It is known for being the only language claimed to have a phonemic labiodental nasal . The name comes from the word kuya "plateau".
in scheme: Lexvo - ISO 639-3 language codes
notation: kkw

Kohin
type: Language
type: Concept
ISO 639-3 code: kkx
in scheme: Lexvo - ISO 639-3 language codes
notation: kkx

Guguyimidjir
type: Language
type: Concept
ISO 639-3 code: kky
alternative label: Guugu Yimithirr language
definition: Guugu Yimithirr (many other spellings; see below) is an Australian Aboriginal language, the traditional language of the Guugu Yimithirr people of Far North Queensland. Most of the speakers today live at the community of Hopevale, about 46 km from Cooktown. It is one of the more famous Australian languages because it is the source of the word kangaroo.
in scheme: Lexvo - ISO 639-3 language codes
notation: kky

Kaska
type: Language
type: Concept
ISO 639-3 code: kkz
alternative label: Kaska language
definition: Kaska is a Northern Athabaskan language spoken by the Kaska people in the southeastern Yukon territory and northern British Columbia in Canada.
in scheme: Lexvo - ISO 639-3 language codes
notation: kkz
preferred label: Idioma kaska @es

Klamath-Modoc
type: Language
type: Concept
ISO 639-3 code: kla
alternative label: Klamath language
definition: Klamath-Modoc (also simply Klamath, historically Lutuamian) is a Native American language that was spoken around Klamath Lake in what is now southern Oregon and northern California. It is the traditional language of the Klamath and Modoc peoples, each of whom spoke a dialect of the language. , it was spoken by only one person.
in scheme: Lexvo - ISO 639-3 language codes
notation: kla
preferred label: Idioma klamath-modoc @es
preferred label: Klamath @fr

Sio
type: Language
type: Concept
ISO 639-3 code: xsi
alternative label: Sio language
definition: Sio (also spelled Siâ) is an Austronesian language spoken by about 3,500 people on the north coast of the Huon Peninsula in Morobe Province, Papua New Guinea. According to Harding and Clark (1994), Sio speakers lived in a single village on a small offshore island until the Pacific War, after which they established four villages on the nearby coast: Lambutina, Basakalo, Laelo, and Balambu. Nambariwa, another coastal village a few miles to the east, is also Sio-speaking.
in scheme: Lexvo - ISO 639-3 language codes
notation: xsi

Kiliwa
type: Language
type: Concept
ISO 639-3 code: klb
alternative label: Kiliwa language
definition: Kiliwa (in Kiliwa: K’olew Ñaja’) is a Yuman language spoken in Baja California, in the far northwest of Mexico, by the Kiliwa people. It may form part of the hypothetical Hokan linguistic phylum. Kiliwa is the southernmost representative of the family, and the one that is most distinct from the remaining Yuman languages, which constitute Core Yuman. The Kiliwa's neighbors to the south, the Cochimí, spoke a language or a family of languages that was probably closely related to but not within the Yuman family. Consequently, the Kiliwa lie at the historic "center of gravity" for the differentiation of Yuman from Cochimí and of the Yuman branches from each other.
in scheme: Lexvo - ISO 639-3 language codes
notation: klb
preferred label: Idioma kiliwa @es
preferred label: Língua kiliwa @pt

Kolbila
type: Language
type: Concept
ISO 639-3 code: klc
in scheme: Lexvo - ISO 639-3 language codes
notation: klc

Gamilaraay
type: Language
type: Concept
ISO 639-3 code: kld
alternative label: Gamilaraay language
definition: The Gamilaraay or Kamilaroi (see below for other spellings) language is a Pama–Nyungan language of the Wiradhuric subgroup found mostly in South East Australia. It was the traditional language of the Kamilaroi people, but is now moribund—according to Ethnologue, there were only 3 speakers left in 1997. However, there are thousands of people of mixed descent both within the native populations as well as immigrant populations, who identify themselves as Kamilaroi. Kamilaroi is also taught in some Australian schools.
in scheme: Lexvo - ISO 639-3 language codes
notation: kld
preferred label: Kamilaroi @fr

Kulung
type: Language
type: Concept
ISO 639-3 code: kle
alternative label: Kulung (Nepal)
alternative label: Kulung language
definition: The Kulung are the people of Rai and Kirant descent, inhabiting Nepal and parts of northeastern India. Their language of the same name is closely related to the fellow Kiranti languages Bantawa and Puma. Alternate names for the language include Khulunge Rai, Kulu Ring, Khulung and Kholung.
in scheme: Lexvo - ISO 639-3 language codes
notation: kle

Kendeje
type: Language
type: Concept
ISO 639-3 code: klf
alternative label: Kendeje language
definition: Kenjeje is a Maban language language of Chad. The two dialects, Yaali and Faranga, are quite distinct, and have little contact.
in scheme: Lexvo - ISO 639-3 language codes
notation: klf

Tagakaulo
type: Language
type: Concept
ISO 639-3 code: klg
in scheme: Lexvo - ISO 639-3 language codes
notation: klg

Weliki
type: Language
type: Concept
ISO 639-3 code: klh
in scheme: Lexvo - ISO 639-3 language codes
notation: klh

Kalumpang
type: Language
type: Concept
ISO 639-3 code: kli
in scheme: Lexvo - ISO 639-3 language codes
notation: kli

Turkic Khalaj
type: Language
type: Concept
ISO 639-3 code: klj
alternative label: Khalaj language
alternative label: Khalaj, Turkic
definition: Khalaj is a Turkic language spoken in Iran. It is a member of the Azerbaijani subgroup of the Oghuz languages. There were approximately 42,000 speakers of this language as of 2000. ISO 639-3 uses the name to distinguish it from the Indo-Iranian language called "Khalaj".
in scheme: Lexvo - ISO 639-3 language codes
notation: klj
preferred label: Chaladschische Sprache @de
preferred label: Khaladj @fr

Kono
type: Language
type: Concept
ISO 639-3 code: klk
alternative label: Kono (Nigeria)
in scheme: Lexvo - ISO 639-3 language codes
notation: klk

Kagan Kalagan
type: Language
type: Concept
ISO 639-3 code: kll
alternative label: Kalagan, Kagan
in scheme: Lexvo - ISO 639-3 language codes
notation: kll

Subi
type: Language
type: Concept
ISO 639-3 code: xsj
in scheme: Lexvo - ISO 639-3 language codes
notation: xsj

Migum
type: Language
type: Concept
ISO 639-3 code: klm
in scheme: Lexvo - ISO 639-3 language codes
notation: klm

Kalenjin
type: Language
type: Concept
ISO 639-3 code: kln
in scheme: Lexvo - ISO 639-3 language codes
notation: kln
preferred label: kalenjin @fr
preferred label: kalenyin @es

Kapya
type: Language
type: Concept
ISO 639-3 code: klo
in scheme: Lexvo - ISO 639-3 language codes
notation: klo

Kamasa
type: Language
type: Concept
ISO 639-3 code: klp
in scheme: Lexvo - ISO 639-3 language codes
notation: klp

Rumu
type: Language
type: Concept
ISO 639-3 code: klq
alternative label: Rumu language
definition: Rumu (Rumuwa), or Kairi (Kai-Iri), is a Papuan language of Papua New Guinea. Other names for it are Dumu (Tumu) and Kibiri.
in scheme: Lexvo - ISO 639-3 language codes
notation: klq

Khaling
type: Language
type: Concept
ISO 639-3 code: klr
alternative label: Khaling language
definition: Khaling is a Kiranti language spoken in Khotang district, Nepal
in scheme: Lexvo - ISO 639-3 language codes
notation: klr

Kalasha
type: Language
type: Concept
ISO 639-3 code: kls
alternative label: Kalash language
definition: Kalasha (also known as Kalasha-mondr) is an Indo-European language in the Indo-Iranian branch spoken by the Kalash people, further classified as a Dardic language in the Chitral Group. Georg Morgenstierne maintains that "The Kalasha do not belong to the special Kafir branch of Indo-Iranian but speak a true Indo-Aryan language." The Kalasha language is phonologically atypical because it contrasts plain, long, nasal, and retroflex vowels as well as combinations of these (Heegård & Mørch 2004). According to the Chitrali researcher Rehmat Aziz Chitrali, the correct name of the language is Kalasha.
in scheme: Lexvo - ISO 639-3 language codes
notation: kls

South Slavey
type: Language
type: Concept
ISO 639-3 code: xsl
alternative label: Slavey, South
in scheme: Lexvo - ISO 639-3 language codes
notation: xsl

Nukna
type: Language
type: Concept
ISO 639-3 code: klt
in scheme: Lexvo - ISO 639-3 language codes
notation: klt

Klao
type: Language
type: Concept
ISO 639-3 code: klu
alternative label: Klao language
definition: Klao (also Klaoh) is a Kru language of the Niger–Congo language family, spoken primarily in Liberia, with some speakers also in Sierra Leone. It uses SVO word order for main clauses and SOV for embedded clauses. A Klao translation of the Bible by missionary Nancy Lightfoot was released in 2000. The language has Western, West Central, Central, and Eastern dialects.
in scheme: Lexvo - ISO 639-3 language codes
notation: klu

Maskelynes
type: Language
type: Concept
ISO 639-3 code: klv
in scheme: Lexvo - ISO 639-3 language codes
notation: klv

Lindu
type: Language
type: Concept
ISO 639-3 code: klw
in scheme: Lexvo - ISO 639-3 language codes
notation: klw

Koluwawa
type: Language
type: Concept
ISO 639-3 code: klx
in scheme: Lexvo - ISO 639-3 language codes
notation: klx

Kalao
type: Language
type: Concept
ISO 639-3 code: kly
in scheme: Lexvo - ISO 639-3 language codes
notation: kly

Kabola
type: Language
type: Concept
ISO 639-3 code: klz
in scheme: Lexvo - ISO 639-3 language codes
notation: klz

Konni
type: Language
type: Concept
ISO 639-3 code: kma
in scheme: Lexvo - ISO 639-3 language codes
notation: kma

Kasem
type: Language
type: Concept
ISO 639-3 code: xsm
alternative label: Kasem language
definition: Kasem is a Gur language spoken in the Upper Eastern Region of Ghana and in Burkina Faso.
in scheme: Lexvo - ISO 639-3 language codes
notation: xsm
preferred label: Kassem @fr

Kimbundu
type: Language
type: Concept
ISO 639-2 Bibliographical code: kmb
ISO 639-2 Terminological code: kmb
ISO 639-3 code: kmb
alternative label: Idioma kimbundu @es
alternative label: Kimbundu-Sprache @de
alternative label: North Mbundu language
alternative label: kiMboundou @fr
alternative label: quimbundo @pt
definition: North Mbundu, or Kimbundu, one of two Bantu languages called Mbundu (see Umbundu), is one of the most widely spoken Bantu languages in Angola, concentrated in the north-west of the country, notably in the Luanda Province, the Bengo Province, the Malanje Province and the Cuanza Norte Province. It is spoken by the Ambundu; (Ambundu is the short form for Akwa Mbundu and Akwa means from, or of, or more originally originally from and belonging to. In Kimbundu language the particle Akwa is shortened into simply A, so that instead of Akwa Mbndu it becomes Ambundu; similarly the term Akwa Ngola becomes ANgola, then Angola; Ngola was title for kings in Northern Angolan kingdom in the past, before the Portuguese invasion).
in scheme: Lexvo - ISO 639-3 language codes
notation: kmb
preferred label: kimbundu @es

Southern Dong
type: Language
type: Concept
ISO 639-3 code: kmc
alternative label: Dong, Southern
in scheme: Lexvo - ISO 639-3 language codes
notation: kmc

Majukayang Kalinga
type: Language
type: Concept
ISO 639-3 code: kmd
alternative label: Kalinga, Majukayang
in scheme: Lexvo - ISO 639-3 language codes
notation: kmd

Bakole
type: Language
type: Concept
ISO 639-3 code: kme
in scheme: Lexvo - ISO 639-3 language codes
notation: kme

Kare
type: Language
type: Concept
ISO 639-3 code: kmf
alternative label: Kare (Papua New Guinea)
alternative label: Kare language
definition: Kare is a Madang language of Papua New Guinea. It was recognized as being somewhat divergent by Malcolm Ross.
in scheme: Lexvo - ISO 639-3 language codes
notation: kmf

Kâte
type: Language
type: Concept
ISO 639-3 code: kmg
alternative label: Kâte language
definition: Kâte is a Papuan language spoken by about 6,000 people in the Finschhafen District of Morobe Province, Papua New Guinea. It is part of the Finisterre–Huon branch of the Trans–New Guinea phylum of languages (Ross 2005). It was adopted for teaching and mission work among speakers of Papuan languages by the Evangelical Lutheran Church of Papua New Guinea in the early 1900s and at one time had as many as 80,000 second-language speakers.
in scheme: Lexvo - ISO 639-3 language codes
notation: kmg

Kalam
type: Language
type: Concept
ISO 639-3 code: kmh
in scheme: Lexvo - ISO 639-3 language codes
notation: kmh

Kami
type: Language
type: Concept
ISO 639-3 code: kmi
alternative label: Kami (Nigeria)
in scheme: Lexvo - ISO 639-3 language codes
notation: kmi

Kumarbhag Paharia
type: Language
type: Concept
ISO 639-3 code: kmj
alternative label: Kumarbhag Paharia language
definition: The Kumarbhag Paharia (Devanagari: कुमारभाग पहाड़िया) language is spoken in the Jharkhand and West Bengal states of India, and tiny pockets of Orissa state. It is a member of the Northern branch of the Dravidian language family, along with the Kurukh language (also spoken in India) and the Brahui language spoken in Pakistan, Iran and Afghanistan. The language is sometime referred to as Kumar Malto. It is closely related to the Sauria Paharia language, to the point where both are sometimes together referred to as the Malto language.
in scheme: Lexvo - ISO 639-3 language codes
notation: kmj
preferred label: Kumarbhag paharia @fr

Limos Kalinga
type: Language
type: Concept
ISO 639-3 code: kmk
alternative label: Kalinga, Limos
in scheme: Lexvo - ISO 639-3 language codes
notation: kmk

Tanudan Kalinga
type: Language
type: Concept
ISO 639-3 code: kml
alternative label: Kalinga, Tanudan
in scheme: Lexvo - ISO 639-3 language codes
notation: kml

Kom
type: Language
type: Concept
ISO 639-3 code: kmm
alternative label: Kom (India)
alternative label: Kom language
definition: Kom is a Kukish language of India.
in scheme: Lexvo - ISO 639-3 language codes
notation: kmm

Mazaltepec Zapotec
type: Language
type: Concept
ISO 639-3 code: zpy
alternative label: Zapotec, Mazaltepec
in scheme: Lexvo - ISO 639-3 language codes
notation: zpy

Awtuw
type: Language
type: Concept
ISO 639-3 code: kmn
alternative label: Awtuw language
definition: Awtuw (Autu), also known as Kamnum, is spoken in Sandaun Province, Papua New Guinea. It is a polysynthetic language closely related to Karawa and Pouye.
in scheme: Lexvo - ISO 639-3 language codes
notation: kmn

Sanga
type: Language
type: Concept
ISO 639-3 code: xsn
alternative label: Sanga (Nigeria)
alternative label: Sanga language
definition: Sanga is a Kainji language of Nigeria.
in scheme: Lexvo - ISO 639-3 language codes
notation: xsn

Kwoma
type: Language
type: Concept
ISO 639-3 code: kmo
alternative label: Kwoma language
definition: Kwoma is a Sepik language of Papua New Guinea.
in scheme: Lexvo - ISO 639-3 language codes
notation: kmo

Gimme
type: Language
type: Concept
ISO 639-3 code: kmp
in scheme: Lexvo - ISO 639-3 language codes
notation: kmp

Kwama
type: Language
type: Concept
ISO 639-3 code: kmq
alternative label: Kwama language
definition: Kwama (also Afan Mao, Amam, Gogwama, Goma, Gwama, Koma of Asosa, Nokanoka, North Koma, T'wa Kwama, Takwama) is a Nilo-Saharan Koman language, spoken in the South Benishangul-Gumuz region of Ethiopia, along the Sudan border between Asosa and Gidami.
in scheme: Lexvo - ISO 639-3 language codes
notation: kmq

Kurmanji
type: Language
type: Concept
ISO 639-3 code: kmr
alternative label: Kurdish, Northern
alternative label: Northern Kurdish
definition: Kurmanji (Kurmancî in Kurdish) or Northern Kurdish (sometimes misspelled as Kirmanji, Kurmangi or Kermanji) is the most commonly spoken dialect of the Kurdish language.
in scheme: Lexvo - ISO 639-3 language codes
notation: kmr
preferred label: Curmânji @pt
preferred label: Kurmandji @fr
preferred label: Kurmandschi @de

Kamasau
type: Language
type: Concept
ISO 639-3 code: kms
in scheme: Lexvo - ISO 639-3 language codes
notation: kms

Kemtuik
type: Language
type: Concept
ISO 639-3 code: kmt
alternative label: Kemtuik language
definition: Kemtuik (Kamtuk) is a Papuan language of Indonesia. It is very close to Gresi.
in scheme: Lexvo - ISO 639-3 language codes
notation: kmt

Kanite
type: Language
type: Concept
ISO 639-3 code: kmu
in scheme: Lexvo - ISO 639-3 language codes
notation: kmu

Lanc-Patuá creole
type: Language
type: Concept
ISO 639-3 code: kmv
alternative label: Creole French, Karipúna
alternative label: Karipúna Creole French
definition: Lanc-Patuá is a creole language spoken in the state of Amapá in Brazil, primarily now around the capital, Macapá. It is a French-based creole language, spoken by local Indians and immigrants from French Guiana, the Caribbean and other areas of Brazil, and their descendants. It has some English and Portuguese influence on its vocabulary, but its grammar is clearly similar to the French-based creole languages of the Caribbean and the Indian Ocean.
in scheme: Lexvo - ISO 639-3 language codes
notation: kmv
preferred label: Karipúna @fr
preferred label: Lanc-patuá @pt
preferred label: Lingua lanc-patuá @it

Komo
type: Language
type: Concept
ISO 639-3 code: kmw
alternative label: Komo (Democratic Republic of Congo)
alternative label: Komo language
definition: Komo is a Bantu language spoken by half a million people in the Democratic Republic of the Congo, including an area around the major upriver port of Kisangani.
in scheme: Lexvo - ISO 639-3 language codes
notation: kmw

Waboda
type: Language
type: Concept
ISO 639-3 code: kmx
in scheme: Lexvo - ISO 639-3 language codes
notation: kmx

Koma
type: Language
type: Concept
ISO 639-3 code: kmy
alternative label: Koma language
definition: The Koma language is a member of the Duru branch of Savanna languages.
in scheme: Lexvo - ISO 639-3 language codes
notation: kmy

Khorasani Turkish
type: Language
type: Concept
ISO 639-3 code: kmz
alternative label: Khorasani Turkic language
definition: Khorasani Turkic (, Torki-e Khorasani), or Qizilbash Turkic , is a language variety in the Turkic language family. It is spoken in northern Khorasan in Iran. Khorasani Turkic speakers can also speak Persian.
in scheme: Lexvo - ISO 639-3 language codes
notation: kmz
preferred label: Chorasan-türkische Sprache @de
preferred label: Idioma turco de Jorasán @es
preferred label: Turk du Khorassan @fr

Solano
type: Language
type: Concept
ISO 639-3 code: xso
alternative label: Solano language
definition: Solano is an unclassified extinct language formerly spoken in northeast Mexico and perhaps also in the neighboring U.S. state of Texas.
in scheme: Lexvo - ISO 639-3 language codes
notation: xso
preferred label: Idioma solano @es

Dera
type: Language
type: Concept
ISO 639-3 code: kna
alternative label: Dera (Nigeria)
in scheme: Lexvo - ISO 639-3 language codes
notation: kna

Lubuagan Kalinga
type: Language
type: Concept
ISO 639-3 code: knb
alternative label: Kalinga, Lubuagan
in scheme: Lexvo - ISO 639-3 language codes
notation: knb

Central Kanuri
type: Language
type: Concept
ISO 639-3 code: knc
alternative label: Kanuri, Central
in scheme: Lexvo - ISO 639-3 language codes
notation: knc

Konda
type: Language
type: Concept
ISO 639-3 code: knd
alternative label: Konda language
definition: Konda (Ogit, Yabin) is the westernmost mainland Trans–New Guinea language.
in scheme: Lexvo - ISO 639-3 language codes
notation: knd

Kankanaey
type: Language
type: Concept
ISO 639-3 code: kne
alternative label: Kankana-ey language
definition: Kankanaey, is a language used on the island of Luzon in The Philippines. It is widely used by Cordillerans, specifically people from the Mountain Province and people from the Northern part of the Benguet Province.
in scheme: Lexvo - ISO 639-3 language codes
notation: kne

Mankanya
type: Language
type: Concept
ISO 639-3 code: knf
alternative label: Mankanya language
definition: The Mankanya language is spoken by approximately 70,000 people in Guinea-Bissau, Senegal and Gambia primarily belonging to the ethnic group of the same name. It belongs to the Bak branch of the Niger–Congo language family.
in scheme: Lexvo - ISO 639-3 language codes
notation: knf
preferred label: Mancagne @fr
preferred label: Mankanja @de

Koongo
type: Language
type: Concept
ISO 639-3 code: kng
in scheme: Lexvo - ISO 639-3 language codes
notation: kng

Kanufi
type: Language
type: Concept
ISO 639-3 code: kni
in scheme: Lexvo - ISO 639-3 language codes
notation: kni

Akatek language
type: Language
type: Concept
ISO 639-3 code: knj
alternative label: Kanjobal, Western
alternative label: Western Kanjobal
definition: Akatek is a Mayan language spoken by the Akatek people primarily in the Huehuetenango Department, Guatemala in and around the municipalities of Concepción Huista, Nentón, San Miguel Acatán, San Rafael La Independencia and San Sebastián Coatán. A number of speakers also live in Chiapas, Mexico. It is a living language with 58,600 speakers as of 1998, of which 48,500 lived in Guatemala and the remaining in Mexico.
in scheme: Lexvo - ISO 639-3 language codes
notation: knj
preferred label: Akatekisch @de
preferred label: Akateko @fr
preferred label: Idioma acateco @es
preferred label: Língua acateca @pt

Kuranko
type: Language
type: Concept
ISO 639-3 code: knk
alternative label: Kuranko language
definition: Kuranko is a Mande language spoken by approximately 350,000 people in Sierra Leone and Guinea. In Guinea it blends into Eastern Maninkakan dialectologically, but the people are ethnically distinct.
in scheme: Lexvo - ISO 639-3 language codes
notation: knk

Keninjal
type: Language
type: Concept
ISO 639-3 code: knl
in scheme: Lexvo - ISO 639-3 language codes
notation: knl

Kanamarí
type: Language
type: Concept
ISO 639-3 code: knm
alternative label: Kanamarí language
definition: Kanamarí is a Katukinian language spoken by about 650 individuals in Amazonas, Brazil. It is considered endangered.
in scheme: Lexvo - ISO 639-3 language codes
notation: knm
preferred label: Idioma kanamarí @es

Konkani
type: Language
type: Concept
ISO 639-3 code: knn
alternative label: Konkani (individual language)
in scheme: Lexvo - ISO 639-3 language codes
notation: knn
preferred label: concani @pt
preferred label: konkani @es

Silopi
type: Language
type: Concept
ISO 639-3 code: xsp
in scheme: Lexvo - ISO 639-3 language codes
notation: xsp

Kono
type: Language
type: Concept
ISO 639-3 code: kno
alternative label: Kono (Sierra Leone)
alternative label: Kono language
definition: The Kono language (Kɔnɔ) is a language spoken in Sierra Leone by the Kono people. The Kono District is situated in the Eastern Province of Sierra Leone and contains 14 chiefdoms, each headed by a Paramount Chief. The language varies slightly between chiefdoms.
in scheme: Lexvo - ISO 639-3 language codes
notation: kno

Kwanja
type: Language
type: Concept
ISO 639-3 code: knp
alternative label: Kwanja language
definition: Kwanja (Konja) is a Mambiloid language of Cameroon.
in scheme: Lexvo - ISO 639-3 language codes
notation: knp

Kintaq
type: Language
type: Concept
ISO 639-3 code: knq
alternative label: Kintaq language
definition: Kintaq, or Kentaq Bong, is an aboriginal Mon–Khmer language of Malaya and Thailand. The small number of speakers is decreasing.
in scheme: Lexvo - ISO 639-3 language codes
notation: knq

Kaningra
type: Language
type: Concept
ISO 639-3 code: knr
in scheme: Lexvo - ISO 639-3 language codes
notation: knr

Kensiu
type: Language
type: Concept
ISO 639-3 code: kns
alternative label: Kensiu language
definition: Kensiu (Kensiw) is a Northern Aslian (Jahaic) language, a sub-branch of the Mon–Khmer language family. It is spoken by a small community of 300 in Yala Province in southern Thailand and also reportedly by a community of approximately 300 speakers in Western Malaysia in Perak and Kedah States. Speakers of this language are Negritos who are known as the Mani people or Maniq of Thailand.
in scheme: Lexvo - ISO 639-3 language codes
notation: kns

Panoan Katukína
type: Language
type: Concept
ISO 639-3 code: knt
alternative label: Katukína, Panoan
in scheme: Lexvo - ISO 639-3 language codes
notation: knt

Kono
type: Language
type: Concept
ISO 639-3 code: knu
alternative label: Kono (Guinea)
in scheme: Lexvo - ISO 639-3 language codes
notation: knu

Makhuwa-Saka
type: Language
type: Concept
ISO 639-3 code: xsq
in scheme: Lexvo - ISO 639-3 language codes
notation: xsq

Tabo
type: Language
type: Concept
ISO 639-3 code: knv
alternative label: Tabo language
definition: Waia (Waya) or Tabo is a language of the proposed South-Central Papuan family in the Western Province of Papua New Guinea.
in scheme: Lexvo - ISO 639-3 language codes
notation: knv

Kung-Ekoka
type: Language
type: Concept
ISO 639-3 code: knw
alternative label: Ekoka !Kung
definition: Ekoka !Kung (Ekoka !Xung, Ekoka-!Xû, Kung-Ekoka) is a variety of the !Kung dialect cluster, spoken originally in northern Namibia and southern Angola, but since the Angolan civil war, also in South Africa.
in scheme: Lexvo - ISO 639-3 language codes
notation: knw

Salako
type: Language
type: Concept
ISO 639-3 code: knx
alternative label: Kendayan
in scheme: Lexvo - ISO 639-3 language codes
notation: knx

Kanyok
type: Language
type: Concept
ISO 639-3 code: kny
in scheme: Lexvo - ISO 639-3 language codes
notation: kny

Kalamsé
type: Language
type: Concept
ISO 639-3 code: knz
in scheme: Lexvo - ISO 639-3 language codes
notation: knz

Konomala
type: Language
type: Concept
ISO 639-3 code: koa
in scheme: Lexvo - ISO 639-3 language codes
notation: koa

Kpati
type: Language
type: Concept
ISO 639-3 code: koc
alternative label: Kpati language
definition: Kpati is an extinct Bantoid language formerly spoken in Taraba State, Nigeria.
in scheme: Lexvo - ISO 639-3 language codes
notation: koc

Langue sherpa
type: Language
type: Concept
ISO 639-3 code: xsr
alternative label: Sherpa language
definition: Sherpa (, EWTS: sher-pA, Devanagari: शेर्पा; also Sharpa, Sharpa Bhotia, Xiaerba, Serwa; ISO 639-3: xsr) is a language spoken in parts of Nepal and Sikkim mainly by the Sherpa community. About 130,000 speakers live in Nepal (2001 census), some 20,000 in India (1997), and some 800 in Tibet (1994).
in scheme: Lexvo - ISO 639-3 language codes
notation: xsr
preferred label: Sherpa

Kodi
type: Language
type: Concept
ISO 639-3 code: kod
in scheme: Lexvo - ISO 639-3 language codes
notation: kod

Kacipo-Balesi
type: Language
type: Concept
ISO 639-3 code: koe
alternative label: Kacipo-Balesi language
definition: The Kacipo-Balesi language (also Silmamo, Tsilmamo, Zelmamu, Zilmamu, Zulmamu) is an Eastern Sudanic language spoken by the Baale and Zilmamu people of Ethiopia and the Kacipo of South Sudan. It is a member of the Surmic cluster. There are three main dialects: Balesi (Baale), Kacipo, and Zilmamu.
in scheme: Lexvo - ISO 639-3 language codes
notation: koe

Kubi
type: Language
type: Concept
ISO 639-3 code: kof
alternative label: Kubi language
definition: Kubi (also known as Kuba, Kubawa) is an extinct Afro-Asiatic language formerly spoken in Bauchi State, Nigeria. Members of the ethnic group now speak Hausa.
in scheme: Lexvo - ISO 639-3 language codes
notation: kof

Kogi
type: Language
type: Concept
ISO 639-3 code: kog
alternative label: Cogui
alternative label: Kogi language
definition: Kogi (Cogui), or Kagaba (Cágaba), is a Chibchan language of Colombia. The Kogi people are almost entirely monolingual, and maintain the only unconquered Andean civilization.
in scheme: Lexvo - ISO 639-3 language codes
notation: kog

Koyo
type: Language
type: Concept
ISO 639-3 code: koh
in scheme: Lexvo - ISO 639-3 language codes
notation: koh

Komi-Permyak
type: Language
type: Concept
ISO 639-3 code: koi
alternative label: Komi-Permyak language
definition: Komi-Permyak language ( or ) is one of two regional varieties of the pluricentrical Komi language, the other variety being Komi-Zyrian.
in scheme: Lexvo - ISO 639-3 language codes
notation: koi
preferred label: Idioma komi permio @es
preferred label: Komi-permiak @fr
preferred label: Lingua permiaca @it
preferred label: Língua komi-permyak @pt

Sara Dunjo
type: Language
type: Concept
ISO 639-3 code: koj
in scheme: Lexvo - ISO 639-3 language codes
notation: koj

Idioma konkaní
type: Language
type: Concept
ISO 639-2 Bibliographical code: kok
ISO 639-2 Terminological code: kok
ISO 639-3 code: kok
alternative label: Konkani (macrolanguage)
alternative label: Konkani language
alternative label: konkani @fr
definition: Konkani (Devanāgarī:, ),is an Indo-Aryan language belonging to the Indo-European family of languages and is spoken on the western coast of India. It has approximately 3.6 million speakers. It is one of the official languages of India and is the official language of the Indian state of Goa. It is a minority language in Karnataka and northern Kerala (Kasaragod district).
in scheme: Lexvo - ISO 639-3 language codes
notation: kok
preferred label: Konkani
preferred label: Lingua konkani @it
preferred label: Língua concani @pt

Kol
type: Language
type: Concept
ISO 639-3 code: kol
alternative label: Kol (Papua New Guinea)
alternative label: Kol language
definition: The Kol language is a language spoken in eastern New Britain island, Papua New Guinea. There are about 4000 speakers.
in scheme: Lexvo - ISO 639-3 language codes
notation: kol

Komi
type: Language
type: Concept
ISO 639-1 code: kv
ISO 639-2 Bibliographical code: kom
ISO 639-2 Terminological code: kom
ISO 639-3 code: kom
alternative label: Idioma komi @es
alternative label: Komi language
alternative label: Komi-Sprache @de
alternative label: Lingua komi @it
alternative label: Língua komi @pt
preferred label: komi @es
definition: The Komi language (in Komi: коми кыв, transliteration: komi kyv [komi kɨv]) is a Finno-Permic language spoken by the Komi peoples in the northeastern European part of Russia. Komi is one of the two members of the Permic subgroup of the Finno-Ugric branch. The other Permic language is Udmurt, to which Komi is closely related.
in scheme: Lexvo - ISO 639-3 language codes
notation: kom
preferred label: kom @fr

Kongo
type: Language
type: Concept
ISO 639-1 code: kg
ISO 639-2 Bibliographical code: kon
ISO 639-2 Terminological code: kon
ISO 639-3 code: kon
preferred label: Kikongo @de
alternative label: Kongo language
alternative label: Kongolesisch @de
alternative label: Lingua kongo @it
alternative label: congolês @pt
definition: The Kongo language, or Kikongo, is the Bantu language spoken by the Bakongo and Bandundu people living in the tropical forests of the Democratic Republic of the Congo, the Republic of the Congo and Angola. It is a tonal language and formed the base for Kituba, a Bantu creole and lingua franca throughout much of west central Africa. It was spoken by many of those who were taken from the region and sold as slaves in the Americas. For this reason, while Kongo still is spoken in the above-mentioned countries, creolized forms of the language are found in ritual speech of African-derived religions in Brazil, Jamaica, Cuba, Dominican Republic, and especially in Haiti. It is also one of the sources of the Gullah people's language and the Palenquero creole in Colombia. The vast majority of present-day speakers live in Africa. There are roughly seven million native speakers of Kongo, with perhaps two million more who use it as a second language.
in scheme: Lexvo - ISO 639-3 language codes
notation: kon
preferred label: conguês @pt
preferred label: kongo @es

konjo
type: Language
type: Concept
ISO 639-3 code: koo
alternative label: Konzo
definition: The Konjo (pl. Bakonjo, sing. Mukonjo), or Konzo, are a people located in the Rwenzori Mountains of southwest Uganda. Numbering 361,709 in the 1992 census, they live on the plains, hills and mountain slopes up to an altitude 2,200 meters. Traditionally agriculturalists and animal husbanders, they farm yams, beans, sweet potatoes, peanuts, soy beans, potatoes, rice, wheat, cassava, coffee, bananas, and cotton, while keeping goats, sheep, and poultry. The Konjo practice traditional religions and Christianity. Konjo speakers also live on the western slopes of the Rwenzori range in the Democratic Republic of the Congo.
in scheme: Lexvo - ISO 639-3 language codes
notation: koo
preferred label: Bakonjo @de
preferred label: Konjo @fr

Waube
type: Language
type: Concept
ISO 639-3 code: kop
alternative label: Waube language
definition: Kwato or Waupe is a Rai Coast language spoken in Madang Province, Papua New Guinea.
in scheme: Lexvo - ISO 639-3 language codes
notation: kop

Assan
type: Language
type: Concept
ISO 639-3 code: xss
alternative label: Assan language
definition: Assan was a Yeniseian language which became extinct in the 19th century. It was closely related to the Kott language.
in scheme: Lexvo - ISO 639-3 language codes
notation: xss
preferred label: Assane @fr

Kota
type: Language
type: Concept
ISO 639-3 code: koq
alternative label: Kota (Gabon)
alternative label: Kota language
definition: iKota or Kota, not to be confused with the Indian-dravidic Kota language, is an African language spoken by the Bakota people. It is spoken in northeastern Gabon, Ogooué-Ivindo Province and in some areas of Republic of Congo. According to Ethnologue there are 34,442 Kota speakers in Gabon and 9,055 in the Republic of Congo.
in scheme: Lexvo - ISO 639-3 language codes
notation: koq

Korean
type: Language
type: Concept
ISO 639-1 code: ko
ISO 639-2 Bibliographical code: kor
ISO 639-2 Terminological code: kor
ISO 639-3 code: kor
alternative label: Idioma coreano @es
alternative label: Korean language
alternative label: Koreanische Sprache @de
alternative label: Lingua coreana @it
alternative label: Língua coreana @pt
alternative label: coréen @fr
definition: Korean (, see below) is the official language of South Korea and North Korea. It is also one of the two official languages in the Yanbian Korean Autonomous Prefecture in Peoples Republic of China. There are about 78 million Korean speakers worldwide. For over a millenium, Korean was written with adapted Chinese characters called hanja, complemented by phonetic systems like hyangchal, gugyeol, and idu. In the 15th century, a national writing system called hangul was commissioned by Sejong the Great, but it only came into widespread use in the 20th century, because of the yangban aristocracys preference for hanja.
in scheme: Lexvo - ISO 639-3 language codes
notation: kor
preferred label: Coréen @fr
preferred label: Koreanisch @de
preferred label: coreano @es

Kosraean
type: Language
type: Concept
ISO 639-2 Bibliographical code: kos
ISO 639-2 Terminological code: kos
ISO 639-3 code: kos
alternative label: Kosrae @fr
alternative label: Kosraean language
alternative label: Kosraeanische Sprache @de
alternative label: kusaien @fr
definition: Kosraean, also sometimes called Kusaiean, is the language spoken on the islands of Kosrae (Kusaie), Caroline Islands, and Nauru. In 2001 there were approximately 8,000 speakers.
in scheme: Lexvo - ISO 639-3 language codes
notation: kos
preferred label: Kosraeanisch @de
preferred label: kosrae @fr
preferred label: kosraean @it
preferred label: kosraeano @es

Lagwan
type: Language
type: Concept
ISO 639-3 code: kot
alternative label: Lagwan language
definition: Lagwan is an Afro-Asiatic language spoken in northern Cameroon and southwestern Chad. Dialects include Logone-Birni and Logone-Gana.
in scheme: Lexvo - ISO 639-3 language codes
notation: kot

Koke
type: Language
type: Concept
ISO 639-3 code: kou
in scheme: Lexvo - ISO 639-3 language codes
notation: kou

Kudu-Camo
type: Language
type: Concept
ISO 639-3 code: kov
in scheme: Lexvo - ISO 639-3 language codes
notation: kov

Kugama
type: Language
type: Concept
ISO 639-3 code: kow
in scheme: Lexvo - ISO 639-3 language codes
notation: kow

Coxima
type: Language
type: Concept
ISO 639-3 code: kox
alternative label: Coxima language
definition: Coxima (Koxima) is an extinct unclassified language of Colombia.
in scheme: Lexvo - ISO 639-3 language codes
notation: kox

Koyukon
type: Language
type: Concept
ISO 639-3 code: koy
alternative label: Koyukon language
in scheme: Lexvo - ISO 639-3 language codes
notation: koy
preferred label: Língua koyukon @pt

Korak
type: Language
type: Concept
ISO 639-3 code: koz
in scheme: Lexvo - ISO 639-3 language codes
notation: koz

Kutto
type: Language
type: Concept
ISO 639-3 code: kpa
alternative label: Kutto language
definition: Kúttò (Kupto) is a minor West Chadic language of Nigeria.
in scheme: Lexvo - ISO 639-3 language codes
notation: kpa

Mullu Kurumba
type: Language
type: Concept
ISO 639-3 code: kpb
alternative label: Kurumba, Mullu
in scheme: Lexvo - ISO 639-3 language codes
notation: kpb

Sanumá
type: Language
type: Concept
ISO 639-3 code: xsu
alternative label: Sanumá language
in scheme: Lexvo - ISO 639-3 language codes
notation: xsu
preferred label: Idioma sanemá @es

Curripaco
type: Language
type: Concept
ISO 639-3 code: kpc
alternative label: Curripaco language
definition: Curripako (Curripaco, Kurripako, Ipeka-Tapuia-Curripako) is an Arawakan language principally of Colombia and Venezuela. There are also a thousand speakers in Brazil.
in scheme: Lexvo - ISO 639-3 language codes
notation: kpc

Koba
type: Language
type: Concept
ISO 639-3 code: kpd
in scheme: Lexvo - ISO 639-3 language codes
notation: kpd

Kpelle
type: Language
type: Concept
ISO 639-2 Bibliographical code: kpe
ISO 639-2 Terminological code: kpe
ISO 639-3 code: kpe
alternative label: Kpelle language
alternative label: Kpelle-Sprache @de
alternative label: Kpèllé @fr
alternative label: Língua kpelle @pt
definition: The Kpelle language is spoken by the Kpelle people and is part of the Mande family of languages. Guinean Kpelle (known as Guerze in French), spoken by half a million people, concentrated primarily, but not exclusively, in the forest regions of Guinea, whose capital, Nzérékoré, is the third largest city in Guinea and the largest city in the Guinée Forestière region of south-eastern Guinea bordering Liberia, Ivory Coast, and Sierra Leone. Liberian Kpelle, spoken by half again as many, is currently taught in schools in Liberia.
in scheme: Lexvo - ISO 639-3 language codes
notation: kpe
preferred label: kpelle @es
preferred label: kpellé @fr

Komba
type: Language
type: Concept
ISO 639-3 code: kpf
alternative label: Komba language
definition: Komba is a Papuan language spoken in Morobe Province, Papua New Guinea.
in scheme: Lexvo - ISO 639-3 language codes
notation: kpf

Kapingamarangi
type: Language
type: Concept
ISO 639-3 code: kpg
alternative label: Kapingamarangi language
definition: Kapingamarangi is a Polynesian language spoken in the Federated States of Micronesia. It has about 3000 native speakers. The language is closely related to the Nukuoro language.
in scheme: Lexvo - ISO 639-3 language codes
notation: kpg
preferred label: Kapingamarangische Sprache @de
preferred label: Lingua Kapingamarangi @it

Kplang
type: Language
type: Concept
ISO 639-3 code: kph
in scheme: Lexvo - ISO 639-3 language codes
notation: kph

Kofei
type: Language
type: Concept
ISO 639-3 code: kpi
in scheme: Lexvo - ISO 639-3 language codes
notation: kpi

Karajá
type: Language
type: Concept
ISO 639-3 code: kpj
alternative label: Karajá language
definition: The Karajá language, also known as Ynã, is spoken by around 3600 Karajá people in some 30 villages in central Brazil. Dialects are North Karaja, South Karaja, Xambioá, and Javaé. There is male and female speech; one of the principal differences is that men drop the sound /k/, which is pronounced by women.
in scheme: Lexvo - ISO 639-3 language codes
notation: kpj
preferred label: Carajás @pt

Kpan
type: Language
type: Concept
ISO 639-3 code: kpk
in scheme: Lexvo - ISO 639-3 language codes
notation: kpk

Kpala
type: Language
type: Concept
ISO 639-3 code: kpl
in scheme: Lexvo - ISO 639-3 language codes
notation: kpl

Koho
type: Language
type: Concept
ISO 639-3 code: kpm
alternative label: Koho language
definition: Sre or Koho is a Bahnaric language spoken in the region around the city of Di Linh in Vietnam, by the Degar (or Montagnard) people. Sre is the name of one of its dialect, whereas Koho is more inclusive.
in scheme: Lexvo - ISO 639-3 language codes
notation: kpm

Sudovian
type: Language
type: Concept
ISO 639-3 code: xsv
alternative label: Sudovian language
definition: Sudovian (also known as Jatvingian or Yotvingian) is an extinct western Baltic language of Northeastern Europe. Closely related to the Old Prussian language, it was formerly spoken southwest of the Nemunas river in what is now Lithuania, east of Galindia and north of Yotvingia, and by exiles in East Prussia.
in scheme: Lexvo - ISO 639-3 language codes
notation: xsv
preferred label: Jatwingische Sprache @de
preferred label: Lingua jatvingica @it
preferred label: Sudovien @fr
preferred label: Sudóvio @pt

Kepkiriwát
type: Language
type: Concept
ISO 639-3 code: kpn
in scheme: Lexvo - ISO 639-3 language codes
notation: kpn

Ikposo
type: Language
type: Concept
ISO 639-3 code: kpo
alternative label: Kposo language
definition: Kposo language, or Ikposo , is the language of the Akposso people, spoken mainly in the Plateau Region of Togo, but also into eastern Ghana. It is considered one of the Ghana–Togo Mountain languages.
in scheme: Lexvo - ISO 639-3 language codes
notation: kpo
preferred label: Akposo @de

Korupun-Sela
type: Language
type: Concept
ISO 639-3 code: kpq
alternative label: Korupun language
definition: Korupun is a Papuan language of West Papua. Dialects are Korupun (Duram), Dagi, Sisibna (Gobugdua), Deibula, Sela. It is also known as Kimyal of Korupun; Kimyal is another name for Nalca.
in scheme: Lexvo - ISO 639-3 language codes
notation: kpq

Korafe-Yegha
type: Language
type: Concept
ISO 639-3 code: kpr
in scheme: Lexvo - ISO 639-3 language codes
notation: kpr

Tehit
type: Language
type: Concept
ISO 639-3 code: kps
alternative label: Tehit language
definition: Tehit is a Papuan language of the Bird's Head Peninsula of New Guinea. Other spellings are Tahit, Tehid, and other names Kaibus, Teminabuan. Dialects are Tehit Jit, Mbol Fle, Saifi, Imyan, Sfa Riere, Fkar, Sawiat Salmeit.
in scheme: Lexvo - ISO 639-3 language codes
notation: kps

Karata
type: Language
type: Concept
ISO 639-3 code: kpt
alternative label: Karata language
definition: Karata is an Andic language of the Northeast Caucasian language family spoken in southern Dagestan, Russia by approximately 5,000 people in 1990 according to the survey of A. Kibrik and by 6,400 people in 2006 according to the survey of Koryakov. Speakers use Avar as their literary language.
in scheme: Lexvo - ISO 639-3 language codes
notation: kpt
preferred label: Lingua karata @it

Kafoa
type: Language
type: Concept
ISO 639-3 code: kpu
in scheme: Lexvo - ISO 639-3 language codes
notation: kpu

Komi-Zyrian
type: Language
type: Concept
ISO 639-3 code: kpv
alternative label: Komi-Yodzyak language
definition: Yodz, Komi-Yodzyak (; Komi-Yodz), or Komi-Yazva is spoken mostly in Krasnovishersky District of Perm Krai in Russia, in the basin of the Yazva River. It is a Permic language closely related to Komi-Zyrian and Permyak. It has no official status.
in scheme: Lexvo - ISO 639-3 language codes
notation: kpv

Kobon
type: Language
type: Concept
ISO 639-3 code: kpw
alternative label: Kobon language
definition: Kobon (pronounced Kombon) is a language of Papua New Guinea. It has somewhere around 90-120 verbs.
in scheme: Lexvo - ISO 639-3 language codes
notation: kpw

Mountain Koiali
type: Language
type: Concept
ISO 639-3 code: kpx
alternative label: Koiali, Mountain
alternative label: Mountain Koiali language
definition: Mountain Koiari (Koiali) is a language of Papua New Guinea. Half of speakers are monolingual.
in scheme: Lexvo - ISO 639-3 language codes
notation: kpx

Koryak
type: Language
type: Concept
ISO 639-3 code: kpy
alternative label: Koryak language
definition: Koryak is a Chukotko-Kamchatkan language spoken by circa 3,000 people (Koryak) in the easternmost extremity of Siberia, mainly in Koryak Okrug. It is mostly a language spoken by Koryaks. Its close relative, the Chukchi language, is spoken by about twice that number. The language together with Chukchi, Kerek, Alutor and Itelmen forms the Chukotko-Kamchatkan language family. Its name in Koryak is нымылан, Nymylan, but the name imposed by the Russians is the most common.
in scheme: Lexvo - ISO 639-3 language codes
notation: kpy
preferred label: Idioma coriaco @es
preferred label: Koriak @fr
preferred label: Korjakische Sprache @de
preferred label: Lingua koryak @it
preferred label: Língua koriaque @pt

Kupsabiny
type: Language
type: Concept
ISO 639-3 code: kpz
alternative label: Sabiny language
definition: Kupsabiny (Sabiny), or Sebei, is a Kalenjin language of Uganda.
in scheme: Lexvo - ISO 639-3 language codes
notation: kpz

Mum
type: Language
type: Concept
ISO 639-3 code: kqa
alternative label: Mum language
definition: Mum is a Papuan language of Madang Province, Papua New Guinea.
in scheme: Lexvo - ISO 639-3 language codes
notation: kqa

Kovai
type: Language
type: Concept
ISO 639-3 code: kqb
alternative label: Kovai language
definition: Kovai (Kobai, Kowai) is a Papuan language spoken on Umboi Island, halfway between mainland Papua New Guinea and the island of New Britain, and mostly within the caldera of that volcanic island.
in scheme: Lexvo - ISO 639-3 language codes
notation: kqb

Texmelucan Zapotec
type: Language
type: Concept
ISO 639-3 code: zpz
alternative label: Zapotec, Texmelucan
in scheme: Lexvo - ISO 639-3 language codes
notation: zpz

Doromu-Koki
type: Language
type: Concept
ISO 639-3 code: kqc
in scheme: Lexvo - ISO 639-3 language codes
notation: kqc

Saisiyat
type: Language
type: Concept
ISO 639-3 code: xsy
alternative label: Saisiyat language
definition: Saisiyat is the language of the Saisiyat, a tribe of indigenous people on Taiwan (see Taiwanese aborigines). It is a Formosan language of the Austronesian family. It has approximately 4,750 speakers.
in scheme: Lexvo - ISO 639-3 language codes
notation: xsy
preferred label: Lingua Saisiyat @it

Koy Sanjaq Surat
type: Language
type: Concept
ISO 639-3 code: kqd
alternative label: Koy Sanjaq Syriac language
definition: Koy Sanjaq Surat is a modern Eastern Syriac-Aramaic language. Speakers of the language call it simply Surat, or Syriac. It is spoken in the town of Koy Sanjaq and its nearby village of Armota in the province of Arbil as well as in Ankawa. The speakers of Koy Sanjaq Surat are traditionally Assyrian Chaldean Catholics.
in scheme: Lexvo - ISO 639-3 language codes
notation: kqd

Kalagan
type: Language
type: Concept
ISO 639-3 code: kqe
in scheme: Lexvo - ISO 639-3 language codes
notation: kqe

Kakabai
type: Language
type: Concept
ISO 639-3 code: kqf
in scheme: Lexvo - ISO 639-3 language codes
notation: kqf

Khe
type: Language
type: Concept
ISO 639-3 code: kqg
in scheme: Lexvo - ISO 639-3 language codes
notation: kqg

Kisankasa
type: Language
type: Concept
ISO 639-3 code: kqh
in scheme: Lexvo - ISO 639-3 language codes
notation: kqh

Koitabu
type: Language
type: Concept
ISO 639-3 code: kqi
in scheme: Lexvo - ISO 639-3 language codes
notation: kqi

Koromira
type: Language
type: Concept
ISO 639-3 code: kqj
alternative label: Koromira language
definition: Koromira is an East Papuan language spoken in the mountains of southern Bougainville Province, Papua New Guinea.
in scheme: Lexvo - ISO 639-3 language codes
notation: kqj

Kotafon Gbe
type: Language
type: Concept
ISO 639-3 code: kqk
alternative label: Gbe, Kotafon
in scheme: Lexvo - ISO 639-3 language codes
notation: kqk

Kyenele
type: Language
type: Concept
ISO 639-3 code: kql
alternative label: Kyenele language
definition: Kyenele Miyak is a Yuat language of Papua New Guinea.
in scheme: Lexvo - ISO 639-3 language codes
notation: kql

Khisa
type: Language
type: Concept
ISO 639-3 code: kqm
in scheme: Lexvo - ISO 639-3 language codes
notation: kqm

Chikaonde
type: Language
type: Concept
ISO 639-3 code: kqn
alternative label: Kaonde language
definition: Kaonde, also known as Chikaonde and Kawonde, is a Bantu language (of the larger Niger–Congo family) that is spoken primarily in Zambia but also in the Democratic Republic of the Congo. Kaonde and its dialects are spoken and understood by perhaps 350,000 people or more. It is estimated that approximately 3% of Zambians are native Kaonde speakers. Kaonde speakers overwhelmingly live in the northwestern part of Zambia.
in scheme: Lexvo - ISO 639-3 language codes
notation: kqn
preferred label: Kaonde

Eastern Krahn
type: Language
type: Concept
ISO 639-3 code: kqo
alternative label: Konobo language
alternative label: Krahn, Eastern
definition: Konobo, or Eastern Krahn, is a Kru language of Liberia.
in scheme: Lexvo - ISO 639-3 language codes
notation: kqo

Kimré
type: Language
type: Concept
ISO 639-3 code: kqp
alternative label: Kimré language
definition: Kimré is an East Chadic language spoken in the Tandjilé Region of Chad. Like most related languages, it is popularly called "Gabri".
in scheme: Lexvo - ISO 639-3 language codes
notation: kqp

Alcozauca Mixtec
type: Language
type: Concept
ISO 639-3 code: xta
alternative label: Mixtec, Alcozauca
in scheme: Lexvo - ISO 639-3 language codes
notation: xta

Krenak
type: Language
type: Concept
ISO 639-3 code: kqq
alternative label: Krenak language
definition: The Krenak language, or Botocudo, is the moribund sole surviving language of a small family believed to be part of the Macro-Gê languages. It was once spoken by the Botocudo people in Mato Grosso, but is known primarily by older women today.
in scheme: Lexvo - ISO 639-3 language codes
notation: kqq

Kimaragang
type: Language
type: Concept
ISO 639-3 code: kqr
in scheme: Lexvo - ISO 639-3 language codes
notation: kqr

Northern Kissi
type: Language
type: Concept
ISO 639-3 code: kqs
alternative label: Kissi, Northern
in scheme: Lexvo - ISO 639-3 language codes
notation: kqs

Klias River Kadazan
type: Language
type: Concept
ISO 639-3 code: kqt
alternative label: Kadazan, Klias River
in scheme: Lexvo - ISO 639-3 language codes
notation: kqt

Seroa
type: Language
type: Concept
ISO 639-3 code: kqu
alternative label: Seroa dialect
definition: Seroa was a dialect of the extinct ǀXam language of the ǃKwi family, spoken in South Africa and Lesotho. The name "Seroa" is an exonym from Sesotho meaning "language of the San" derived from the general Sesotho name "Baroa" (or "Barwa" in South African Sesotho spelling) meaning simply "San people". Local or dialectical names were and .
in scheme: Lexvo - ISO 639-3 language codes
notation: kqu
preferred label: Lingua seroa @it
preferred label: Língua seroa @pt

Okolod
type: Language
type: Concept
ISO 639-3 code: kqv
in scheme: Lexvo - ISO 639-3 language codes
notation: kqv

Kandas
type: Language
type: Concept
ISO 639-3 code: kqw
in scheme: Lexvo - ISO 639-3 language codes
notation: kqw

Mser
type: Language
type: Concept
ISO 639-3 code: kqx
alternative label: Mser language
definition: Mser is an Afro-Asiatic language spoken in northern Cameroon and southwestern Chad. Dialects are Gawi, Houlouf, Kabe, Kalo, Mser. Mser is in rapid decline.
in scheme: Lexvo - ISO 639-3 language codes
notation: kqx

Chazumba Mixtec
type: Language
type: Concept
ISO 639-3 code: xtb
alternative label: Mixtec, Chazumba
in scheme: Lexvo - ISO 639-3 language codes
notation: xtb

Koorete
type: Language
type: Concept
ISO 639-3 code: kqy
alternative label: Koorete language
definition: Koorete (also Amaarro, Amarro, Badittu, Koore, Koyra, Kwera, Nuna) is the language spoken by the Koore people of southern Ethiopia.
in scheme: Lexvo - ISO 639-3 language codes
notation: kqy

Korana
type: Language
type: Concept
ISO 639-3 code: kqz
alternative label: Korana language
definition: Korana, or ǃOra, is a moribund Khoe language of South Africa. An ethnic Korana population (also called Griqua) of 10,000 live in South Africa, and perhaps Botswana, with perhaps half a dozen elderly speakers as of 2008.
in scheme: Lexvo - ISO 639-3 language codes
notation: kqz
preferred label: Idioma korana @es
preferred label: Língua korana @pt

Kumhali
type: Language
type: Concept
ISO 639-3 code: kra
in scheme: Lexvo - ISO 639-3 language codes
notation: kra

Karkin
type: Language
type: Concept
ISO 639-3 code: krb
alternative label: Karkin language
definition: Karkin (also called Los Carquines in Spanish) is a name of one sub-group of the indigenous Ohlone people of California, as well as the name of the language they spoke.
in scheme: Lexvo - ISO 639-3 language codes
notation: krb

Karachay-Balkar
type: Language
type: Concept
ISO 639-2 Bibliographical code: krc
ISO 639-2 Terminological code: krc
ISO 639-3 code: krc
alternative label: Idioma karachayo-bálkaro @es
alternative label: Karachay-Balkar language
alternative label: Karatschai-Balkarische Sprache @de
alternative label: Lingua caraciai-balcara @it
alternative label: Língua carachaio-bálcara @pt
alternative label: karatchai balkar @fr
alternative label: karatchaï balkar @fr
definition: The Karachay-Balkar language (Къарачай-Малкъар тил, Qaraçay-Malqar til or Таулу тил, Tawlu til) is a Turkic language spoken by the Karachays and Balkars. It is divided into two dialects: Karachay-Baksan-Chegem which pronounces two phonemes as and , and Balkar, which pronounces the corresponding phonemes as and . The modern Karachay-Balkar written language is based on Karachay-Baksan-Chegem dialect.
in scheme: Lexvo - ISO 639-3 language codes
notation: krc
preferred label: Karatchaï-balkar @fr
preferred label: Karatschaiisch-Balkarisch @de
preferred label: karachay-Balkar @it
preferred label: karachay-balkar @es

Kairui-Midiki
type: Language
type: Concept
ISO 639-3 code: krd
in scheme: Lexvo - ISO 639-3 language codes
notation: krd

Panará
type: Language
type: Concept
ISO 639-3 code: kre
alternative label: Panara language
definition: Panará, also known as Kreen Akarore, is a Ge language of Brazil.
in scheme: Lexvo - ISO 639-3 language codes
notation: kre

Koro
type: Language
type: Concept
ISO 639-3 code: krf
alternative label: Koro (Vanuatu)
alternative label: Koro language
definition: Koro is an Oceanic language spoken on Gaua island in Vanuatu. Its 280 speakers live in the village of Koro, on the south coast of Gaua.
in scheme: Lexvo - ISO 639-3 language codes
notation: krf

Kadugli language
type: Language
type: Concept
ISO 639-3 code: xtc
alternative label: Katcha-Kadugli-Miri
definition: Kadugli, also Katcha-Kadugli-Miri or Central Kadu, is a Kadu language or dialect cluster spoken in Kordofan. Stevenson treats them as dialects of one language, and they share a single ISO code, though Schadeberg (1989) treats them as separate languages.
in scheme: Lexvo - ISO 639-3 language codes
notation: xtc

Kurama
type: Language
type: Concept
ISO 639-3 code: krh
alternative label: Kurama language
definition: The Kurama or Kurumi language, Tukurami, is a Kainji language of Nigeria with 40,000 speakers. Kurama speakers are found in the central northern Nigerian states of Kaduna and Kano.
in scheme: Lexvo - ISO 639-3 language codes
notation: krh

Krio
type: Language
type: Concept
ISO 639-3 code: kri
alternative label: Aku dialect
definition: Aku is a variety of Sierra Leone Krio, an English-based Creole language of Western Africa. Aku is spoken primarily in Gambia, mainly by the Aku people, who are descendants of the Sierra Leone Creole people. In many ways the Akus are an extension of the Sierra Leone Creole community.
in scheme: Lexvo - ISO 639-3 language codes
notation: kri
preferred label: Aku @fr

Kinaray-A
type: Language
type: Concept
ISO 639-3 code: krj
alternative label: Kinaray-a language
definition: Kinaray-a is an Austronesian language spoken mainly in Antique Province in the Philippines. It is also spoken in Iloilo province, the south of Capiz Province, and certain villages in Mindanao that trace their roots to Antique Province or Kinaray-a speaking areas of Iloilo and Capiz Provinces. Kinaray-a came from the word "iraya" equivalent to "ilaya" in Tagalog, which refers to a group of people residing in the mountain areas of the province. While groups of people residing near the river delta are referred to as "ilawod" from the Hiligaynon word "lawod", which refers to a large body of water (sea, ocean, lake, or strait). However, Kinaray-a does not necessarily refer to the way or language spoken by the highlanders of Panay Island. Speakers of this language are called, "Karay-a."
in scheme: Lexvo - ISO 639-3 language codes
notation: krj
preferred label: Kinaray-a @fr

Kerek
type: Language
type: Concept
ISO 639-3 code: krk
alternative label: Kerek language
definition: Kerek was a language of Russia that belongs to the northern branch of the Chukotko-Kamchatkan languages. On historical linguistic grounds it is most closely related to Koryak (both languages have a merger of the proto-Chuktotian phonemes /*ð/ and /*r/ with /*j/). The next closest relative is Chukchi (/*ð/ and /*r/ are merged, but not /*j/).
in scheme: Lexvo - ISO 639-3 language codes
notation: krk
preferred label: Língua kereque @pt

Karelian
type: Language
type: Concept
ISO 639-2 Bibliographical code: krl
ISO 639-2 Terminological code: krl
ISO 639-3 code: krl
alternative label: Idioma carelio @es
alternative label: Karelian language
alternative label: Karelische Sprache @de
alternative label: Lingua careliana @it
alternative label: carélien @fr
alternative label: idioma carélio @pt
definition: Karelian language (karjala, karjal or kariela) is a Finnic language spoken mainly in the Russian Republic of Karelia. Linguistically Karelian is closely related to the Finnish dialects spoken in eastern Finland and some Finnish linguists even classified Karelian as a dialect of Finnish. Karelian is not to be confused with the Southeastern dialects of Finnish, sometimes referred to as karjalaismurteet (Karelian dialects) in Finland. Finnish and Karelian have common ancestry in the Proto-Karelian language spoken in the coast of Lake Ladoga in the Iron Age and Karelian forms a dialect continuum with the Eastern dialects of Finnish. Earlier some Finnish linguists classified Karelian as a dialect of Finnish, sometimes known in older Finnish literature as Raja-Karjalan murteet (Border Karelian dialects), but today, however, Karelian is seen as a proper language. Besides Karelian and Finnish, the Finnic subgroup also includes Estonian and other minority languages spoken around the Baltic Sea.
in scheme: Lexvo - ISO 639-3 language codes
notation: krl
preferred label: Carélien @fr
preferred label: Karelisch @de
preferred label: Língua carélia @pt
preferred label: careliano @it
preferred label: carelio @es

Krim
type: Language
type: Concept
ISO 639-3 code: krm
alternative label: Krim language
definition: The Krim language (also known as Kim, Kimi, Kirim, or Kiltim) is an endangered language of Sierra Leone. It belongs to the Mel branch of the Niger–Congo language family.
in scheme: Lexvo - ISO 639-3 language codes
notation: krm
preferred label: Kirim @de

Sapo
type: Language
type: Concept
ISO 639-3 code: krn
alternative label: Sapo language
definition: The Sapo language, also known as Sarpo or Southern Krahn, is a Kru language of the Niger–Congo language family. It is spoken in eastern Liberia, primarily in Grand Gedeh County and Sinoe County, by the Sapo people. Its dialects include: Juarzon, Kabade (Karbardae), Nomopo (Nimpo), Putu, Sinkon (Senkon), and Waya (Wedjah).
in scheme: Lexvo - ISO 639-3 language codes
notation: krn

Korop
type: Language
type: Concept
ISO 639-3 code: krp
alternative label: Dorop language
definition: The Dorop language, Korop Ododop or Erorop, is a Upper Cross River language of Nigeria.
in scheme: Lexvo - ISO 639-3 language codes
notation: krp

Kru'ng 2
type: Language
type: Concept
ISO 639-3 code: krr
in scheme: Lexvo - ISO 639-3 language codes
notation: krr

Gbaya
type: Language
type: Concept
ISO 639-3 code: krs
alternative label: Gbaya (Sudan)
alternative label: Kresh language
definition: Kresh, also known as Kresh-Ndogo and Gbaya-Ndogo, is a Central Sudanic language of South Sudan and the prestige variety of the Kresh languages.
in scheme: Lexvo - ISO 639-3 language codes
notation: krs

Tumari Kanuri
type: Language
type: Concept
ISO 639-3 code: krt
alternative label: Kanuri, Tumari
in scheme: Lexvo - ISO 639-3 language codes
notation: krt

Diuxi-Tilantongo Mixtec
type: Language
type: Concept
ISO 639-3 code: xtd
alternative label: Mixtec, Diuxi-Tilantongo
in scheme: Lexvo - ISO 639-3 language codes
notation: xtd

Kurukh
type: Language
type: Concept
ISO 639-2 Bibliographical code: kru
ISO 639-2 Terminological code: kru
ISO 639-3 code: kru
alternative label: Kurukh language
definition: Kurukh (Devanagari: कुड़ुख़), also called Kurux, Kuṛux or Kuruḵẖ, is a Dravidian language spoken by the Oraon and Kisan tribal peoples of Bihar, Jharkhand, Orissa, Madhya Pradesh, Chhattisgarh, and West Bengal, India, as well as in northern Bangladesh. It is most closely related to Brahui and Malto (Paharia). It is also known as Oraon.
in scheme: Lexvo - ISO 639-3 language codes
notation: kru
preferred label: Oraon-Sprache @de
preferred label: kurukh @es

Kavet
type: Language
type: Concept
ISO 639-3 code: krv
in scheme: Lexvo - ISO 639-3 language codes
notation: krv

Western Krahn
type: Language
type: Concept
ISO 639-3 code: krw
alternative label: Krahn, Western
in scheme: Lexvo - ISO 639-3 language codes
notation: krw

Karon
type: Language
type: Concept
ISO 639-3 code: krx
alternative label: Karon language
definition: The Karon language is an endangered language of Senegal and Gambia. It belongs to the Bak branch of the Niger–Congo language family, and is particularly closely related to the Mlomp language.
in scheme: Lexvo - ISO 639-3 language codes
notation: krx
preferred label: Karone @fr

Kryts
type: Language
type: Concept
ISO 639-3 code: kry
alternative label: Kryts language
definition: Kryts (Kryc), or Jek (Cek, Dzek), is a Samur language of the Northeast Caucasian language family spoken in parts of the Quba Rayon of Azerbaijan by 6,000 people in 1975.
in scheme: Lexvo - ISO 639-3 language codes
notation: kry
preferred label: Krysische Sprache @de
preferred label: Kryz @fr
preferred label: Lingua kryts @it

Sota Kanum
type: Language
type: Concept
ISO 639-3 code: krz
alternative label: Kanum, Sota
in scheme: Lexvo - ISO 639-3 language codes
notation: krz

Shuwa-Zamani
type: Language
type: Concept
ISO 639-3 code: ksa
in scheme: Lexvo - ISO 639-3 language codes
notation: ksa

Shambala
type: Language
type: Concept
ISO 639-3 code: ksb
alternative label: Shambala language
definition: Shambala or Shambaa is a Bantu language of Tanzania.
in scheme: Lexvo - ISO 639-3 language codes
notation: ksb
preferred label: chambala @fr
preferred label: shambala @es

Ketengban
type: Language
type: Concept
ISO 639-3 code: xte
alternative label: Ketengban language
definition: Ketengban, also known as Kupel, is a Papuan language of West Papua, near the Papua New Guinea border. Dialects are Okbap, Omban, Bime, Onya.
in scheme: Lexvo - ISO 639-3 language codes
notation: xte

Southern Kalinga
type: Language
type: Concept
ISO 639-3 code: ksc
alternative label: Kalinga, Southern
in scheme: Lexvo - ISO 639-3 language codes
notation: ksc

Kuanua
type: Language
type: Concept
ISO 639-3 code: ksd
alternative label: Tolai language
definition: The Tolai language, or Kuanua, is spoken by the Tolai people of Papua New Guinea, who live on the Gazelle Peninsula in East New Britain Province. (This language is often referred to in the literature as Tolai. However, Tolai is actually the name of the cultural group. The Tolais themselves refer to their language as A Tinata Tuna, which translates as The Real Language. Kuanua is apparently a word in the Duke of York language, meaning The place over there.)
in scheme: Lexvo - ISO 639-3 language codes
notation: ksd

Kuni
type: Language
type: Concept
ISO 639-3 code: kse
in scheme: Lexvo - ISO 639-3 language codes
notation: kse

Bafia
type: Language
type: Concept
ISO 639-3 code: ksf
alternative label: Kpa' language
definition: Kpa’, or Bafia, is a Bantu language of Cameroon.
in scheme: Lexvo - ISO 639-3 language codes
notation: ksf
preferred label: bafia @es

Kusaghe
type: Language
type: Concept
ISO 639-3 code: ksg
alternative label: Kusaghe language
definition: Kusaghe is an Oceanic language spoken by about 2,400 people on New Georgia Island, Solomon Islands.
in scheme: Lexvo - ISO 639-3 language codes
notation: ksg

Kölsch
type: Language
type: Concept
ISO 639-3 code: ksh
alternative label: Colognian
alternative label: Francique ripuaire @fr
alternative label: Fráncico ripuario @es
alternative label: Ripuarian language
alternative label: coloniese @it
definition: Ripuarian (also Ripuarian Franconian or Ripuarisch Platt; natively Ripoarėsch) is a German dialect group, part of the West Central German language group. Together with the Moselle Franconian and Luxembourgish language, Ripuarian belongs to the larger Central Franconian dialect family and also to the Rhinelandic linguistic continuum with the Low Franconian languages.
in scheme: Lexvo - ISO 639-3 language codes
notation: ksh
preferred label: Ripuario @it
preferred label: Ripuarische Dialekte @de
preferred label: francique ripuaire @fr
preferred label: kölsch @es

Krisa
type: Language
type: Concept
ISO 639-3 code: ksi
alternative label: I'saka
alternative label: I'saka language
definition: I’saka is the language spoken by the people of the villages of Krisa and Pasi in Sandaun Province, Papua New Guinea. It has also been referred to as Krisa, after the village, although this name is not actually a possible word in the language itself. The sole published source for the language is Donohue and San Roque (2004) (see references), although the authors of this have also Identified I’saka material in Donald Laycock's unpublished fieldnotes.
in scheme: Lexvo - ISO 639-3 language codes
notation: ksi

Uare
type: Language
type: Concept
ISO 639-3 code: ksj
alternative label: Uare language
definition: Uare (Kwale) is a language of Papua New Guinea. Dialects are Garihe (Garia) and Uare proper (Kwale, Kware).
in scheme: Lexvo - ISO 639-3 language codes
notation: ksj

Kansa
type: Language
type: Concept
ISO 639-3 code: ksk
alternative label: Kansa language
definition: Kansa is a Siouan language once spoken by the Kaw people of Oklahoma. The last mother-tongue speaker, Walter Kekahbah, died in 1983.
in scheme: Lexvo - ISO 639-3 language codes
notation: ksk
preferred label: Kanza @fr

Kumalu
type: Language
type: Concept
ISO 639-3 code: ksl
in scheme: Lexvo - ISO 639-3 language codes
notation: ksl

Kumba
type: Language
type: Concept
ISO 639-3 code: ksm
in scheme: Lexvo - ISO 639-3 language codes
notation: ksm

Transalpine Gaulish
type: Language
type: Concept
ISO 639-3 code: xtg
alternative label: Gaulish, Transalpine
in scheme: Lexvo - ISO 639-3 language codes
notation: xtg

Kasiguranin
type: Language
type: Concept
ISO 639-3 code: ksn
in scheme: Lexvo - ISO 639-3 language codes
notation: ksn

Kofa
type: Language
type: Concept
ISO 639-3 code: kso
alternative label: Kofa language
definition: Kofa (also known as Kota) is an Afro-Asiatic language spoken in Adamawa State, Nigeria. There is no current estimate of the number of its speakers.
in scheme: Lexvo - ISO 639-3 language codes
notation: kso

Kaba
type: Language
type: Concept
ISO 639-3 code: ksp
in scheme: Lexvo - ISO 639-3 language codes
notation: ksp

Kwaami
type: Language
type: Concept
ISO 639-3 code: ksq
alternative label: Kwaami language
definition: The Kwaami language, also known as Komawa, Kwam, Kwamanchi, Kwami, or Kwom, is a West Chadic language spoken in Bauchi State, Nigeria, near the city of Gombe.
in scheme: Lexvo - ISO 639-3 language codes
notation: ksq

Borong
type: Language
type: Concept
ISO 639-3 code: ksr
in scheme: Lexvo - ISO 639-3 language codes
notation: ksr

Southern Kisi
type: Language
type: Concept
ISO 639-3 code: kss
alternative label: Kisi, Southern
in scheme: Lexvo - ISO 639-3 language codes
notation: kss

Winyé
type: Language
type: Concept
ISO 639-3 code: kst
alternative label: Winye language
definition: Winyé, or Kolsi, is a Gur language of Burkina Faso. Speakers are largely monolingual.
in scheme: Lexvo - ISO 639-3 language codes
notation: kst

Khamyang
type: Language
type: Concept
ISO 639-3 code: ksu
in scheme: Lexvo - ISO 639-3 language codes
notation: ksu

Yitha Yitha
type: Language
type: Concept
in scheme: Lexvo - ISO 639-3 language codes

Kusu
type: Language
type: Concept
ISO 639-3 code: ksv
in scheme: Lexvo - ISO 639-3 language codes
notation: ksv

S'gaw Karen
type: Language
type: Concept
ISO 639-3 code: ksw
alternative label: Karen, S'gaw
alternative label: S'gaw Karen language
definition: Sgaw, also known as Sgaw Karen and Sgaw Kayin, is a Karen language spoken by over one million Sgaw Karen people in Burma, and 200,000 in Thailand. Sgaw Karen is spoken in Tanintharyi Regions Ayeyarwady Delta, Yangon Division, Bago Division and Kayin State. The two main dialects of S'gaw Karen are Panapu and Palakhi. It is written using the Burmese script. A Bible translation was published in 1853.
in scheme: Lexvo - ISO 639-3 language codes
notation: ksw

Kedang
type: Language
type: Concept
ISO 639-3 code: ksx
in scheme: Lexvo - ISO 639-3 language codes
notation: ksx

Kharia Thar
type: Language
type: Concept
ISO 639-3 code: ksy
alternative label: Kharia Thar language
definition: Kharia Thar is an Indic language spoken by the Hill Kharia culture of India.
in scheme: Lexvo - ISO 639-3 language codes
notation: ksy

Qiubei Zhuang
type: Language
type: Concept
ISO 639-3 code: zqe
alternative label: Zhuang, Qiubei
in scheme: Lexvo - ISO 639-3 language codes
notation: zqe

Kodaku
type: Language
type: Concept
ISO 639-3 code: ksz
in scheme: Lexvo - ISO 639-3 language codes
notation: ksz

Sinicahua Mixtec
type: Language
type: Concept
ISO 639-3 code: xti
alternative label: Mixtec, Sinicahua
in scheme: Lexvo - ISO 639-3 language codes
notation: xti

Katua
type: Language
type: Concept
ISO 639-3 code: kta
in scheme: Lexvo - ISO 639-3 language codes
notation: kta

Kambaata
type: Language
type: Concept
ISO 639-3 code: ktb
alternative label: Kambaata language
definition: Kambaata is a Highland East Cushitic language, part of the larger Afro-Asiatic family and spoken by the Kambaata. Dialects are Donga, Kambaata and Tambaro. It is one of the official languages of Ethiopia. The language has a large number of verbal affixes. When these are affixed to verbal roots, there are a large amount of morphophonemic changes. The language has SOV order (subject–object–verb). The phonemes of Kambaata include five vowels (which are distinctively long or short), a set of ejectives, a retroflexed implosive, and glottal stop.
in scheme: Lexvo - ISO 639-3 language codes
notation: ktb

Kholok
type: Language
type: Concept
ISO 639-3 code: ktc
alternative label: Kholok language
definition: Kholok (also known as Kode, Koode, Kwoode, Pia, Pitiko, Widala, Wurkum) is an Afro-Asiatic language spoken in Nigeria.
in scheme: Lexvo - ISO 639-3 language codes
notation: ktc

Kokata
type: Language
type: Concept
ISO 639-3 code: ktd
in scheme: Lexvo - ISO 639-3 language codes
notation: ktd

Nubri
type: Language
type: Concept
ISO 639-3 code: kte
in scheme: Lexvo - ISO 639-3 language codes
notation: kte

Kwami
type: Language
type: Concept
ISO 639-3 code: ktf
in scheme: Lexvo - ISO 639-3 language codes
notation: ktf

Kalkutung
type: Language
type: Concept
ISO 639-3 code: ktg
alternative label: Kalkatungu language
definition: Kalkatungu (also written Kalkutungu, Galgadungu, Kalkutung, Kalkadoon, Galgaduun) is an extinct Australian Aboriginal language formerly spoken around the area of Mount Isa, Queensland.
in scheme: Lexvo - ISO 639-3 language codes
notation: ktg

Karanga
type: Language
type: Concept
ISO 639-3 code: kth
alternative label: Karanga language
definition: Karanga is a Maban language language of Chad spoken by four peoples, each with their own dialect: the Karanga (Kurunga), Kashmere (Kachmere), Bakha (Baxa, Bakhat) Fala (Faala), and Koniéré (Konyare, Kognere) Moyo (Mooyo).
in scheme: Lexvo - ISO 639-3 language codes
notation: kth

San Juan Teita Mixtec
type: Language
type: Concept
ISO 639-3 code: xtj
alternative label: Mixtec, San Juan Teita
in scheme: Lexvo - ISO 639-3 language codes
notation: xtj

North Muyu
type: Language
type: Concept
ISO 639-3 code: kti
alternative label: Muyu, North
in scheme: Lexvo - ISO 639-3 language codes
notation: kti

Plapo Krumen
type: Language
type: Concept
ISO 639-3 code: ktj
alternative label: Krumen, Plapo
in scheme: Lexvo - ISO 639-3 language codes
notation: ktj

Kaniet
type: Language
type: Concept
ISO 639-3 code: ktk
alternative label: Kaniet language
definition: The Kaniet language was one of three Western Admiralty Islands languages, a subgroup of the Admiralty Islands languages, the other two being Wuvulu-Aua and Seimat. The language was spoken on the Kaniet Islands and the western Anchorite Islands in western Manus Province of Papua New Guinea until the 1950s.
in scheme: Lexvo - ISO 639-3 language codes
notation: ktk

Koroshi
type: Language
type: Concept
ISO 639-3 code: ktl
alternative label: Koroshi dialect
definition: The Koroshi dialect (Balochi: کوروشی), is a Northwestern Iranian language. The speakers of Koroshi live in scattered pockets in Southern Iranian Fars province. The number of speakers was roughly estimated to be 1000 in 2006.
in scheme: Lexvo - ISO 639-3 language codes
notation: ktl

Kurti
type: Language
type: Concept
ISO 639-3 code: ktm
in scheme: Lexvo - ISO 639-3 language codes
notation: ktm

Karitiâna
type: Language
type: Concept
ISO 639-3 code: ktn
alternative label: Karitiâna language
definition: Karitiâna or Caritiana is a Tupi language spoken in the state of Rondônia, in the Amazon region of Brazil. Their reservation, demarcated by the Fundação Nacional do Indio (FUNAI) in 1977, consists of roughly 90,000 hectares of jungle. The majority of the Karitiana people live in one village at the northern edge of this reservation, located 90 km (by road) south of the state capital, Porto Velho.
in scheme: Lexvo - ISO 639-3 language codes
notation: ktn
preferred label: Karitiana @fr

Kuot
type: Language
type: Concept
ISO 639-3 code: kto
alternative label: Kuot language
definition: The Kuot language, or Panaras, is a language isolate, the only non-Austronesian language spoken on the island of New Ireland, Papua New Guinea. There are about 2,400 speakers, concentrated primarily on the northwest coast of the island. Perhaps due to the small speaker base, there are no significant dialects present within Kuot.
in scheme: Lexvo - ISO 639-3 language codes
notation: kto

Kaduo
type: Language
type: Concept
ISO 639-3 code: ktp
in scheme: Lexvo - ISO 639-3 language codes
notation: ktp

Tijaltepec Mixtec
type: Language
type: Concept
ISO 639-3 code: xtl
alternative label: Mixtec, Tijaltepec
in scheme: Lexvo - ISO 639-3 language codes
notation: xtl

Katabaga
type: Language
type: Concept
ISO 639-3 code: ktq
in scheme: Lexvo - ISO 639-3 language codes
notation: ktq

Kota Marudu Tinagas
type: Language
type: Concept
ISO 639-3 code: ktr
in scheme: Lexvo - ISO 639-3 language codes
notation: ktr

South Muyu
type: Language
type: Concept
ISO 639-3 code: kts
alternative label: Muyu, South
in scheme: Lexvo - ISO 639-3 language codes
notation: kts

Ketum
type: Language
type: Concept
ISO 639-3 code: ktt
in scheme: Lexvo - ISO 639-3 language codes
notation: ktt

Kituba
type: Language
type: Concept
ISO 639-3 code: ktu
alternative label: Kituba (Democratic Republic of Congo)
in scheme: Lexvo - ISO 639-3 language codes
notation: ktu

Eastern Katu
type: Language
type: Concept
ISO 639-3 code: ktv
alternative label: Katu, Eastern
in scheme: Lexvo - ISO 639-3 language codes
notation: ktv

Kato
type: Language
type: Concept
ISO 639-3 code: ktw
alternative label: Cahto language
definition: Kato (also written Cahto) is an extinct Athabaskan language that was spoken by the Kato people of northwestern California, USA. It also referred to as Batem-Da-Kai-Ee, Kai Po-Mo, and Tlokeang.
in scheme: Lexvo - ISO 639-3 language codes
notation: ktw

Kaxararí
type: Language
type: Concept
ISO 639-3 code: ktx
alternative label: Kaxararí language
definition: Kaxararí is a Panoan language of Brazil.
in scheme: Lexvo - ISO 639-3 language codes
notation: ktx

Magdalena Peñasco Mixtec
type: Language
type: Concept
ISO 639-3 code: xtm
alternative label: Mixtec, Magdalena Peñasco
in scheme: Lexvo - ISO 639-3 language codes
notation: xtm

Kango
type: Language
type: Concept
ISO 639-3 code: kty
alternative label: Kango (Bas-Uélé District)
alternative label: Kango language
definition: Kango is a Bantu language spoken in the Bas-Uele District of the Democratic Republic of the Congo. It may be a cover term for various dialects spoken by fishermen in the area.
in scheme: Lexvo - ISO 639-3 language codes
notation: kty

Ju/'hoan
type: Language
type: Concept
ISO 639-3 code: ktz
alternative label: Juǀʼhoansi
in scheme: Lexvo - ISO 639-3 language codes
notation: ktz
preferred label: Lingua juǀ'hoan @it
preferred label: Língua Juǀʼhoan @pt

Kuanyama
type: Language
type: Concept
ISO 639-1 code: kj
ISO 639-2 Bibliographical code: kua
ISO 639-2 Terminological code: kua
ISO 639-3 code: kua
alternative label: Idioma kuanyama @es
alternative label: Kwanyama dialect
alternative label: Lingua kwanyama @it
alternative label: Oshikwanyama @pt
preferred label: kuanyama @es
definition: Kwanyama or Oshikwanyama is a national language of Angola and Namibia. It is a standardized dialect of the Ovambo language, and is mutually intelligible with Ndonga, the other Ovambo dialect with a standard written form.
in scheme: Lexvo - ISO 639-3 language codes
notation: kua
preferred label: Kwanyama

Kutep
type: Language
type: Concept
ISO 639-3 code: kub
alternative label: Kuteb language
definition: Kuteb (Kutep) is a Jukunoid language of Nigeria, with a thousand-or-so speakers across the border in Cameroon.
in scheme: Lexvo - ISO 639-3 language codes
notation: kub

Kwinsu
type: Language
type: Concept
ISO 639-3 code: kuc
in scheme: Lexvo - ISO 639-3 language codes
notation: kuc

'Auhelawa
type: Language
type: Concept
ISO 639-3 code: kud
alternative label: 'Auhelawa language
definition: ’Auhelawa is an Austronesian language spoken by about 1,200 people in Nuakata Island and the southeastern tip of Normanby Island in Milne Bay Province, Papua New Guinea.
in scheme: Lexvo - ISO 639-3 language codes
notation: kud

Kuman
type: Language
type: Concept
ISO 639-3 code: kue
alternative label: Kuman language
definition: Kuman (also Simbu or Chimbu) is a language of Simbu Province, Papua New Guinea. , it was spoken by about 80,000 people, 10,000 of which were monolinguals. In 2000 the number of speakers increased to 115,000.
in scheme: Lexvo - ISO 639-3 language codes
notation: kue

Western Katu
type: Language
type: Concept
ISO 639-3 code: kuf
alternative label: Katu, Western
in scheme: Lexvo - ISO 639-3 language codes
notation: kuf

Northern Tlaxiaco Mixtec
type: Language
type: Concept
ISO 639-3 code: xtn
alternative label: Mixtec, Northern Tlaxiaco
in scheme: Lexvo - ISO 639-3 language codes
notation: xtn

Kupa
type: Language
type: Concept
ISO 639-3 code: kug
in scheme: Lexvo - ISO 639-3 language codes
notation: kug

Kushi
type: Language
type: Concept
ISO 639-3 code: kuh
alternative label: Kushi language
definition: Kushi is a West Chadic language of Nigeria.
in scheme: Lexvo - ISO 639-3 language codes
notation: kuh

Kuikuro language
type: Language
type: Concept
ISO 639-3 code: kui
alternative label: Kuikúro-Kalapálo
definition: Kuikúro-Kalapálo, Apalakiri, is a Cariban language spoken by the Kuikuro and Kalapalo peoples of Brazil.
in scheme: Lexvo - ISO 639-3 language codes
notation: kui

Kuria
type: Language
type: Concept
ISO 639-3 code: kuj
alternative label: Kuria language
in scheme: Lexvo - ISO 639-3 language codes
notation: kuj

Kepo'
type: Language
type: Concept
ISO 639-3 code: kuk
in scheme: Lexvo - ISO 639-3 language codes
notation: kuk

Kulere
type: Language
type: Concept
ISO 639-3 code: kul
alternative label: Kulere language
definition: Kulere (also known as Tof, Korom Boye, Akandi, Akande, Kande) is an Afro-Asiatic language spoken in Plateau State, Nigeria. Dialects are Tof, Richa, Kamwai-Marhai.
in scheme: Lexvo - ISO 639-3 language codes
notation: kul

Kumyk
type: Language
type: Concept
ISO 639-2 Bibliographical code: kum
ISO 639-2 Terminological code: kum
ISO 639-3 code: kum
alternative label: Idioma cumuco @es
alternative label: Kumyk language
alternative label: Kumykische Sprache @de
alternative label: Lingua kumyk @it
alternative label: Língua kumyk @pt
alternative label: koumyk @fr
definition: Kumyk (Qumuq tili, Qumuqça or Qumuq (alternative spelling: Kumuk tili, Kumukça)) (Къумукъ тили) is a Turkic language, spoken by about 365,000 speakers (the Kumyks) in the Dagestan republic of Russian Federation.
in scheme: Lexvo - ISO 639-3 language codes
notation: kum
preferred label: Koumyk @fr
preferred label: Kumükisch @de
preferred label: kumyk @es

Kunama
type: Language
type: Concept
ISO 639-3 code: kun
alternative label: Kunama language
definition: The Kunama language is a language isolate which has been included in the proposed Nilo-Saharan language family. Kunama spoken by the Kunama people of western Eritrea and just across the Ethiopian border. The language has several dialects including: Barka. Marda, Aimara, Odasa, Tika, Lakatakura, Sokodasa, Takazze-Selit, and Tigray. Ilit and Bitama are not mutually intelligible and so may be considered distinct languages.
in scheme: Lexvo - ISO 639-3 language codes
notation: kun
preferred label: Lingua cunama @it

Tokharian A
type: Language
type: Concept
ISO 639-3 code: xto
in scheme: Lexvo - ISO 639-3 language codes
notation: xto

Kumukio
type: Language
type: Concept
ISO 639-3 code: kuo
in scheme: Lexvo - ISO 639-3 language codes
notation: kuo

Kunimaipa
type: Language
type: Concept
ISO 639-3 code: kup
in scheme: Lexvo - ISO 639-3 language codes
notation: kup

Karipuna
type: Language
type: Concept
ISO 639-3 code: kuq
alternative label: Karipuná language
definition: Karipuná is a Tupi language spoken by 12-15 individuals in Rondônia, Brazil, though it is unknown how many speakers live in the forest. It is near extinction. It is very similar to neighboring languages, and might be considered a dialect of Kagwahiva.
in scheme: Lexvo - ISO 639-3 language codes
notation: kuq

Kurdish
type: Language
type: Concept
ISO 639-1 code: ku
ISO 639-2 Bibliographical code: kur
ISO 639-2 Terminological code: kur
ISO 639-3 code: kur
alternative label: Idioma kurdo @es
alternative label: Kurde @fr
alternative label: Kurdische Sprachen @de
alternative label: Kurdish language
alternative label: Lingua curda @it
alternative label: Língua curda @pt
definition: Kurdish (Kurdish: or ) is a dialect continuum spoken by the Kurds in western Asia. It is part of the Iranian branch of the Indo-Iranian group of Indo-European languages. The Persian language is one of its close modern relatives.
in scheme: Lexvo - ISO 639-3 language codes
notation: kur
preferred label: Kurdisch @de
preferred label: curdo @it
preferred label: kurde @fr
preferred label: kurdo @es

Kusaal
type: Language
type: Concept
ISO 639-3 code: kus
alternative label: Kusaal language
definition: Kusaal is a Gur language spoken primarily in northern Ghana. It is spoken by roughly 400,000 people and takes its name from the Kusasi people, who form the majority of the population of the area in the far northeast of Ghana, between the Gambaga escarpment, the Red Volta, and the national borders with Togo and Burkina Faso. There are some villages of Kusaasi in Burkina and also a few speakers in Togo. Kusaal is closely related to Mampruli, the language of the Mamprussi, who live to the south, and to Dagbani. There is a major dialect division between Agole, to the east of the White Volta river, and Toende, to the West. Agole has more speakers, and the only large town of the district, Bawku, is in Agole. The New Testament translation is in the Agole dialect.
in scheme: Lexvo - ISO 639-3 language codes
notation: kus

Kutenai
type: Language
type: Concept
ISO 639-2 Bibliographical code: kut
ISO 639-2 Terminological code: kut
ISO 639-3 code: kut
alternative label: Idioma kutenai @es
alternative label: Kutenai language
definition: The Kutenai language (also Kootenai or Ktunaxa language) is named after and is spoken by some of the Kootenai Native American/First Nations people who are indigenous to the area of North America that is now Montana, Idaho, and British Columbia.
in scheme: Lexvo - ISO 639-3 language codes
notation: kut
preferred label: Kutenai-Sprache @de
preferred label: kutenai @es

Upper Kuskokwim
type: Language
type: Concept
ISO 639-3 code: kuu
alternative label: Kuskokwim, Upper
alternative label: Upper Kuskokwim language
definition: The Upper Kuskokwim language (also called Kolchan or Goltsan) is an Athabaskan language of the Na-Dené language family. It is spoken in the Upper Kuskokwim River villages of Nikolai, Telida, and McGrath, Alaska. About 40 of a total of 160 Upper Kuskokwim people (Dichinanek’ Hwt’ana) still speak the language. A practical orthography of the language was established by Raymond Collins, who in 1964 began linguistic work at Nikolai.
in scheme: Lexvo - ISO 639-3 language codes
notation: kuu
preferred label: Idioma dinak'i @es
preferred label: Kolchan @fr
preferred label: Língua kolchan @pt

Kur
type: Language
type: Concept
ISO 639-3 code: kuv
in scheme: Lexvo - ISO 639-3 language codes
notation: kuv

San Miguel Piedras Mixtec
type: Language
type: Concept
ISO 639-3 code: xtp
alternative label: Mixtec, San Miguel Piedras
in scheme: Lexvo - ISO 639-3 language codes
notation: xtp

Kpagua
type: Language
type: Concept
ISO 639-3 code: kuw
in scheme: Lexvo - ISO 639-3 language codes
notation: kuw

Kukatja
type: Language
type: Concept
ISO 639-3 code: kux
in scheme: Lexvo - ISO 639-3 language codes
notation: kux

Kuuku-Ya'u
type: Language
type: Concept
ISO 639-3 code: kuy
in scheme: Lexvo - ISO 639-3 language codes
notation: kuy

Kunza
type: Language
type: Concept
ISO 639-3 code: kuz
alternative label: Kunza language
definition: Kunza Cunza, also known as Likanantaí, Lipe, Ulipe, or Atacameño, is an extinct, unclassified language spoken in the Atacama Desert of northern Chile and southern Perú (specifically in Peine, Socaire (Salar de Atacama), and Caspana) by the Lickan-antay people, who have since shifted to Spanish.
in scheme: Lexvo - ISO 639-3 language codes
notation: kuz

Bagvalal
type: Language
type: Concept
ISO 639-3 code: kva
alternative label: Bagvalal language
definition: The Bagvalal language is an Avar–Andic language spoken by the Bagvalals in southwestern Dagestan, Russia, along the right bank of the river Andi-Koisu and the surrounding hills, near the Georgian border. It is fairly similar to Tindi, its closest relative. There were about 6,500 people who speak Bagvalal in the survey by Koryakov in 2006.
in scheme: Lexvo - ISO 639-3 language codes
notation: kva
preferred label: Bagwalal @fr

Kubu
type: Language
type: Concept
ISO 639-3 code: kvb
in scheme: Lexvo - ISO 639-3 language codes
notation: kvb

Kove
type: Language
type: Concept
ISO 639-3 code: kvc
alternative label: Kove language
definition: Kove is an Austronesian languages of New Britain.
in scheme: Lexvo - ISO 639-3 language codes
notation: kvc

Kui
type: Language
type: Concept
ISO 639-3 code: kvd
alternative label: Kui (Indonesia)
alternative label: Kui language
definition: Kui is a Trans–New Guinea language spoken by 4,240 people in several enclaves on Alor Island, East Nusa Tenggara, Indonesia.
in scheme: Lexvo - ISO 639-3 language codes
notation: kvd

Tumshuqese
type: Language
type: Concept
ISO 639-3 code: xtq
in scheme: Lexvo - ISO 639-3 language codes
notation: xtq

Kalabakan
type: Language
type: Concept
ISO 639-3 code: kve
in scheme: Lexvo - ISO 639-3 language codes
notation: kve

Kabalai
type: Language
type: Concept
ISO 639-3 code: kvf
alternative label: Kabalai language
definition: The Kabalai language is Afro-Asiatic language spoken in southwest Chad
in scheme: Lexvo - ISO 639-3 language codes
notation: kvf

Kuni-Boazi
type: Language
type: Concept
ISO 639-3 code: kvg
in scheme: Lexvo - ISO 639-3 language codes
notation: kvg

Komodo
type: Language
type: Concept
ISO 639-3 code: kvh
in scheme: Lexvo - ISO 639-3 language codes
notation: kvh

Kwang
type: Language
type: Concept
ISO 639-3 code: kvi
alternative label: Kwang language
definition: Kwang is an East Chadic language of Chad.
in scheme: Lexvo - ISO 639-3 language codes
notation: kvi

Psikye
type: Language
type: Concept
ISO 639-3 code: kvj
alternative label: Psikye language
definition: Psikye is an Afro-Asiatic language spoken in northern Cameroon and eastern Nigeria. Dialects include Psikye and Zlenge.
in scheme: Lexvo - ISO 639-3 language codes
notation: kvj

Kara
type: Language
type: Concept
ISO 639-3 code: zra
alternative label: Gaya language
alternative label: Kara (Korea)
definition: Gaya (Kaya), also transliterated Kara, is the presumed language of the Gaya confederacy in southern Korea. It is supposedly attested from thirteen toponyms, but it cannot be certain that these reflect the Gaya language itself rather than an earlier language. These place names appear to be in a language related to Japanese, and constitute part of the evidence for the Japanese–Koguryoic hypothesis. However, Koguryo (Goguryeo) itself came from further north, and may have been a language related to Korean that replaced Japonic languages in southern Korea. As Gaya grew out of one of the Samhan nations, it may be that the Goguryeo-derived elite language of Baekje was related to Korean, while the indigenous Samhan language was related to Gaya, assuming they were not both related to Korean. That is, Gaya might not be one of the Buyeo languages but rather part of Japonic.
in scheme: Lexvo - ISO 639-3 language codes
notation: zra

Korean Sign Language
type: Language
type: Concept
ISO 639-3 code: kvk
definition: Korean Sign Language or KSL (Korean: 手話 수화 Suhwa) is the deaf sign language of Korea. 1889 The beginnings of KSL date from 1889. The first primary school for deaf children, opened in 1908, used KSL. Commonality Although the origins of KSL predate the colonial period, the sign language developed some features in common with Japanese Sign Language (JSL) grammar.
in scheme: Lexvo - ISO 639-3 language codes
notation: kvk
preferred label: Langue des signes coréenne @fr

Early Tripuri
type: Language
type: Concept
ISO 639-3 code: xtr
alternative label: Tripuri, Early
in scheme: Lexvo - ISO 639-3 language codes
notation: xtr

Kayaw
type: Language
type: Concept
ISO 639-3 code: kvl
alternative label: Kayaw language
definition: Brek, also known as Brek Karen, Bwe, and Kayaw, is a Karen language of Burma.
in scheme: Lexvo - ISO 639-3 language codes
notation: kvl

Kendem
type: Language
type: Concept
ISO 639-3 code: kvm
in scheme: Lexvo - ISO 639-3 language codes
notation: kvm

Border Kuna
type: Language
type: Concept
ISO 639-3 code: kvn
alternative label: Kuna, Border
in scheme: Lexvo - ISO 639-3 language codes
notation: kvn

Dobel
type: Language
type: Concept
ISO 639-3 code: kvo
in scheme: Lexvo - ISO 639-3 language codes
notation: kvo

Kompane
type: Language
type: Concept
ISO 639-3 code: kvp
in scheme: Lexvo - ISO 639-3 language codes
notation: kvp

Geba Karen
type: Language
type: Concept
ISO 639-3 code: kvq
alternative label: Karen, Geba
in scheme: Lexvo - ISO 639-3 language codes
notation: kvq

Kerinci
type: Language
type: Concept
ISO 639-3 code: kvr
in scheme: Lexvo - ISO 639-3 language codes
notation: kvr

Kunggara
type: Language
type: Concept
ISO 639-3 code: kvs
in scheme: Lexvo - ISO 639-3 language codes
notation: kvs

Sindihui Mixtec
type: Language
type: Concept
ISO 639-3 code: xts
alternative label: Mixtec, Sindihui
in scheme: Lexvo - ISO 639-3 language codes
notation: xts

Lahta
type: Language
type: Concept
ISO 639-3 code: kvt
alternative label: Karen, Lahta
alternative label: Lahta Karen
in scheme: Lexvo - ISO 639-3 language codes
notation: kvt

Yinbaw Karen
type: Language
type: Concept
ISO 639-3 code: kvu
alternative label: Karen, Yinbaw
in scheme: Lexvo - ISO 639-3 language codes
notation: kvu

Kola
type: Language
type: Concept
ISO 639-3 code: kvv
in scheme: Lexvo - ISO 639-3 language codes
notation: kvv

Wersing
type: Language
type: Concept
ISO 639-3 code: kvw
alternative label: Wersing language
definition: The Wersing language, also known as Kolana after its primary dialect, is spoken in scattered settlements around the coast of Alor in Indonesia. It is not part of the Alor–Pantar group spoken over most of the island. Though not closely related to either, it has cultural connections with Tukudede on the neighboring island of Timor.
in scheme: Lexvo - ISO 639-3 language codes
notation: kvw

Parkari Koli
type: Language
type: Concept
ISO 639-3 code: kvx
alternative label: Koli, Parkari
alternative label: Parkari Koli language
definition: The Parkari Koli language (sometimes called just Parkari) is a language mainly spoken in the province of Sindh, Pakistan. It is spoken in the southeast tip bordering India, Tharparkar District, Nagar Parkar. Most of the lower Thar Desert, west as far as Indus River, bordered north and west by Hyderabad, to south and west of Badin.
in scheme: Lexvo - ISO 639-3 language codes
notation: kvx

Yintale
type: Language
type: Concept
ISO 639-3 code: kvy
alternative label: Karen, Yintale
alternative label: Yintale Karen
in scheme: Lexvo - ISO 639-3 language codes
notation: kvy

Tsakwambo
type: Language
type: Concept
ISO 639-3 code: kvz
alternative label: Tsaukambo
in scheme: Lexvo - ISO 639-3 language codes
notation: kvz

Dâw
type: Language
type: Concept
ISO 639-3 code: kwa
alternative label: Dâw language
definition: Dâw is a Nadahup language spoken in the northwestern part of the Amazonas state of Brazil, in an area commonly known as Alto Rio Negro. The number of speakers is 94, and the language is spoken by the Dâw people, of which most also speak Nheengatu and Portuguese.
in scheme: Lexvo - ISO 639-3 language codes
notation: kwa

Tacahua Mixtec
type: Language
type: Concept
ISO 639-3 code: xtt
alternative label: Mixtec, Tacahua
in scheme: Lexvo - ISO 639-3 language codes
notation: xtt

Kwa
type: Language
type: Concept
ISO 639-3 code: kwb
alternative label: Baa language
definition: Baa, also known as Kwa, Kwah, is a Niger–Congo language of uncertain affiliation; the more it has been studied, the more divergent it appears. Joseph Greenberg counted it as one of the Waja–Jen languages of the Adamawa family. Boyd (1989) assigned it its own branch within Waja–Jen. Kleinewillinghöfer (1996) removed it from Waja–Jen as an independent branch of Adamawa. When Blench (2008) broke up Adamawa, Baa became a provisional independent branch of his larger Savannas family.
in scheme: Lexvo - ISO 639-3 language codes
notation: kwb
preferred label: Baa @de

Likwala
type: Language
type: Concept
ISO 639-3 code: kwc
alternative label: Kwala language
definition: Kwala (Likwala) is a Bantu language of the Republic of Congo.
in scheme: Lexvo - ISO 639-3 language codes
notation: kwc

Kwaio
type: Language
type: Concept
ISO 639-3 code: kwd
alternative label: Gula'alaa language
definition: The Gula'ala language is spoken on Malaita Island in the Solomon Islands.
in scheme: Lexvo - ISO 639-3 language codes
notation: kwd

Kwerba
type: Language
type: Concept
ISO 639-3 code: kwe
alternative label: Kwerba language
definition: Kwerba is a Papuan language of Indonesia. It goes by various names: Airmati (Armati), Koassa, Mataweja, Naibedj, Segar Tor, Tekutameso.
in scheme: Lexvo - ISO 639-3 language codes
notation: kwe

Kwara'ae
type: Language
type: Concept
ISO 639-3 code: kwf
alternative label: Kwara'ae language
definition: The Kwara'ae language (previously called Fiu after the location of many of its speakers) is spoken in the north of Malaita Island in the Solomon Islands. In 1999 there were 32,400 people known to speak the language. It is the largest indigenous vernacular of the Solomon Islands.
in scheme: Lexvo - ISO 639-3 language codes
notation: kwf

Sara Kaba Deme
type: Language
type: Concept
ISO 639-3 code: kwg
alternative label: Kaba Deme language
definition: Kaba Démé (Kaba ’Dem, Ta Sara) is a Bongo–Bagirmi language of Chad and the Central African Republic. It is one of several local languages that go by the names Kaba and Sara.
in scheme: Lexvo - ISO 639-3 language codes
notation: kwg

Kowiai
type: Language
type: Concept
ISO 639-3 code: kwh
alternative label: Kowiai language
definition: Kowiai is an Austronesian language of the Bomberai Peninsula in New Guinea.
in scheme: Lexvo - ISO 639-3 language codes
notation: kwh

Awa-Cuaiquer
type: Language
type: Concept
ISO 639-3 code: kwi
alternative label: Awa Pit language
definition: Awa or Awa pit, also known as Cuaiquer, is a Barbacoan language spoken in northwestern South America.
in scheme: Lexvo - ISO 639-3 language codes
notation: kwi
preferred label: Awa pit @fr
preferred label: Idioma awá pit @es

Cuyamecalco Mixtec
type: Language
type: Concept
ISO 639-3 code: xtu
alternative label: Mixtec, Cuyamecalco
in scheme: Lexvo - ISO 639-3 language codes
notation: xtu

Kwanga
type: Language
type: Concept
ISO 639-3 code: kwj
alternative label: Kwanga language
definition: Kwanga (Gawanga) is a Sepik language spoken in Papua New Guinea.
in scheme: Lexvo - ISO 639-3 language codes
notation: kwj

Kwakiutl
type: Language
type: Concept
ISO 639-3 code: kwk
preferred label: Kwak'wala
definition: Kwakwala (sometimes called Kwagiutl or Kwakiutl) is the Indigenous language spoken by the Kwakwakawakw. It belongs to the Wakashan language family. There are about 250 Kwakwala speakers today, which amounts to 5% of the Kwakwakawakw population. Because of the small number of speakers, and the fact that very few children learn Kwakwala as a first language, its long-term viability is in question. However, interest from many Kwakwakawakw in preserving their language and a number of revitalization projects are countervailing pressures which may extend the viability of the language.
in scheme: Lexvo - ISO 639-3 language codes
notation: kwk

Kofyar
type: Language
type: Concept
ISO 639-3 code: kwl
alternative label: Kofyar language
definition: Kofyar is an Afro-Asiatic language spoken in Plateau State, Nigeria. Dialects are Bwol, Dimmuk, Gworam, Jipal, Kofyar, Kwagallak, and Mirriam.
in scheme: Lexvo - ISO 639-3 language codes
notation: kwl

Kwambi
type: Language
type: Concept
ISO 639-3 code: kwm
alternative label: Kwambi dialect
definition: Kwambi or Otshikwambi is a dialect of the Ovambo language spoken by the Kwambi tribe in Northern Namibia. Unlike Ndonga and Kwanyama it does not have a standardized written form in schools but is used and written in the Roman Catholic Church in Namibia.
in scheme: Lexvo - ISO 639-3 language codes
notation: kwm

Kwangali
type: Language
type: Concept
ISO 639-3 code: kwn
alternative label: Kwangali language
definition: Kwangali, also known as RuKwangali and SiKwangali, is a Bantu language spoken by 85,000 people along the Okavango River in Namibia, where it is a national language, and in Angola. It is one of several Bantu languages of the Okavango which have click consonants; these are the dental clicks c and gc, along with prenasalization and aspiration. It also has a nasal glottal approximant.
in scheme: Lexvo - ISO 639-3 language codes
notation: kwn
preferred label: Idioma RuKwangali @es
preferred label: RuKwangali @de

Kwomtari
type: Language
type: Concept
ISO 639-3 code: kwo
alternative label: Kwomtari language
definition: Kwomtari is the eponymous language of the Kwomtari family of Papua New Guinea. It is spoken in six villages in Amanab District, Sandaun Province.
in scheme: Lexvo - ISO 639-3 language codes
notation: kwo

Kodia
type: Language
type: Concept
ISO 639-3 code: kwp
alternative label: Kwadia language
definition: Kwadia (Kodia) is a minor Kru language of Ivory Coast.
in scheme: Lexvo - ISO 639-3 language codes
notation: kwp

Kwak
type: Language
type: Concept
ISO 639-3 code: kwq
in scheme: Lexvo - ISO 639-3 language codes
notation: kwq

Thawa
type: Language
type: Concept
in scheme: Lexvo - ISO 639-3 language codes

Kwer
type: Language
type: Concept
ISO 639-3 code: kwr
in scheme: Lexvo - ISO 639-3 language codes
notation: kwr

Kwese
type: Language
type: Concept
ISO 639-3 code: kws
alternative label: Kwese language
definition: Kwese is a Bantu language of the Democratic Republic of Congo.
in scheme: Lexvo - ISO 639-3 language codes
notation: kws

Kwesten
type: Language
type: Concept
ISO 639-3 code: kwt
alternative label: Kwesten language
definition: Kwesten is a Papuan language of Indonesia.
in scheme: Lexvo - ISO 639-3 language codes
notation: kwt

Kwakum
type: Language
type: Concept
ISO 639-3 code: kwu
in scheme: Lexvo - ISO 639-3 language codes
notation: kwu

Sara Kaba Náà
type: Language
type: Concept
ISO 639-3 code: kwv
in scheme: Lexvo - ISO 639-3 language codes
notation: kwv

Tawandê
type: Language
type: Concept
ISO 639-3 code: xtw
in scheme: Lexvo - ISO 639-3 language codes
notation: xtw

Kwinti
type: Language
type: Concept
ISO 639-3 code: kww
in scheme: Lexvo - ISO 639-3 language codes
notation: kww

Khirwar
type: Language
type: Concept
ISO 639-3 code: kwx
in scheme: Lexvo - ISO 639-3 language codes
notation: kwx

San Salvador Kongo
type: Language
type: Concept
ISO 639-3 code: kwy
alternative label: Kongo, San Salvador
in scheme: Lexvo - ISO 639-3 language codes
notation: kwy

Kwadi
type: Language
type: Concept
ISO 639-3 code: kwz
alternative label: Kwadi language
definition: Kwadi is a "click language" of uncertain classification once spoken in the southwest corner of Angola. It is believed to be extinct. There were only fifty Kwadi in the 1950s, of which only 4–5 were competent speakers of the language. Three partial speakers were known in 1965, but in 1981 no speakers could be found.
in scheme: Lexvo - ISO 639-3 language codes
notation: kwz

Kairiru
type: Language
type: Concept
ISO 639-3 code: kxa
alternative label: Kairiru language
definition: Kairiru is one of three Kairiru languages spoken mainly on Kairiru and Mushu islands and in several coastal villages on the mainland between Cape Karawop and Cape Samein near Wewak in East Sepik Province of Papua New Guinea.
in scheme: Lexvo - ISO 639-3 language codes
notation: kxa

Krobu
type: Language
type: Concept
ISO 639-3 code: kxb
alternative label: Krobu language
definition: Krobu (Krobou) is a Tano language (Kwa, Niger–Congo) of Ivory Coast.
in scheme: Lexvo - ISO 639-3 language codes
notation: kxb

Konso
type: Language
type: Concept
ISO 639-3 code: kxc
alternative label: Khonso
alternative label: Konso language
definition: The Konso language (also Af Kareti, Afa Karatti, Conso, Gato, Karate, Kareti, Komso) is an East Cushitic language spoken in southwest Ethiopia. Native speakers of Konso number about 200,000 (SIL 2005). Konso is closely related to Dirasha (also known as Gidole), and serves as a "trade language"—or lingua franca—beyond the area of the Konso people.
in scheme: Lexvo - ISO 639-3 language codes
notation: kxc

Yoloxochitl Mixtec
type: Language
type: Concept
ISO 639-3 code: xty
alternative label: Mixtec, Yoloxochitl
in scheme: Lexvo - ISO 639-3 language codes
notation: xty

Brunei
type: Language
type: Concept
ISO 639-3 code: kxd
alternative label: Melayu Brunei
definition: Melayu Brunei (Brunei-Kadaian, Orang Bukit) is the official standardized form of the Malay language used in Brunei. It is also spoken as lingua franca in some parts of East Malaysia such as Federal Territory of Labuan, District of Limbang and Lawas (Sarawak) and District of Sipitang, Beaufort, Kuala Penyu and Papar (Sabah). It is spoken by about 266,000 people. There are calls to expand the use of the language in Brunei. Brunei Malay is quite divergent from standard Malay and the rest of the Malay dialects and is mostly mutually unintelligible. Brunei Malay is the official printed form and is used in all official Brunei government media.
in scheme: Lexvo - ISO 639-3 language codes
notation: kxd
preferred label: Malais de Brunei @fr

Kakihum
type: Language
type: Concept
ISO 639-3 code: kxe
in scheme: Lexvo - ISO 639-3 language codes
notation: kxe

Manumanaw
type: Language
type: Concept
ISO 639-3 code: kxf
alternative label: Karen, Manumanaw
alternative label: Manumanaw Karen
in scheme: Lexvo - ISO 639-3 language codes
notation: kxf

Karo
type: Language
type: Concept
ISO 639-3 code: kxh
alternative label: Karo (Ethiopia)
alternative label: Karo language
definition: Karo (also Cherre, Kere, Kerre) is an Omotic language spoken in the Debub (South) Omo Zone of the Southern Nations, Nationalities, and People's Region in Ethiopia. Karo is described as being closely related to its neighbors, Hamer and Banna, with a lexical similarity of 81%.
in scheme: Lexvo - ISO 639-3 language codes
notation: kxh

Keningau Murut
type: Language
type: Concept
ISO 639-3 code: kxi
alternative label: Murut, Keningau
in scheme: Lexvo - ISO 639-3 language codes
notation: kxi

Kulfa
type: Language
type: Concept
ISO 639-3 code: kxj
in scheme: Lexvo - ISO 639-3 language codes
notation: kxj

Zayein Karen
type: Language
type: Concept
ISO 639-3 code: kxk
alternative label: Karen, Zayein
in scheme: Lexvo - ISO 639-3 language codes
notation: kxk

Nepali Kurux
type: Language
type: Concept
ISO 639-3 code: kxl
alternative label: Kurux, Nepali
in scheme: Lexvo - ISO 639-3 language codes
notation: kxl

Tasmanian
type: Language
type: Concept
ISO 639-3 code: xtz
in scheme: Lexvo - ISO 639-3 language codes
notation: xtz

Northern Khmer
type: Language
type: Concept
ISO 639-3 code: kxm
alternative label: Khmer, Northern
in scheme: Lexvo - ISO 639-3 language codes
notation: kxm

Kanowit-Tanjong Melanau
type: Language
type: Concept
ISO 639-3 code: kxn
alternative label: Melanau, Kanowit-Tanjong
in scheme: Lexvo - ISO 639-3 language codes
notation: kxn

Kanoé
type: Language
type: Concept
ISO 639-3 code: kxo
alternative label: Kanoê language
definition: Kanoê or Kapishana (also called Amniapé) is a nearly extinct language isolate of Brazil. The Kapishana people now speak Portuguese or other indigenous languages from intermarriage.
in scheme: Lexvo - ISO 639-3 language codes
notation: kxo
preferred label: Idioma kanoé @es

Wadiyara Koli
type: Language
type: Concept
ISO 639-3 code: kxp
alternative label: Koli, Wadiyara
in scheme: Lexvo - ISO 639-3 language codes
notation: kxp

Smärky Kanum
type: Language
type: Concept
ISO 639-3 code: kxq
alternative label: Kanum, Smärky
in scheme: Lexvo - ISO 639-3 language codes
notation: kxq

Koro
type: Language
type: Concept
ISO 639-3 code: kxr
alternative label: Koro (Papua New Guinea)
alternative label: Koro language
definition: The Koro language is an East Manus language spoken by approximately 400 people on northeastern Manus Island, Manus Province of Papua New Guinea. It has SVO word order.
in scheme: Lexvo - ISO 639-3 language codes
notation: kxr

Kangjia
type: Language
type: Concept
ISO 639-3 code: kxs
alternative label: Kangjia language
definition: The Kangjia language (in Chinese, 康家语 Kāngjiā Yǔ) is a recently-discovered Mongolic language spoken by a Muslim population of around 300 people in Jainca (Jianzha) County, Huangnan Tibetan Autonomous Prefecture in Qinghai province of China. As to its taxonomic affiliation, Kangjia seems to be an intermediate between Bonan language and Dongxiang language (Santa).
in scheme: Lexvo - ISO 639-3 language codes
notation: kxs

Alu Kurumba
type: Language
type: Concept
ISO 639-3 code: xua
alternative label: Kurumba, Alu
in scheme: Lexvo - ISO 639-3 language codes
notation: xua

Koiwat
type: Language
type: Concept
ISO 639-3 code: kxt
in scheme: Lexvo - ISO 639-3 language codes
notation: kxt

Kui
type: Language
type: Concept
ISO 639-3 code: kxu
alternative label: Kui (India)
alternative label: Kui language
definition: Kui (also Kandh, Khondi, Khond, Khondo, Kanda, Kodu (Kōdu), Kodulu, Kuinga (Kūinga), Kuy) is a Central-Dravidian language spoken by the Khonds. It is mostly spoken in Orissa, and written in the Oriya script. With 641,662 registered native speakers, it figures at rank 29 in the 1991 Indian census.
in scheme: Lexvo - ISO 639-3 language codes
notation: kxu

Kuvi
type: Language
type: Concept
ISO 639-3 code: kxv
in scheme: Lexvo - ISO 639-3 language codes
notation: kxv

Konai
type: Language
type: Concept
ISO 639-3 code: kxw
in scheme: Lexvo - ISO 639-3 language codes
notation: kxw

Likuba
type: Language
type: Concept
ISO 639-3 code: kxx
alternative label: Kuba language
definition: Kuba (Likuba, Kyba) is a Bantu language of Kasai, Democratic Republic of Congo.
in scheme: Lexvo - ISO 639-3 language codes
notation: kxx

Kayong
type: Language
type: Concept
ISO 639-3 code: kxy
in scheme: Lexvo - ISO 639-3 language codes
notation: kxy

Kerewo
type: Language
type: Concept
ISO 639-3 code: kxz
in scheme: Lexvo - ISO 639-3 language codes
notation: kxz

Kwaya
type: Language
type: Concept
ISO 639-3 code: kya
in scheme: Lexvo - ISO 639-3 language codes
notation: kya

Betta Kurumba
type: Language
type: Concept
ISO 639-3 code: xub
alternative label: Betta Kurumba language
alternative label: Kurumba, Betta
definition: The Betta Kurumba language (; ) is a Dravidian language related to Tamil, spoken by 32,000 people in the Nilgiri mountains and in adjoining areas in Tamil Nadu, Karnataka and Kerala. means “hills” in Kannada.
in scheme: Lexvo - ISO 639-3 language codes
notation: xub

Butbut Kalinga
type: Language
type: Concept
ISO 639-3 code: kyb
alternative label: Kalinga, Butbut
in scheme: Lexvo - ISO 639-3 language codes
notation: kyb

Kyaka
type: Language
type: Concept
ISO 639-3 code: kyc
in scheme: Lexvo - ISO 639-3 language codes
notation: kyc

Karey
type: Language
type: Concept
ISO 639-3 code: kyd
in scheme: Lexvo - ISO 639-3 language codes
notation: kyd

Krache
type: Language
type: Concept
ISO 639-3 code: kye
alternative label: Krache language
definition: Krache (Krachi, Krakye) is a Guang language spoken by 58,000 in Ghana.
in scheme: Lexvo - ISO 639-3 language codes
notation: kye
preferred label: Kratschi @de

Kouya
type: Language
type: Concept
ISO 639-3 code: kyf
alternative label: Kuya language
definition: Kuya (Kouya, Kowya) is a Kru language of Ivory Coast.
in scheme: Lexvo - ISO 639-3 language codes
notation: kyf
preferred label: Kuya @de

Keyagana
type: Language
type: Concept
ISO 639-3 code: kyg
in scheme: Lexvo - ISO 639-3 language codes
notation: kyg

Karok
type: Language
type: Concept
ISO 639-3 code: kyh
alternative label: Karuk language
definition: Karuk or Karok is an endangered language of northwestern California. It is the traditional language of the Karuk people, most of whom now speak English.
in scheme: Lexvo - ISO 639-3 language codes
notation: kyh
preferred label: Idioma karok @es
preferred label: Karuk @fr
preferred label: Língua karuk @pt

Kiput
type: Language
type: Concept
ISO 639-3 code: kyi
alternative label: Kiput language
definition: Kiput is a Malayo-Polynesian language spoken by about 450 people in northern Sarawak, Borneo, Malaysia.
in scheme: Lexvo - ISO 639-3 language codes
notation: kyi

Karao
type: Language
type: Concept
ISO 639-3 code: kyj
in scheme: Lexvo - ISO 639-3 language codes
notation: kyj

Kamayo
type: Language
type: Concept
ISO 639-3 code: kyk
in scheme: Lexvo - ISO 639-3 language codes
notation: kyk

Kalapuya
type: Language
type: Concept
ISO 639-3 code: kyl
alternative label: Central Kalapuya language
definition: Central Kalapuyan was a Kalapuyan language indigenous to the central and southern Willamette Valley in Oregon in the United States. It was spoken by various bands of the Kalapuya peoples who inhabited the valley up through the middle of the 19th century. The language is closely related to Northern Kalapuya, spoken in the Tualatin and Yamhill valleys. Dialects of Central Kalapuya that have been identified include:
in scheme: Lexvo - ISO 639-3 language codes
notation: kyl
preferred label: Kalapuya central @fr

Kpatili
type: Language
type: Concept
ISO 639-3 code: kym
alternative label: Kpatili language
definition: Kpatili (Kpatere, Ngindere) is a Ubangian language spoken in the Central African Republic. Half of the Kpatili people are speakers of Gbayi, which is not closely related.
in scheme: Lexvo - ISO 639-3 language codes
notation: kym

Umiida
type: Language
type: Concept
ISO 639-3 code: xud
in scheme: Lexvo - ISO 639-3 language codes
notation: xud

Northern Binukidnon
type: Language
type: Concept
ISO 639-3 code: kyn
alternative label: Binukidnon, Northern
in scheme: Lexvo - ISO 639-3 language codes
notation: kyn

Kelon
type: Language
type: Concept
ISO 639-3 code: kyo
in scheme: Lexvo - ISO 639-3 language codes
notation: kyo

Kang
type: Language
type: Concept
ISO 639-3 code: kyp
in scheme: Lexvo - ISO 639-3 language codes
notation: kyp

Kenga
type: Language
type: Concept
ISO 639-3 code: kyq
alternative label: Kenga language
definition: Kenga is a Bongo–Bagirmi language of Chad.
in scheme: Lexvo - ISO 639-3 language codes
notation: kyq

Kuruáya
type: Language
type: Concept
ISO 639-3 code: kyr
in scheme: Lexvo - ISO 639-3 language codes
notation: kyr

Baram Kayan
type: Language
type: Concept
ISO 639-3 code: kys
alternative label: Kayan, Baram
in scheme: Lexvo - ISO 639-3 language codes
notation: kys

Kayagar
type: Language
type: Concept
ISO 639-3 code: kyt
alternative label: Kayagar language
definition: Kayagar (Kajagar, Kaygi, Kaygir, Wiyagar) is a Papuan language of West Papua.
in scheme: Lexvo - ISO 639-3 language codes
notation: kyt

Kunigami
type: Language
type: Concept
ISO 639-3 code: xug
alternative label: Kunigami language
definition: The Kunigami language is an Okinawan language spoken largely in the north of Okinawa Island. Like other Okinawan languages, Kunigami is part of the Ryukyuan family. The number of competent native speakers of the language is not known - as a result of Japanese language policy, the younger generation mostly speaks Japanese as their first language. It is often referred to as the Nakijin dialect of the Okinawan language, in comparison with the central Okinawan which is also called the dialect of Shuri and Naha.
in scheme: Lexvo - ISO 639-3 language codes
notation: xug
preferred label: Idioma kunigami @es

Western Kayah
type: Language
type: Concept
ISO 639-3 code: kyu
alternative label: Kayah, Western
in scheme: Lexvo - ISO 639-3 language codes
notation: kyu

Kayort
type: Language
type: Concept
ISO 639-3 code: kyv
alternative label: Kayort language
definition: Kayort is an Indo-Aryan language spoken by about 22,000 people in Dakuwa Danga, Nepal.
in scheme: Lexvo - ISO 639-3 language codes
notation: kyv

Kudmali
type: Language
type: Concept
ISO 639-3 code: kyw
alternative label: Kurmali
definition: Kurmali (Devanagari: कुर्माली or कुरमाली) or Kudmali is one of many languages which is spoken in Jharkhand, India.
in scheme: Lexvo - ISO 639-3 language codes
notation: kyw

Rapoisi
type: Language
type: Concept
ISO 639-3 code: kyx
alternative label: Rapoisi language
definition: Konua Rapoisi is an East Papuan of Bougainville, an island to the east of New Guinea.
in scheme: Lexvo - ISO 639-3 language codes
notation: kyx

Kambaira
type: Language
type: Concept
ISO 639-3 code: kyy
in scheme: Lexvo - ISO 639-3 language codes
notation: kyy

Kayabí
type: Language
type: Concept
ISO 639-3 code: kyz
alternative label: Kayabi language
definition: Kayabí (Caiabi) is a Tupian language of Matto Grosso, Brazil.
in scheme: Lexvo - ISO 639-3 language codes
notation: kyz

Western Karaboro
type: Language
type: Concept
ISO 639-3 code: kza
alternative label: Karaboro, Western
alternative label: Syer-Tenyer language
definition: Syer-Tenyer, or Western Karaboro, is a pair of Senufo dialects of Burkina Faso.
in scheme: Lexvo - ISO 639-3 language codes
notation: kza
preferred label: Syer-Tenyer @de

Kaibobo
type: Language
type: Concept
ISO 639-3 code: kzb
in scheme: Lexvo - ISO 639-3 language codes
notation: kzb

Bondoukou Kulango
type: Language
type: Concept
ISO 639-3 code: kzc
alternative label: Kulango, Bondoukou
in scheme: Lexvo - ISO 639-3 language codes
notation: kzc

Kadai
type: Language
type: Concept
ISO 639-3 code: kzd
in scheme: Lexvo - ISO 639-3 language codes
notation: kzd

Kosena
type: Language
type: Concept
ISO 639-3 code: kze
in scheme: Lexvo - ISO 639-3 language codes
notation: kze

Da'a Kaili
type: Language
type: Concept
ISO 639-3 code: kzf
alternative label: Kaili, Da'a
in scheme: Lexvo - ISO 639-3 language codes
notation: kzf

Mirgan
type: Language
type: Concept
ISO 639-3 code: zrg
in scheme: Lexvo - ISO 639-3 language codes
notation: zrg

Kikai
type: Language
type: Concept
ISO 639-3 code: kzg
in scheme: Lexvo - ISO 639-3 language codes
notation: kzg

Jennu Kurumba
type: Language
type: Concept
ISO 639-3 code: xuj
alternative label: Kurumba, Jennu
in scheme: Lexvo - ISO 639-3 language codes
notation: xuj

Kelabit
type: Language
type: Concept
ISO 639-3 code: kzi
alternative label: Kelabit language
definition: Kelabit is one of the remotest languages of Borneo, on the Sarawak–Kalimantan border, and spoken by one of the smallest ethnicities in Borneo, the Kelabit people.
in scheme: Lexvo - ISO 639-3 language codes
notation: kzi

Coastal Kadazan
type: Language
type: Concept
ISO 639-3 code: kzj
alternative label: Coastal Kadazan language
alternative label: Kadazan, Coastal
definition: Coastal Kadazan is a Austronesian language primarily spoken in Sabah, Malaysia. It is the primary language spoken by the Kadazan ethnic group.
in scheme: Lexvo - ISO 639-3 language codes
notation: kzj
preferred label: Língua kadazan @pt

Kazukuru
type: Language
type: Concept
ISO 639-3 code: kzk
alternative label: Kazukuru language
definition: Kazukuru is an extinct language that was once spoken in New Georgia, Solomon Islands. The Dororo and Guliguli languages (also extinct) are supposedly its only known relations. The speakers of Kazukuru gradually merged with the Roviana people from the sixteenth century onward, and adopted Roviana as their language. Kazukuru was last recorded in the early twentieth century when its speakers were in the last stages of language shift. Today Kazukuru is the name of a clan in the Roviana people group.
in scheme: Lexvo - ISO 639-3 language codes
notation: kzk

Kayeli
type: Language
type: Concept
ISO 639-3 code: kzl
alternative label: Kayeli language
definition: Kayeli is an Austronesian language which was used by the Kayeli people who lived in Indonesian island Buru . Two dialects were recognized, namely Leliali (Liliali) and Lumaete (Lumaiti, Mumaite, Lumara). Whereas about 800 Kayeli people still live in the southern coast of the Kayeli Bay, in the eastern part of Buru, as of 1995, only 3 elderly people could speak the language and have not used it for three decades; other natives changed to the Ambon dialect of Malay language (Melayu Ambon). The latter is widely used in the Maluku Islands as a second language and is a simplified form of Indonesian language with additions of the local lexicon. The last speaker of the Leliali dialect died in 1989 and no speakers of Lumaete could be located by then. A little more than 400 basic Kayeli words could be assembled, of which 13% were loanwords from Malay, Arabic, Portuguese and Sanskrit. They revealed significant phonetic and lexical difference with the Buru language – the lexical similarity of Leliali dialect with the closest Buru dialect of Masarete was 45%.
in scheme: Lexvo - ISO 639-3 language codes
notation: kzl

Kais
type: Language
type: Concept
ISO 639-3 code: kzm
in scheme: Lexvo - ISO 639-3 language codes
notation: kzm

Kokola
type: Language
type: Concept
ISO 639-3 code: kzn
in scheme: Lexvo - ISO 639-3 language codes
notation: kzn

Kaningi
type: Language
type: Concept
ISO 639-3 code: kzo
in scheme: Lexvo - ISO 639-3 language codes
notation: kzo

Kaidipang
type: Language
type: Concept
ISO 639-3 code: kzp
in scheme: Lexvo - ISO 639-3 language codes
notation: kzp

Ngunawal
type: Language
type: Concept
in scheme: Lexvo - ISO 639-3 language codes

Kaike
type: Language
type: Concept
ISO 639-3 code: kzq
in scheme: Lexvo - ISO 639-3 language codes
notation: kzq

Karang
type: Language
type: Concept
ISO 639-3 code: kzr
in scheme: Lexvo - ISO 639-3 language codes
notation: kzr

Sugut Dusun
type: Language
type: Concept
ISO 639-3 code: kzs
alternative label: Dusun, Sugut
in scheme: Lexvo - ISO 639-3 language codes
notation: kzs

Tambunan Dusun
type: Language
type: Concept
ISO 639-3 code: kzt
alternative label: Dusun, Tambunan
in scheme: Lexvo - ISO 639-3 language codes
notation: kzt

Kayupulau
type: Language
type: Concept
ISO 639-3 code: kzu
in scheme: Lexvo - ISO 639-3 language codes
notation: kzu

Umbrian
type: Language
type: Concept
ISO 639-3 code: xum
alternative label: Umbrian language
definition: Umbrian is an extinct Italic language formerly spoken by the Umbri in the ancient Italian region of Umbria. Within the Italic languages it is closely related to the Oscan group and is therefore associated with it in the group of Osco-Umbrian languages. Since that classification was first formulated a number of other languages in ancient Italy were discovered to be more closely related to Umbrian. Therefore a group was devised to contain them, termed the Umbrian group. In addition to the specific Umbrian language, they are the Volscian language, the Sabine language, the South Picene language, and the Marsian language. The classification used in this article is that of the Linguist List and SIL International.
in scheme: Lexvo - ISO 639-3 language codes
notation: xum
preferred label: Idioma umbro @es
preferred label: Lingua umbra @it
preferred label: Língua umbra @pt
preferred label: Ombrien @fr
preferred label: Umbrische Sprache @de

Komyandaret
type: Language
type: Concept
ISO 639-3 code: kzv
alternative label: Komyandaret language
definition: Komyandaret is a poorly documented Papuan language that has recently been shown to be one of the Ok languages. It is close enough to Tsaukambo that there is some mutual intelligibility.
in scheme: Lexvo - ISO 639-3 language codes
notation: kzv

Karirí-Xocó
type: Language
type: Concept
ISO 639-3 code: kzw
alternative label: Kariri languages
definition: The Karirí languages, generally considered dialects of a single language, are extinct languages spoken until the middle of the 20th century; the 4,000 ethnic Karirí are now monolingual Portuguese speakers, though a few know common phrases and names of medicinal plants.
in scheme: Lexvo - ISO 639-3 language codes
notation: kzw
preferred label: Cariris @pt
preferred label: Lenguas karirí @es

Kamarian
type: Language
type: Concept
ISO 639-3 code: kzx
in scheme: Lexvo - ISO 639-3 language codes
notation: kzx

Kango
type: Language
type: Concept
ISO 639-3 code: kzy
alternative label: Kango (Tshopo District)
in scheme: Lexvo - ISO 639-3 language codes
notation: kzy

Kalabra
type: Language
type: Concept
ISO 639-3 code: kzz
alternative label: Kalabra language
definition: Kalabra is a Papuan language of the Birds Head Peninsula of New Guinea. Its closest to Tehit.
in scheme: Lexvo - ISO 639-3 language codes
notation: kzz

Southern Subanen
type: Language
type: Concept
ISO 639-3 code: laa
alternative label: Subanen, Southern
in scheme: Lexvo - ISO 639-3 language codes
notation: laa

Linear A
type: Language
type: Concept
ISO 639-3 code: lab
in scheme: Lexvo - ISO 639-3 language codes
notation: lab

Lacandon
type: Language
type: Concept
ISO 639-3 code: lac
alternative label: Lacandon language
definition: Lacandon (Jach-t’aan in the revised orthography of the Instituto Nacional de Lenguas Indigenas) is a Mayan language spoken by approximately 1000 Lacandon people in the state of Chiapas in Mexico. Native Lacandon speakers refer to their language as Jach t’aan or Hach t'an. A portion of the Lacandon people also speak Tzeltal, Chol, and Spanish.
in scheme: Lexvo - ISO 639-3 language codes
notation: lac
preferred label: Idioma lacandón @es
preferred label: Lakandonisch @de
preferred label: Língua lacandona @pt

Ladino
type: Language
type: Concept
ISO 639-2 Bibliographical code: lad
ISO 639-2 Terminological code: lad
ISO 639-3 code: lad
alternative label: Idioma judeoespañol @es
alternative label: Judaeo-Spanish
alternative label: Judeu-espanhol @pt
alternative label: Judéo-espagnol @fr
alternative label: Ladino language
alternative label: Lingua giudeo-spagnola @it
alternative label: judéo-espagnol @fr
definition: Judaeo-Spanish (Judaeo-Spanish: גֿודיאו-איספאנייול ; ), in Israel commonly referred to as Ladino, and known locally as Judezmo, Espanyol, Djudeo-Espanyol, Djudezmo, Spaniolit and other names, is a Romance language derived from Old Spanish. As a Jewish language, it is influenced heavily by Hebrew and Aramaic, but also Arabic, Turkish and to a lesser extent Greek and other languages where Sephardic exiles settled around the world, primarily throughout the Ottoman Empire.
in scheme: Lexvo - ISO 639-3 language codes
notation: lad
preferred label: ladino @es

Pattani
type: Language
type: Concept
ISO 639-3 code: lae
alternative label: Pattani language
definition: Pattani, also known as Manchati, Manchad, Patni, Chamba, Chamba Lahuli, Lahuli, Swangla, Changsapa Boli is a Tibeto-Burman language (Sino-Tibetan stock) spoken in the Indian state of Himachal Pradesh. The language is spoken in the Lahul Valley, Pattan, Chamba-Lahul, and lower Mayar valleys. The number of people speaking the language is approximately 11,000 in India, according to 1998 data from Ethnologue.
in scheme: Lexvo - ISO 639-3 language codes
notation: lae

Lafofa
type: Language
type: Concept
ISO 639-3 code: laf
alternative label: Lafofa languages
definition: Lafofa, also Tegem, is a Niger–Congo language cluster spoken in Kordofan, Sudan. Blench (2010) considers the Tegem and Amira varieties to be distinct languages; as Lafofa is poorly attested, there may be others.
in scheme: Lexvo - ISO 639-3 language codes
notation: laf

Langi
type: Language
type: Concept
ISO 639-3 code: lag
alternative label: Rangi language
definition: Rangi or Langi (there is no distinction between and ; also known as Irangi, Kilaangi, etc.) is a Bantu language of spoken by the Rangi people of the Dodoma Region of Tanzania. Dialects are Kondoa, Haubi, Kolo, Mondo.
in scheme: Lexvo - ISO 639-3 language codes
notation: lag
preferred label: langi @es

Lahnda
type: Language
type: Concept
ISO 639-2 Bibliographical code: lah
ISO 639-2 Terminological code: lah
ISO 639-3 code: lah
in scheme: Lexvo - ISO 639-3 language codes
notation: lah
preferred label: lahnda @es

Lambya
type: Language
type: Concept
ISO 639-3 code: lai
alternative label: Lambya language
definition: Lambya (Rambia) is a Bantu language of Tanzania and Malawi.
in scheme: Lexvo - ISO 639-3 language codes
notation: lai

Lango
type: Language
type: Concept
ISO 639-3 code: laj
alternative label: Lango (Uganda)
alternative label: Lango language
definition: Lango (also called Lwo, Lwoo, or Leb-Lango,) is a Western Nilotic language of the Luo branch, spoken by the Langi people in Uganda. It is mostly spoken in Lango sub-region, in the Northern Region. Spoken by approximately 1.8 million speakers, it makes up for about five percent of the population of Uganda. An orthography for it using the Latin script has been introduced and is taught in primary schools.
in scheme: Lexvo - ISO 639-3 language codes
notation: laj
preferred label: Língua langu @pt

Laka
type: Language
type: Concept
ISO 639-3 code: lak
alternative label: Laka (Nigeria)
in scheme: Lexvo - ISO 639-3 language codes
notation: lak

Lalia
type: Language
type: Concept
ISO 639-3 code: lal
alternative label: Lalia language
definition: Lalia is a Bantu language of the Democratic Republic of Congo.
in scheme: Lexvo - ISO 639-3 language codes
notation: lal

Unggarranggu
type: Language
type: Concept
ISO 639-3 code: xun
in scheme: Lexvo - ISO 639-3 language codes
notation: xun

Lamba
type: Language
type: Concept
ISO 639-2 Bibliographical code: lam
ISO 639-2 Terminological code: lam
ISO 639-3 code: lam
alternative label: Lamba language
alternative label: Lamba-Sprache @de
definition: Lamba is a language found in Zambia. It is related to Bemba and is commonly spoken in the Copperbelt. There are about 210,000 native speakers in the northern parts of Zambia and southern fringes of the Democratic Republic of the Congo. Lamba is also spoken in Lusaka, mainly because many speakers have migrated there for jobs. Lamba is a Bantu language. (In fact, "mu ntu" means "one person" in Lamba and "ba ntu" means "two or more people".) Depending on who does the counting, Zambia has between 42 and 78 local languages besides English – see Languages of Zambia for further details. Some people might say Lamba is a dialect of Bemba. Though the two languages share many words, they are not as close as say Cockney and Haitian Creole are to English or French.
in scheme: Lexvo - ISO 639-3 language codes
notation: lam
preferred label: lamba @es

Laru
type: Language
type: Concept
ISO 639-3 code: lan
alternative label: Laru language
definition: Laru (Laro) is a minor Kainji language of Nigeria. Speakers are shifting to Busa.
in scheme: Lexvo - ISO 639-3 language codes
notation: lan

Lao
type: Language
type: Concept
ISO 639-1 code: lo
ISO 639-2 Bibliographical code: lao
ISO 639-2 Terminological code: lao
ISO 639-3 code: lao
alternative label: Idioma lao @es
alternative label: Lao language
alternative label: Laotische Sprache @de
alternative label: Lingua lao @it
alternative label: Língua laociana @pt
preferred label: lao @it
definition: Lao or Laotian (ພາສາລາວ, BGN/PCGN: phasa lao, ) is a tonal language of the Tai–Kadai language family. It is the official language of Laos, and also spoken in the northeast of Thailand, where it is usually referred to as the Isan language. Being the primary language of the Lao people, Lao is also an important second language for the multitude of ethnic groups in Laos and in Isan. Lao, like all languages in Laos, is written in an abugida script. Although there is no official standard, the Vientiane dialect has become the de facto standard.
in scheme: Lexvo - ISO 639-3 language codes
notation: lao
preferred label: Laotisch @de
preferred label: laosiano @es

Laka
type: Language
type: Concept
ISO 639-3 code: lap
alternative label: Laka (Chad)
in scheme: Lexvo - ISO 639-3 language codes
notation: lap

Qabiao
type: Language
type: Concept
ISO 639-3 code: laq
alternative label: Qabiao language
definition: Qabiao (autonym: qa0 biau33; Chinese: Pubiao 普标, Vietnamese: Pu Péo) is a Tai–Kadai language spoken by the Qabiao people in northern Vietnam and Yunnan, China. Alternative names for Qabiao include Kabeo, Ka Beo, Ka Bao, Ka Biao, Laqua, Pubiao (Pupeo or Pu Péo) and Pen Ti Lolo (Bendi Lolo). The meaning of the name "Qabiao" is unknown.
in scheme: Lexvo - ISO 639-3 language codes
notation: laq

Larteh
type: Language
type: Concept
ISO 639-3 code: lar
alternative label: Larteh language
definition: Larteh is spoken 74,000 speakers in Ghana. The Lartehs, Kyiripons, are the main inhabitants of the mountanious parts of the Eastern region of Ghana. Of the Guans the ethnic group which the Lartehs or the Kyiripons belong} they are the largest tribe and have the most successful language to capture the minds of Ghanians. Due to the language's ability to adopt the accent of speaking, especially the Akuapem Twi, it is also known as Akuapem. The language is also related to Efutu, Buem, Nkonya, Sene, Belefo, etc. The Larteh towns extend from Larteh, Akropong, Abiriw, Adukrom, Awukugua, Aperede, Aseseeseo, Dawu, Boso, and Anum.
in scheme: Lexvo - ISO 639-3 language codes
notation: lar

Lama
type: Language
type: Concept
ISO 639-3 code: las
alternative label: Lama (Togo)
alternative label: Lama language
definition: Lama is a Gur language spoken in Togo, Benin, and by a few in Ghana.
in scheme: Lexvo - ISO 639-3 language codes
notation: las

Kuo
type: Language
type: Concept
ISO 639-3 code: xuo
alternative label: Kuo language
definition: Kuo (Koh) is an Mbum language of southern Chad and northern Cameroon.
in scheme: Lexvo - ISO 639-3 language codes
notation: xuo

Latin
type: Language
type: Concept
ISO 639-1 code: la
ISO 639-2 Bibliographical code: lat
ISO 639-2 Terminological code: lat
ISO 639-3 code: lat
alternative label: Latim @pt
alternative label: Latin language
alternative label: Latín @es
alternative label: Lingua latina @it
alternative label: latin @fr
definition: Latin (; Latin: , ) is an Italic language originally spoken in Latium and Ancient Rome. It, along with most European languages, is a descendant of the ancient Proto-Indo-European language. It originated in the Italian peninsula. Although it is considered a dead language, a number of scholars and members of the Christian clergy speak it fluently, and many schools and universities continue to teach it. Latin is still used in the creation of new words in modern languages of many different families, including English. Latin and its daughter Romance languages are the only surviving branch of the Italic language family. Other branches of the Italic languages are attested in documents surviving from early Italy, but were assimilated during the Roman Republic.
in scheme: Lexvo - ISO 639-3 language codes
notation: lat
preferred label: Latein @de
preferred label: latim @pt
preferred label: latino @it
preferred label: latín @es

Laba
type: Language
type: Concept
ISO 639-3 code: lau
in scheme: Lexvo - ISO 639-3 language codes
notation: lau

Latvian
type: Language
type: Concept
ISO 639-1 code: lv
ISO 639-2 Bibliographical code: lav
ISO 639-2 Terminological code: lav
ISO 639-3 code: lav
in scheme: Lexvo - ISO 639-3 language codes
notation: lav
preferred label: Lettisch @de
preferred label: letton @fr
preferred label: lettone @it
preferred label: letão @pt
preferred label: letón @es

Lauje
type: Language
type: Concept
ISO 639-3 code: law
in scheme: Lexvo - ISO 639-3 language codes
notation: law

Tiwa
type: Language
type: Concept
ISO 639-3 code: lax
in scheme: Lexvo - ISO 639-3 language codes
notation: lax

Lama
type: Language
type: Concept
ISO 639-3 code: lay
alternative label: Lama (Myanmar)
in scheme: Lexvo - ISO 639-3 language codes
notation: lay

Aribwatsa
type: Language
type: Concept
ISO 639-3 code: laz
alternative label: Aribwatsa language
definition: Aribwatsa, also known as Lae or Lahe, is an extinct member of the Busu subgroup of Lower Markham languages in the area of Lae, Morobe Province, Papua New Guinea. Descendents of the Aribwatsa language community have mostly switched to the Bukawa language, which is spoken all along the north coast of the Huon Gulf and in several villages on the south coast.
in scheme: Lexvo - ISO 639-3 language codes
notation: laz

Lui
type: Language
type: Concept
ISO 639-3 code: lba
in scheme: Lexvo - ISO 639-3 language codes
notation: lba

Label
type: Language
type: Concept
ISO 639-3 code: lbb
in scheme: Lexvo - ISO 639-3 language codes
notation: lbb

Lakkia
type: Language
type: Concept
ISO 639-3 code: lbc
alternative label: Lakkja language
definition: The Lakkja language (; also spelled Lakkia) is a Tai–Kadai language spoken in Jinxiu Yao Autonomous County, Laibin 来宾, east-central Guangxi, China. Lakkja people are also known as the Chashan Yao, or Tea Mountain Yao, since they were traditionally considered by neighboring peoples to be a Miao–Yao (Hmong–Mien) people. The name Lakkja means mountain people. All Lakkja dialects have 5 tones.
in scheme: Lexvo - ISO 639-3 language codes
notation: lbc
preferred label: Lakkja @fr

Lak
type: Language
type: Concept
ISO 639-3 code: lbe
alternative label: Lak language
definition: The Lak language (лакку маз, lakːu maz) is a Northeast Caucasian language forming its own branch within this family. It is the language of the Lak people from the Russian autonomous republic of Dagestan, where it is one of six standardized languages. It is spoken by about 157,000 people.
in scheme: Lexvo - ISO 639-3 language codes
notation: lbe
preferred label: Idioma lak @es
preferred label: Lakische Sprache @de
preferred label: Lingua lak @it
preferred label: Língua lak @pt

Upper Umpqua
type: Language
type: Concept
ISO 639-3 code: xup
alternative label: Umpqua, Upper
in scheme: Lexvo - ISO 639-3 language codes
notation: xup

Tinani
type: Language
type: Concept
ISO 639-3 code: lbf
in scheme: Lexvo - ISO 639-3 language codes
notation: lbf

Laopang
type: Language
type: Concept
ISO 639-3 code: lbg
in scheme: Lexvo - ISO 639-3 language codes
notation: lbg

La'bi
type: Language
type: Concept
ISO 639-3 code: lbi
in scheme: Lexvo - ISO 639-3 language codes
notation: lbi

Ladakhi
type: Language
type: Concept
ISO 639-3 code: lbj
alternative label: Ladakhi language
definition: The Ladakhi language , now also called Bhoti, and by linguists more generally called Western Archaic Tibetan when the Balti and Burig or Purig or Purki dialects are included, is the predominant language in the Ladakh region of the Jammu and Kashmir state of India, and is also spoken in Baltistan. Ladakhi is closely related to Tibetan, and the Ladakhi people share cultural similarities with Tibetans, including Tibetan Buddhism. There is disagreement as to whether they should be considered distinct languages , but Ladakhi and Central Tibetan are not mutually intelligible, though they share a written form dating back to Old Tibetan. Ladakhi has approximately 200,000 speakers in India, and perhaps 12,000 speakers in the Tibet region of China, mostly in the Changthang region. Ladakhi has several dialects, Ladakhi proper (also called Lehskat after the capital of Ladakh, Leh, where it is spoken); Shamskat, spoken to the northwest of Leh; Stotskat, spoken to the southeast in the Indus valley; and Nubra, spoken in the north. The varieties spoken in Upper Ladakh and Zangskar have many features of Ladakhi and many other features of western dialects of Central Tibetan.
in scheme: Lexvo - ISO 639-3 language codes
notation: lbj
preferred label: Ladakhische Sprache @de
preferred label: Lingua ladakhi @it
preferred label: Língua ladakhi @pt

Central Bontok
type: Language
type: Concept
ISO 639-3 code: lbk
alternative label: Bontok, Central
in scheme: Lexvo - ISO 639-3 language codes
notation: lbk

Libon Bikol
type: Language
type: Concept
ISO 639-3 code: lbl
alternative label: Bikol, Libon
in scheme: Lexvo - ISO 639-3 language codes
notation: lbl

Lodhi
type: Language
type: Concept
ISO 639-3 code: lbm
alternative label: Lodhi language
definition: Lodhi (Lodi, Lohi, Lozi) is a Munda language, or perhaps dialect cluster, of India that has been strongly influenced by neighboring Eastern Indic languages.
in scheme: Lexvo - ISO 639-3 language codes
notation: lbm

Lamet
type: Language
type: Concept
ISO 639-3 code: lbn
in scheme: Lexvo - ISO 639-3 language codes
notation: lbn

Urartian
type: Language
type: Concept
ISO 639-3 code: xur
alternative label: Urartian language
definition: Urartian, Vannic, and (in older literature) Chaldean are conventional names for the language spoken by the inhabitants of the ancient kingdom of Urartu that was located in the region of Lake Van, with its capital near the site of the modern town of Van, in the Armenian Highland, modern-day Eastern Anatolia region of Turkey. It was probably spoken by the majority of the population around Lake Van and in the areas along the upper Zab valley.
in scheme: Lexvo - ISO 639-3 language codes
notation: xur
preferred label: Lingua urartea @it
preferred label: Urartäische Sprache @de

Laven
type: Language
type: Concept
ISO 639-3 code: lbo
alternative label: Laven language
definition: Laven is a Mon–Khmer language of Laos.
in scheme: Lexvo - ISO 639-3 language codes
notation: lbo

Wampar
type: Language
type: Concept
ISO 639-3 code: lbq
in scheme: Lexvo - ISO 639-3 language codes
notation: lbq

Lohorung
type: Language
type: Concept
ISO 639-3 code: lbr
in scheme: Lexvo - ISO 639-3 language codes
notation: lbr

Libyan Sign Language
type: Language
type: Concept
ISO 639-3 code: lbs
in scheme: Lexvo - ISO 639-3 language codes
notation: lbs

Lachi
type: Language
type: Concept
ISO 639-3 code: lbt
in scheme: Lexvo - ISO 639-3 language codes
notation: lbt

Labu
type: Language
type: Concept
ISO 639-3 code: lbu
alternative label: Labu language
definition: Labu (called Hapa by its speakers) is an Austronesian language spoken by about 1,600 people (1989) in three older villages and one new one across the Markham River from Lae in Morobe Province, Papua New Guinea.
in scheme: Lexvo - ISO 639-3 language codes
notation: lbu

Lavatbura-Lamusong
type: Language
type: Concept
ISO 639-3 code: lbv
in scheme: Lexvo - ISO 639-3 language codes
notation: lbv

Tolaki
type: Language
type: Concept
ISO 639-3 code: lbw
in scheme: Lexvo - ISO 639-3 language codes
notation: lbw

Lawangan
type: Language
type: Concept
ISO 639-3 code: lbx
alternative label: Lawangan language
definition: Lawangan is an Austronesian language bellonging to East Barito languages. It is spoken by about 100 000 Lawangan people (subgroup of Dayak people) living in the central Kalimantan, Indonesia.
in scheme: Lexvo - ISO 639-3 language codes
notation: lbx

Lamu-Lamu
type: Language
type: Concept
ISO 639-3 code: lby
in scheme: Lexvo - ISO 639-3 language codes
notation: lby

Lardil
type: Language
type: Concept
ISO 639-3 code: lbz
alternative label: Lardil language
definition: Lardil (also spelled Leerdil or Leertil) is a moribund language spoken on Mornington Island (Kunhanha), in the Wellesley Islands of Queensland in northern Australia. Lardil is unusual among Australian languages in that it features a ceremonial register, called Damin (also Demiin). Damin is regarded by Lardil speakers as a separate language, and possesses the only phonological system outside Africa to use click consonants.
in scheme: Lexvo - ISO 639-3 language codes
notation: lbz

Legenyem
type: Language
type: Concept
ISO 639-3 code: lcc
in scheme: Lexvo - ISO 639-3 language codes
notation: lcc

Zerenkel
type: Language
type: Concept
ISO 639-3 code: zrn
alternative label: Zirenkel language
definition: Zirenkel is an Afro-Asiatic language spoken in Chad.
in scheme: Lexvo - ISO 639-3 language codes
notation: zrn

Lola
type: Language
type: Concept
ISO 639-3 code: lcd
alternative label: Lola language
definition: Lola is one of the Aru languages, spoken by inhabitants of the Aru Islands.
in scheme: Lexvo - ISO 639-3 language codes
notation: lcd

Kuthant
type: Language
type: Concept
ISO 639-3 code: xut
in scheme: Lexvo - ISO 639-3 language codes
notation: xut

Loncong
type: Language
type: Concept
ISO 639-3 code: lce
in scheme: Lexvo - ISO 639-3 language codes
notation: lce

Lubu
type: Language
type: Concept
ISO 639-3 code: lcf
in scheme: Lexvo - ISO 639-3 language codes
notation: lcf

Luchazi
type: Language
type: Concept
ISO 639-3 code: lch
alternative label: Lucazi language
definition: Lucazi or Luchazi (Chiluchazi) is a Bantu language of Angola and Zambia. It is closely related to Ngangela.
in scheme: Lexvo - ISO 639-3 language codes
notation: lch

Lisela
type: Language
type: Concept
ISO 639-3 code: lcl
alternative label: Lisela language
definition: Lisela , also called Li Enyorot, is an Austronesian language; as of 1989, it was spoken by about 11,900 Lisela people mostly living in the northern part of Indonesian island Buru . It is also preserved among the small Lisela community on the Ambon Island. Thus many sources regard Lisela as a dialect, though the most diverging, of Buru. Lisela had also borrowed much from the Sula language, as a result of the interaction between the Lisela and Sula people living together as the northern Buru coast. The language has no writing system. The most detailed study of Lisela language was conducted in the 1980s by Charles E. Grimes and Barbara Dix Grimes – Australian missionaries and ethnographers, active members of SIL International (they should not be confused with Joseph E. Grimes and Barbara F. Grimes, Charles' parents, also known Australian ethnographers).
in scheme: Lexvo - ISO 639-3 language codes
notation: lcl

Tungag
type: Language
type: Concept
ISO 639-3 code: lcm
in scheme: Lexvo - ISO 639-3 language codes
notation: lcm

Western Lawa
type: Language
type: Concept
ISO 639-3 code: lcp
alternative label: Lawa, Western
in scheme: Lexvo - ISO 639-3 language codes
notation: lcp

Luhu
type: Language
type: Concept
in scheme: Lexvo - ISO 639-3 language codes

Kxoe
type: Language
type: Concept
ISO 639-3 code: xuu
in scheme: Lexvo - ISO 639-3 language codes
notation: xuu

Lisabata-Nuniali
type: Language
type: Concept
ISO 639-3 code: lcs
in scheme: Lexvo - ISO 639-3 language codes
notation: lcs

Kla-Dan
type: Language
type: Concept
in scheme: Lexvo - ISO 639-3 language codes

Dũya
type: Language
type: Concept
ISO 639-3 code: ldb
alternative label: Idun language
definition: Idun (Adong, Lungu, Ungu) is a poorly attested Plateau language of Nigeria. Its classification is uncertain, but may be closest to Ashe.
in scheme: Lexvo - ISO 639-3 language codes
notation: ldb

Luri
type: Language
type: Concept
ISO 639-3 code: ldd
in scheme: Lexvo - ISO 639-3 language codes
notation: ldd

Lenyima
type: Language
type: Concept
ISO 639-3 code: ldg
in scheme: Lexvo - ISO 639-3 language codes
notation: ldg

Lamja-Dengsa-Tola
type: Language
type: Concept
ISO 639-3 code: ldh
in scheme: Lexvo - ISO 639-3 language codes
notation: ldh

Laari
type: Language
type: Concept
ISO 639-3 code: ldi
in scheme: Lexvo - ISO 639-3 language codes
notation: ldi

Venetic
type: Language
type: Concept
ISO 639-3 code: xve
alternative label: Venetic language
definition: Venetic is an extinct Indo-European language that was spoken in ancient times in the North East of Italy (Veneto) and part of modern Slovenia, between the Po River delta and the southern fringe of the Alps.
in scheme: Lexvo - ISO 639-3 language codes
notation: xve
preferred label: Idioma venético @es
preferred label: Lingua venetica @it
preferred label: Venetische Sprache @de
preferred label: Vénète @fr

Lemoro
type: Language
type: Concept
ISO 639-3 code: ldj
alternative label: Lemoro language
definition: Lemoro is a Kainji language of Nigeria.
in scheme: Lexvo - ISO 639-3 language codes
notation: ldj

Leelau
type: Language
type: Concept
ISO 639-3 code: ldk
alternative label: Leelau language
definition: Leelau, one of the languages of the Bikwin people, is an Adamawa language of Nigeria.
in scheme: Lexvo - ISO 639-3 language codes
notation: ldk

Kaan
type: Language
type: Concept
ISO 639-3 code: ldl
alternative label: Kaan language
definition: Kaan, Libo, is an Adamawa language of Nigeria.
in scheme: Lexvo - ISO 639-3 language codes
notation: ldl

Landoma
type: Language
type: Concept
ISO 639-3 code: ldm
alternative label: Landoma language
definition: Landoma (Landouman, Landuma), or Cocoli, is a language of western Guinea. It is the most populous of the Baga languages, in the Mel branch of the Niger–Congo language family. It is related to Temne of Sierra Leone.
in scheme: Lexvo - ISO 639-3 language codes
notation: ldm

Láadan
type: Language
type: Concept
ISO 639-3 code: ldn
definition: Láadan is a constructed language created by Suzette Haden Elgin in 1982 to test the Sapir–Whorf Hypothesis, specifically to determine if development of a language aimed at expressing the views of women would shape a culture; a subsidiary hypothesis was that Western natural languages may be better suited for expressing the views of men than women. The language was included in her science fiction Native Tongue series. Láadan contains a number of words that are used to make unambiguous statements that include how one feels about what one is saying. According to Elgin, this is designed to counter male-centered language's limitations on women, who are forced to respond "I know I said that, but I meant this".
in scheme: Lexvo - ISO 639-3 language codes
notation: ldn

Loo
type: Language
type: Concept
ISO 639-3 code: ldo
alternative label: Loo language
definition: Loo, or Shụŋọ, is an Adamawa language of Nigeria.
in scheme: Lexvo - ISO 639-3 language codes
notation: ldo

Tso
type: Language
type: Concept
ISO 639-3 code: ldp
alternative label: Tso language
definition: Tso (Tsóbó, Lotsu, Cibbo) is one of the Savanna languages of eastern Nigeria.
in scheme: Lexvo - ISO 639-3 language codes
notation: ldp

Lufu
type: Language
type: Concept
ISO 639-3 code: ldq
alternative label: Lufu language
definition: The Lufu language of Nigeria is a language still spoken mostly by older adults among the Lufu people of the Takum Local Government Authority, Taraba State; its speakers have mostly shifted to Jukun. It is reported to have been close to Bete and Bibi. According to the Vienna , it and Bete probably belong together in the Southern Jukunoid branch of Niger–Congo; Ethnologue notes this but leaves it unclassified.
in scheme: Lexvo - ISO 639-3 language codes
notation: ldq

Lega-Shabunda
type: Language
type: Concept
ISO 639-3 code: lea
in scheme: Lexvo - ISO 639-3 language codes
notation: lea

Lala-Bisa
type: Language
type: Concept
ISO 639-3 code: leb
alternative label: Lala-Bisa language
definition: Lala-Bisa is a Bantu language of Zambia that is closely related to Bemba.
in scheme: Lexvo - ISO 639-3 language codes
notation: leb

Leco
type: Language
type: Concept
ISO 639-3 code: lec
alternative label: Leco language
definition: Leco is a language isolate that, though long reported to be extinct, is spoken by 20–40 individuals in areas east of Lake Titicaca, Bolivia. The Leco ethnic population is about 80.
in scheme: Lexvo - ISO 639-3 language codes
notation: lec
preferred label: Idioma leco @es
preferred label: Leko @fr

Lendu
type: Language
type: Concept
ISO 639-3 code: led
alternative label: Lendu language
definition: The Lendu, or Balendru, are an ethno-linguistic agriculturalist group residing in eastern Democratic Republic of Congo in the area west and northwest of Lake Albert, in particular the Ituri region of Orientale province. Their language is one of the most populous of the Central Sudanic languages. There are three-quarters of a million Lendu speakers in the DRC, and 10,000 more in Uganda. A conflict between the Lendu and Hema people was the basis of the Ituri conflict.
in scheme: Lexvo - ISO 639-3 language codes
notation: led
preferred label: Língua lendu @pt

Lyélé
type: Language
type: Concept
ISO 639-3 code: lee
alternative label: Lyélé language
definition: The Lyélé language (Lele) is spoken in the Sanguié Province of Burkina Faso by approximately 130,000 people known as Lyéla, Léla, Gourounsi or Gurunsi. It is spoken in the towns of Réo, Kyon, Tenado, Dassa, Didyr, Godyr, Kordié, Pouni and Zawara. The language is also sometimes known by the wider term Gurunsi.
in scheme: Lexvo - ISO 639-3 language codes
notation: lee

Lelemi
type: Language
type: Concept
ISO 639-3 code: lef
alternative label: Lelemi language
definition: Lelemi or Lefana (Lε-lεmi, Lε-fana) is spoken by the Buem people in the mountainous Volta Region of Ghana. It belongs to the geographic group of Ghana Togo Mountain languages (traditionally called the Togorestsprachen or Togo Remnant languages) of the Kwa branch of Niger–Congo.
in scheme: Lexvo - ISO 639-3 language codes
notation: lef

Lengua
type: Language
type: Concept
ISO 639-3 code: leg
alternative label: Enxet language
definition: Enxet, traditionally known as Lengua, is a language of the Paraguayan Chaco.
in scheme: Lexvo - ISO 639-3 language codes
notation: leg

Kamviri
type: Language
type: Concept
ISO 639-3 code: xvi
alternative label: Kamviri dialect
definition: Kamviri is a dialect of the Kamkata-viri language spoken by 5,000 to 10,000 of the Kom people of Afghanistan and Pakistan. There are slight dialectal differences of the Kamviri speakers of Pakistan. The most used alternative names are Kati, Kamozi or Bashgali.
in scheme: Lexvo - ISO 639-3 language codes
notation: xvi

Lenje
type: Language
type: Concept
ISO 639-3 code: leh
in scheme: Lexvo - ISO 639-3 language codes
notation: leh

Lemio
type: Language
type: Concept
ISO 639-3 code: lei
in scheme: Lexvo - ISO 639-3 language codes
notation: lei

Lengola
type: Language
type: Concept
ISO 639-3 code: lej
alternative label: Lengola language
definition: Lengola (Lengora) is a Bantu language of the Democratic Republic of the Congo. It is not close to other Bantu languages. It may be closest to some of the D.30 languages in a group called "Lebonya".
in scheme: Lexvo - ISO 639-3 language codes
notation: lej

Leipon
type: Language
type: Concept
ISO 639-3 code: lek
in scheme: Lexvo - ISO 639-3 language codes
notation: lek

Lele
type: Language
type: Concept
ISO 639-3 code: lel
alternative label: Lele (Democratic Republic of Congo)
alternative label: Lele language
definition: Lele (also spelled Bashilele, Usilele) is a language spoken mainly in the west edge of the Kasai-Occidental Province, in Ilebo and Tshikapa territories; the extreme east of the Bandundu Province, in Idiofa and Gungu territories of the Democratic Republic of the Congo.
in scheme: Lexvo - ISO 639-3 language codes
notation: lel

Nomaande
type: Language
type: Concept
ISO 639-3 code: lem
in scheme: Lexvo - ISO 639-3 language codes
notation: lem

Lenca
type: Language
type: Concept
ISO 639-3 code: len
alternative label: Lenca language
definition: The Lenca language is one of the indigenous Mesoamerican languages. At the time of the Spanish conquest of Central America in the early 16th century, it was spoken by the Lenca people in a region that incorporates northwestern and southwestern Honduras, and neighboring eastern El Salvador, east of the Lempa river. Today is still spoken mostly by Lenca Indigenous People in the mountains of the central state of Yoro, and Francisco Morazan (particularly in the Montana de la Flor region). While the Lenca people continue to live in the same region today, Lyle Campbell reported in the 1970s that he found only 1 speaker of the language in Chilanga, El Salvador, and none in Honduras; the language though reportedly extinct, is used by the Lenca People of central Honduras, who due to persecution by the Honduran army in the 1980s and 1990s, who violently repressed them due to their fighting for a more equitable distribution of land and a fair agrarian reform, chose not to speak it for a long time to avoid being easily identified by their persecutors. Campbell concluded however, that Salvadoran Lenca was a distinct dialect from Honduran Lenca.
in scheme: Lexvo - ISO 639-3 language codes
notation: len
preferred label: Langues lencas @fr
preferred label: Lenguas lencas @es
preferred label: Língua lenca @pt

Leti
type: Language
type: Concept
ISO 639-3 code: leo
alternative label: Leti (Cameroon)
in scheme: Lexvo - ISO 639-3 language codes
notation: leo

Lepcha
type: Language
type: Concept
ISO 639-3 code: lep
alternative label: Lepcha language
definition: Lepcha language, or Róng language (Lepcha: ; Róng ríng), is a Himalayish language spoken by the Lepcha people in Sikkim and parts of West Bengal, Nepal and Bhutan.
in scheme: Lexvo - ISO 639-3 language codes
notation: lep

Lembena
type: Language
type: Concept
ISO 639-3 code: leq
alternative label: Lembena language
definition: Lembena, also known as Lembena Pii, Nanimba Pii, Uyalipa Pii, or Wapi Pii, is an Engan language spoken in Papua New Guinea. There are 1,760 speakers of the languages, of which 750 are monolingual.
in scheme: Lexvo - ISO 639-3 language codes
notation: leq

Lenkau
type: Language
type: Concept
ISO 639-3 code: ler
in scheme: Lexvo - ISO 639-3 language codes
notation: ler

Lese
type: Language
type: Concept
ISO 639-3 code: les
in scheme: Lexvo - ISO 639-3 language codes
notation: les

Vandalic
type: Language
type: Concept
ISO 639-3 code: xvn
alternative label: Vandalic language
definition: Vandalic was a Germanic language probably closely related to Gothic. The Vandals, Hasdingi and Silingi established themselves in Gallaecia (Northern Portugal and Galicia) and in Southern Spain, following other Germanic and non-Germanic peoples (Visigoths, Alans and Suevi), before moving to North Africa in AD 429.
in scheme: Lexvo - ISO 639-3 language codes
notation: xvn
preferred label: Idioma vándalo @es
preferred label: Lingua vandalica @it
preferred label: Vandale @fr
preferred label: Vandalische Sprache @de

Amio-Gelimi
type: Language
type: Concept
ISO 639-3 code: let
alternative label: Lesing-Gelimi
in scheme: Lexvo - ISO 639-3 language codes
notation: let

Kara
type: Language
type: Concept
ISO 639-3 code: leu
alternative label: Kara (Papua New Guinea)
alternative label: Kara language
definition: Kara (also Lemusmus or Lemakot) is an Austronesian language spoken by about 5,000 people in the Kavieng District of New Ireland Province, Papua New Guinea.
in scheme: Lexvo - ISO 639-3 language codes
notation: leu

Lamma
type: Language
type: Concept
ISO 639-3 code: lev
alternative label: Western Pantar language
definition: Western Pantar (also known as Lamma) is a Papuan language spoken in the western part of Pantar island in the Alor archipelago of Indonesia. Western Pantar is spoken widely in the region by about 10,000 speakers.
in scheme: Lexvo - ISO 639-3 language codes
notation: lev

Ledo Kaili
type: Language
type: Concept
ISO 639-3 code: lew
alternative label: Kaili, Ledo
definition: Ledo Kaili is the largest member of the Kaili languages, are a dialect chain within the Kaili–Pamona languages which are spoken in Central Sulawesi (Indonesia). Altogether, Kaili is one of the largest languages in Sulawesi. One third of the population of Sulawesi Tengah province were (1979) native speakers of a Kaili language. Object language of this article is the main dialect Ledo, which is spoken in the district (Kabupaten) Donggala in and around the provincial capital Palu.
in scheme: Lexvo - ISO 639-3 language codes
notation: lew
preferred label: Kaili @de

Luang
type: Language
type: Concept
ISO 639-3 code: lex
in scheme: Lexvo - ISO 639-3 language codes
notation: lex

Lemolang
type: Language
type: Concept
ISO 639-3 code: ley
in scheme: Lexvo - ISO 639-3 language codes
notation: ley

Lezghian
type: Language
type: Concept
ISO 639-2 Bibliographical code: lez
ISO 639-2 Terminological code: lez
ISO 639-3 code: lez
alternative label: Lesgische Sprache @de
alternative label: Lezgian language
alternative label: Lingua lezgi @it
alternative label: Língua lezgui @pt
alternative label: lezghiano @pt
alternative label: lezghien @fr
definition: Lezgian, also called Lezgi or Lezgin, is a language that belongs to the Lezgic languages. It is spoken by the Lezgins, who live in southern Dagestan and northern Azerbaijan. Lezgian is a literary language and an official language of Dagestan. It is classified as "vulnerable" by UNESCOs Atlas of the Worlds Languages in Danger.
in scheme: Lexvo - ISO 639-3 language codes
notation: lez
preferred label: Lesgisch @de
preferred label: Lezguien @fr
preferred label: lezghian @it
preferred label: lezgiano @es

Lefa
type: Language
type: Concept
ISO 639-3 code: lfa
alternative label: Fa’ language
definition: The Fa’ language, Lefa’ (also Fak or Lefa), is one of the Bantu languages of Cameroon.
in scheme: Lexvo - ISO 639-3 language codes
notation: lfa

Lingua Franca Nova
type: Language
type: Concept
ISO 639-3 code: lfn
definition: Lingua Franca Nova (abbreviated LFN) is an auxiliary constructed language created by Dr. C. George Boeree of Shippensburg University, Pennsylvania. Its vocabulary is based on the Romance languages French, Italian, Portuguese, Spanish, and Catalan. The grammar is highly reduced and similar to the Romance creoles. The language has phonemic spelling, using 22 letters of either the Latin or Cyrillic scripts.
in scheme: Lexvo - ISO 639-3 language codes
notation: lfn
preferred label: Lingua franca nova @fr

Lungga
type: Language
type: Concept
ISO 639-3 code: lga
alternative label: Lungga language
definition: Lungga (also spelled Luga, Luqa) is a Malayo-Polynesian language spoken in the Solomon Islands.
in scheme: Lexvo - ISO 639-3 language codes
notation: lga

Laghu
type: Language
type: Concept
ISO 639-3 code: lgb
alternative label: Laghu language
definition: Laghu (pronounced Lagoo), also known as Hoatana or Katova, is an extinct language of Santa Isabel in the Solomon Islands. Its last speaker died in 1984. People in the villages of Baolo and Samasodu, where it used to be spoken, now speak the neighboring Zabana language, which is more widely spoken and still expanding (Palmer 2009:1-2).
in scheme: Lexvo - ISO 639-3 language codes
notation: lgb
preferred label: Idioma Laghu @es

Lugbara
type: Language
type: Concept
ISO 639-3 code: lgg
in scheme: Lexvo - ISO 639-3 language codes
notation: lgg

Laghuu
type: Language
type: Concept
ISO 639-3 code: lgh
alternative label: Laghuu language
definition: Laghuu is a Loloish language spoken in northwestern Vietnam in a single village in Lao Cai Province.
in scheme: Lexvo - ISO 639-3 language codes
notation: lgh

Lengilu
type: Language
type: Concept
ISO 639-3 code: lgi
in scheme: Lexvo - ISO 639-3 language codes
notation: lgi

Lingarak
type: Language
type: Concept
ISO 639-3 code: lgk
alternative label: Neverver
in scheme: Lexvo - ISO 639-3 language codes
notation: lgk

Volscian
type: Language
type: Concept
ISO 639-3 code: xvo
alternative label: Volscian language
definition: Volscian was a Sabellic Italic language, which was spoken by the Volsci and closely related to Oscan and Umbrian.
in scheme: Lexvo - ISO 639-3 language codes
notation: xvo
preferred label: Língua volsca @pt

Wala
type: Language
type: Concept
ISO 639-3 code: lgl
alternative label: Wala language
definition: The Wala language is a language of the Solomon Islands. Its alternate name is Langalanga
in scheme: Lexvo - ISO 639-3 language codes
notation: lgl
preferred label: Idioma wala @es

Lega-Mwenga
type: Language
type: Concept
ISO 639-3 code: lgm
in scheme: Lexvo - ISO 639-3 language codes
notation: lgm

Opuuo
type: Language
type: Concept
ISO 639-3 code: lgn
alternative label: Opuuo language
definition: The Opuuo language is a Nilo-Saharan language spoken by the Shita of Ethiopia and South Sudan. It is a member of the Koman languages, and has a lexical similarity of 24% with Komo. The language is also called Opo-Shita, Opo, Opuo, Cita, Ciita, Shita, Shiita, Ansita, Kina, and Kwina. "Langa" is a derogatory term for its speakers used by the Anuak.
in scheme: Lexvo - ISO 639-3 language codes
notation: lgn
preferred label: Opo @fr

Logba
type: Language
type: Concept
ISO 639-3 code: lgq
alternative label: Logba language
definition: Logba is a Kwa language spoken in the south-eastern Ghana by approximately 7 500 people. The Logba people call themselves and their language Ikpana, which means ‘defenders of truth’. Logba is different from Lukpa of Togo and Benin, which is also sometimes referred to as Logba.
in scheme: Lexvo - ISO 639-3 language codes
notation: lgq

Lengo
type: Language
type: Concept
ISO 639-3 code: lgr
in scheme: Lexvo - ISO 639-3 language codes
notation: lgr

Pahi
type: Language
type: Concept
ISO 639-3 code: lgt
in scheme: Lexvo - ISO 639-3 language codes
notation: lgt

Longgu
type: Language
type: Concept
ISO 639-3 code: lgu
in scheme: Lexvo - ISO 639-3 language codes
notation: lgu

Ligenza
type: Language
type: Concept
ISO 639-3 code: lgz
in scheme: Lexvo - ISO 639-3 language codes
notation: lgz

Laha
type: Language
type: Concept
ISO 639-3 code: lha
alternative label: Laha (Viet Nam)
alternative label: Laha language
definition: Laha (Chinese: 拉哈, Vietnamese: La Ha) is a Kra language spoken by approximately 1,400 people out of a total population of 5,686 Laha. It is spoken in Lào Cai and Sơn La provinces, Vietnam. Laha dialects had been documented in 1986 by Russian linguists and in 1996 by American linguist Jerold A. Edmondson. Many Laha can also converse in the Khmu language, and Laha-speaking areas also have significant Black Thai (Tai Dam), Kháng, Ksongmul (Ksingmul, Xinh-mun), and Hmong populations.
in scheme: Lexvo - ISO 639-3 language codes
notation: lha

Laha
type: Language
type: Concept
ISO 639-3 code: lhh
alternative label: Laha (Indonesia)
in scheme: Lexvo - ISO 639-3 language codes
notation: lhh

Lahu Shi
type: Language
type: Concept
ISO 639-3 code: lhi
in scheme: Lexvo - ISO 639-3 language codes
notation: lhi

Lahul Lohar
type: Language
type: Concept
ISO 639-3 code: lhl
alternative label: Lohar, Lahul
in scheme: Lexvo - ISO 639-3 language codes
notation: lhl

Vestinian
type: Language
type: Concept
ISO 639-3 code: xvs
alternative label: Vestinian language
definition: Vestinian is a scholarly term referring to an extinct Indo-European language documented only in two surviving inscriptions of the Roman Republic. It is presumed to have been anciently spoken by the tribe of the Vestini, who occupied the region within current Abruzzo from Gran Sasso to the Adriatic Sea in east-central Italy during that time. Vestini is the Roman exonym for the people. Not enough of their presumed language survives to classify it beyond Italic. Vestinian is one of a number of scantily attested Italic languages spoken in small regions of the Appennines directly east of Rome called generally "the minor dialects." There is currently no agreement on their precise classification.
in scheme: Lexvo - ISO 639-3 language codes
notation: xvs
preferred label: Dialetto vestino @it
preferred label: Idioma vestino @es

Lhomi
type: Language
type: Concept
ISO 639-3 code: lhm
in scheme: Lexvo - ISO 639-3 language codes
notation: lhm

Lahanan
type: Language
type: Concept
ISO 639-3 code: lhn
in scheme: Lexvo - ISO 639-3 language codes
notation: lhn

Lhokpu
type: Language
type: Concept
ISO 639-3 code: lhp
alternative label: Lhokpu language
definition: Lhokpu, also Lhobikha or Taba-Damey-Bikha, is one of the autochthonous languages of Bhutan spoken by the Lhop people. It is spoken in southwestern Bhutan along the border of Samtse and Chukha Districts. Van Driem (2003) leaves it unclassified as a separate branch within the Tibeto-Burman language family.
in scheme: Lexvo - ISO 639-3 language codes
notation: lhp

Mlahsö
type: Language
type: Concept
ISO 639-3 code: lhs
alternative label: Mlahsô language
definition: Mlahsô (Syriac: ܡܠܚܬܝܐ) is a Modern West Syriac language, a dialect of Aramaic. It was traditionally spoken in eastern Turkey and north-eastern Syria by members of the Assyrian/Syriac people.
in scheme: Lexvo - ISO 639-3 language codes
notation: lhs

Lo-Toga
type: Language
type: Concept
ISO 639-3 code: lht
alternative label: Lo-Toga language
definition: Lo-Toga is an Oceanic language spoken in the Torres islands of Vanuatu.
in scheme: Lexvo - ISO 639-3 language codes
notation: lht
preferred label: Lo-toga @fr

Lahu
type: Language
type: Concept
ISO 639-3 code: lhu
in scheme: Lexvo - ISO 639-3 language codes
notation: lhu

West-Central Limba
type: Language
type: Concept
ISO 639-3 code: lia
alternative label: Limba, West-Central
in scheme: Lexvo - ISO 639-3 language codes
notation: lia

Likum
type: Language
type: Concept
ISO 639-3 code: lib
alternative label: Likum language
definition: The Likum language is a West Manus language spoken by approximately 80 people in western Manus Island, Manus Province of Papua New Guinea. Its speakers also use Nyindrou. It has SVO word order.
in scheme: Lexvo - ISO 639-3 language codes
notation: lib

Hlai
type: Language
type: Concept
ISO 639-3 code: lic
in scheme: Lexvo - ISO 639-3 language codes
notation: lic

Nyindrou
type: Language
type: Concept
ISO 639-3 code: lid
alternative label: Nyindrou language
definition: The Nyindrou language is a West Manus language spoken by approximately 4200 people in the westernmost part of Manus Island, Manus Province of Papua New Guinea. It has SVO word order.
in scheme: Lexvo - ISO 639-3 language codes
notation: lid

Likila
type: Language
type: Concept
ISO 639-3 code: lie
in scheme: Lexvo - ISO 639-3 language codes
notation: lie

Idioma limbu
type: Language
type: Concept
ISO 639-3 code: lif
alternative label: Limbu language
definition: Limbu is a Tibeto-Burman language spoken in Nepal, Bhutan, Sikkim, Kashmir and Darjeeling district, West Bengal, India, by the Limbu community. Virtually all Limbus are bilingual in Nepali.
in scheme: Lexvo - ISO 639-3 language codes
notation: lif
preferred label: Limbu

Ligbi
type: Language
type: Concept
ISO 639-3 code: lig
alternative label: Ligbi language
definition: Ligbi (or Ligby) is a Mande language spoken in Ghana in the north-west corner of the Brong-Ahafo region. Ligbi is spoken by approximately 10 000 speakers (1988 GILLBT/SIL). It is fairly closely related to Jula, Vai and Kono. A small population of Ligbi speakers (4 000) is reported to live in Côte dIvoire (Vanderaa 1991). Ligbi is also known as Wela, Hwela or Numu. The latter of these refers to a subsection of the Ligbi people; Numu is Dyula for blacksmith'. (See blacksmiths of western Africa.)
in scheme: Lexvo - ISO 639-3 language codes
notation: lig

Kwaza
type: Language
type: Concept
ISO 639-3 code: xwa
alternative label: Kwaza language
definition: Kwaza (also written Kwazá or Koaiá) is an endangered, unclassified language spoken by the Kwaza people of Brazil. there were only 25 known speakers living in close proximity with neighbouring speakers of the Aikanã and Nambikwaran languages, though over half of these were children.
in scheme: Lexvo - ISO 639-3 language codes
notation: xwa
preferred label: Idioma kwazá @es

Lihir
type: Language
type: Concept
ISO 639-3 code: lih
alternative label: Lihir language
definition: The Lihir language is an Austronesian language spoken in the Lihir island group, in New Ireland Province, Papua New Guinea. It is notable for having 5 levels of grammatical number: singular, dual, trial, paucal and plural. It is questionable whether the trial is indeed trial or whether it is paucal, leaving there being a paucal and a greater paucal. Either way, this is the highest number of levels of grammatical number in any language. This distinction appears in both independent pronouns and possessor suffixes. There is some variation in pronunciation and orthography between the main island Niolam, and some of the smaller islands in the group.
in scheme: Lexvo - ISO 639-3 language codes
notation: lih
preferred label: Língua lihir @pt

Lingkhim
type: Language
type: Concept
ISO 639-3 code: lii
in scheme: Lexvo - ISO 639-3 language codes
notation: lii

Ligurian
type: Language
type: Concept
ISO 639-3 code: lij
alternative label: Monégasque dialect
definition: Monégasque (natively Munegascu) is a dialect of the modern Ligurian language, spoken in Monaco.
in scheme: Lexvo - ISO 639-3 language codes
notation: lij
preferred label: Dialetto monegasco @it
preferred label: Idioma monegasco @es
preferred label: Língua monegasca @pt
preferred label: Monegassische Sprache @de
preferred label: Monégasque @fr

Lika
type: Language
type: Concept
ISO 639-3 code: lik
alternative label: Lika language
definition: Lika (Liko) is a poorly documented Congolese Bantu language of uncertain affiliation, though it has been included in Boan.
in scheme: Lexvo - ISO 639-3 language codes
notation: lik

Lillooet
type: Language
type: Concept
ISO 639-3 code: lil
alternative label: Lillooet language
definition: Lillooet or Lilloet, also known as St’át’imcets , is the Interior Salishan language of the St’át’imc, spoken in southern British Columbia, Canada around the middle Fraser and Lillooet rivers. The dialect of the Lower Lillooet people uses the name Ucwalmícwts as St’át’imcets properly means "the language of the people of Sat’, i.e. the Upper Lillooet of the Fraser River.
in scheme: Lexvo - ISO 639-3 language codes
notation: lil
preferred label: St'at'imcets @fr

Limburgan
type: Language
type: Concept
ISO 639-1 code: li
ISO 639-2 Bibliographical code: lim
ISO 639-2 Terminological code: lim
ISO 639-3 code: lim
alternative label: Idioma limburgués @es
alternative label: Limburger
alternative label: Limburgish
alternative label: Limburgish language
alternative label: Lingua limburghese @it
alternative label: Língua limburguesa @pt
alternative label: limbourgeois @fr
definition: Limburgish, also called Limburgian or Limburgic (Limburgish: Lèmbörgs [] Dutch: Limburgs , German: Limburgisch , French: Limbourgeois ) is a group of East Low Franconian language varieties spoken in the Limburg and Rhineland regions, near the common Dutch / Belgian / German border. The area in which it is spoken roughly fits within a wide circle from Venlo to Düsseldorf to Aachen to Maastricht to Hasselt and back to Tienen. In some parts of this area it is generally used as the colloquial language in daily speech.
in scheme: Lexvo - ISO 639-3 language codes
notation: lim
preferred label: Limbourgeois @fr
preferred label: Limburgisch @de
preferred label: limburgese @it
preferred label: limburgués @es
preferred label: limburguês @pt

Lingala
type: Language
type: Concept
ISO 639-1 code: ln
ISO 639-2 Bibliographical code: lin
ISO 639-2 Terminological code: lin
ISO 639-3 code: lin
alternative label: Idioma lingala @es
alternative label: Lingala language
alternative label: Lingua lingala @it
alternative label: Lingála @de
alternative label: Língua lingala @pt
preferred label: lingala @es
definition: :"Ngala language" redirects here. For Ba-Ngala, see Bangala language. Lingala, or Ngala, is a Bantu language spoken throughout the northwestern part of the Democratic Republic of the Congo and a large part of the Republic of the Congo, as well as to some degree in Angola and the Central African Republic. It has over 10 million speakers. It is classified C.36D under the Guthrie system for classifying Bantu languages and C.40 under the SIL system.
in scheme: Lexvo - ISO 639-3 language codes
notation: lin

Liki
type: Language
type: Concept
ISO 639-3 code: lio
in scheme: Lexvo - ISO 639-3 language codes
notation: lio

Sekpele
type: Language
type: Concept
ISO 639-3 code: lip
alternative label: Likpe language
definition: Likpe or Sekpele (also Bosele, Mu) is spoken in the mountainous central part of the Volta Region of Ghana. It belongs to the geographic group of Ghana Togo Mountain languages (traditionally called the Togorestsprachen or Togo Remnant languages) of the Kwa branch of Niger–Congo.
in scheme: Lexvo - ISO 639-3 language codes
notation: lip

Libido
type: Language
type: Concept
ISO 639-3 code: liq
alternative label: Libido language
definition: Libido (also known as Mareqo, Marako) is an Afro-Asiatic language of Ethiopia, which is spoken in the Gurage Zone of the Southern Nations, Nationalities, and People's Region, north-east of Hosaena.
in scheme: Lexvo - ISO 639-3 language codes
notation: liq

Liberian English
type: Language
type: Concept
ISO 639-3 code: lir
alternative label: English, Liberian
in scheme: Lexvo - ISO 639-3 language codes
notation: lir

Lisu
type: Language
type: Concept
ISO 639-3 code: lis
alternative label: Lisu language
definition: Lisu (Lisu: ꓡꓲ-ꓢꓴ; , ) is a tonal Tibeto-Burman language spoken in Yunnan (southwestern China), northern Burma (Myanmar), and Thailand and a small part of India. Along with Lipo, it is one of two languages of the Lisu people. Lisu has many dialects that originate from the country in which they live. Hua Lisu, Pai Lisu, and Lu Shi Lisu dialects are spoken in China. Although they are mutually intelligible, some have many more loan words from other languages than others.
in scheme: Lexvo - ISO 639-3 language codes
notation: lis

Lithuanian
type: Language
type: Concept
ISO 639-1 code: lt
ISO 639-2 Bibliographical code: lit
ISO 639-2 Terminological code: lit
ISO 639-3 code: lit
alternative label: Idioma lituano @es
alternative label: Lingua lituana @it
alternative label: Litauische Sprache @de
alternative label: Lithuanian language
alternative label: Lituanien @fr
alternative label: Língua lituana @pt
definition: Lithuanian (lietuvių kalba) is the official state language of Lithuania and is recognized as one of the official languages of the European Union. There are about 2.9 million native Lithuanian speakers in Lithuania and about 300 000 abroad. Lithuanian is a Baltic language, closely related to Latvian, although they are not mutually intelligible. It is written in an adapted version of the Roman script. The Lithuanian language is believed to be the most conservative living Indo-European language, retaining many features of Proto Indo-European now lost in other Indo-European languages.
in scheme: Lexvo - ISO 639-3 language codes
notation: lit
preferred label: Litauisch @de
preferred label: lituanien @fr
preferred label: lituano @es

Woccon
type: Language
type: Concept
ISO 639-3 code: xwc
alternative label: Woccon language
definition: Woccon was one of two Catawban Eastern Siouan languages of the eastern US, which together with the Western Siouan languages formed the Siouan language family. It is attested only in a vocabulary of 143 words printed in 1709.
in scheme: Lexvo - ISO 639-3 language codes
notation: xwc

Logorik
type: Language
type: Concept
ISO 639-3 code: liu
in scheme: Lexvo - ISO 639-3 language codes
notation: liu

Liv
type: Language
type: Concept
ISO 639-3 code: liv
alternative label: Livonian language
definition: Livonian ( or ) belongs to the Finnic branch of the Uralic languages. It is a nearly extinct language, with one of its last native speakers having died in February 2009. It is closely related to Estonian. The native land of the Livonian people is Livonia, located in Latvia, in the north of the Kurzeme peninsula.
in scheme: Lexvo - ISO 639-3 language codes
notation: liv
preferred label: Idioma livonio @es
preferred label: Lingua livone @it
preferred label: Live @fr
preferred label: Livische Sprache @de
preferred label: Língua livoniana @pt

Col
type: Language
type: Concept
ISO 639-3 code: liw
in scheme: Lexvo - ISO 639-3 language codes
notation: liw

Liabuku
type: Language
type: Concept
ISO 639-3 code: lix
in scheme: Lexvo - ISO 639-3 language codes
notation: lix

Banda-Bambari
type: Language
type: Concept
ISO 639-3 code: liy
in scheme: Lexvo - ISO 639-3 language codes
notation: liy

Libinza
type: Language
type: Concept
ISO 639-3 code: liz
in scheme: Lexvo - ISO 639-3 language codes
notation: liz

Golpa
type: Language
type: Concept
in scheme: Lexvo - ISO 639-3 language codes

Rampi
type: Language
type: Concept
ISO 639-3 code: lje
in scheme: Lexvo - ISO 639-3 language codes
notation: lje

Laiyolo
type: Language
type: Concept
ISO 639-3 code: lji
in scheme: Lexvo - ISO 639-3 language codes
notation: lji

Li'o
type: Language
type: Concept
ISO 639-3 code: ljl
in scheme: Lexvo - ISO 639-3 language codes
notation: ljl

Lampung Api
type: Language
type: Concept
ISO 639-3 code: ljp
alternative label: Lampung language
definition: Lampung Api commonly known as Lampung is the name of an ethnic group and its language that is spoken in the Indonesian province of Lampung in south Sumatra. The amount of speakers is estimated at about 1,500,000.
in scheme: Lexvo - ISO 639-3 language codes
notation: ljp
preferred label: Lampung @fr

Wadi Wadi
type: Language
type: Concept
in scheme: Lexvo - ISO 639-3 language codes

Yirandali
type: Language
type: Concept
in scheme: Lexvo - ISO 639-3 language codes

Yuru
type: Language
type: Concept
in scheme: Lexvo - ISO 639-3 language codes

Lakalei
type: Language
type: Concept
ISO 639-3 code: lka
in scheme: Lexvo - ISO 639-3 language codes
notation: lka

Kabras
type: Language
type: Concept
ISO 639-3 code: lkb
alternative label: Lukabaras
in scheme: Lexvo - ISO 639-3 language codes
notation: lkb

Kucong
type: Language
type: Concept
ISO 639-3 code: lkc
in scheme: Lexvo - ISO 639-3 language codes
notation: lkc

Xwela Gbe
type: Language
type: Concept
ISO 639-3 code: xwe
alternative label: Gbe, Xwela
alternative label: Pherá language
definition: Pherá, also spelled Xwela, is a Gbe language of Benin. It forms a dialect chain with Western Phla.
in scheme: Lexvo - ISO 639-3 language codes
notation: xwe
preferred label: Xwela @de

Lakondê
type: Language
type: Concept
ISO 639-3 code: lkd
in scheme: Lexvo - ISO 639-3 language codes
notation: lkd

Kenyi
type: Language
type: Concept
ISO 639-3 code: lke
in scheme: Lexvo - ISO 639-3 language codes
notation: lke

Lakha
type: Language
type: Concept
ISO 639-3 code: lkh
definition: Lakha (Dzongkha: ལ་ཁ་, Wylie: La-kha, literally "language of the mountain pass," also called "Tshangkha") is a Southern Tibetan language spoken by about 8,000 people in Wangdue Phodrang and Trongsa Districts in central Bhutan. Lakha is spoken by descendants of pastoral yakherd communities.
in scheme: Lexvo - ISO 639-3 language codes
notation: lkh

Laki
type: Language
type: Concept
ISO 639-3 code: lki
alternative label: Laki language
definition: Laki (Kurdish: Lekí ) is a Northwestern Iranian language. Although it is usually grouped with Southern Kurdish dialects, Ethnologue classifies it as a fourth subgroup of Kurdish. It is spoken in the central Zagros region of Iran (provinces of Lorestan, Ilam, Kermanshah, Hamedan, Qazvin, Khuzestan) and in small parts of Iraq by the Lak people. Most Laks live in Nurabad, Alashtar, Harsin, Sahneh, Koohdasht, and Khorramabad.
in scheme: Lexvo - ISO 639-3 language codes
notation: lki
preferred label: Leki @de

Remun
type: Language
type: Concept
ISO 639-3 code: lkj
in scheme: Lexvo - ISO 639-3 language codes
notation: lkj

Laeko-Libuat
type: Language
type: Concept
ISO 639-3 code: lkl
in scheme: Lexvo - ISO 639-3 language codes
notation: lkl

Kalaamaya
type: Language
type: Concept
in scheme: Lexvo - ISO 639-3 language codes

Vure
type: Language
type: Concept
ISO 639-3 code: lkn
preferred label: Lakon
alternative label: Lakon language
definition: Lakon is an Oceanic language, spoken on the west coast of Gaua island in Vanuatu.
in scheme: Lexvo - ISO 639-3 language codes
notation: lkn

Khayo
type: Language
type: Concept
ISO 639-3 code: lko
alternative label: Olukhayo
in scheme: Lexvo - ISO 639-3 language codes
notation: lko

Päri
type: Language
type: Concept
ISO 639-3 code: lkr
in scheme: Lexvo - ISO 639-3 language codes
notation: lkr

Kisa
type: Language
type: Concept
ISO 639-3 code: lks
alternative label: Olushisa
in scheme: Lexvo - ISO 639-3 language codes
notation: lks

Lakota
type: Language
type: Concept
ISO 639-3 code: lkt
alternative label: Lakota language
definition: Lakota (also Lakhota, Teton, Teton Sioux) is a Siouan language spoken by the Lakota people of the Sioux tribes. While generally taught and considered by speakers as a separate language, Lakota is mutually understandable with the other two languages (cf. Dakota language), and is considered by most linguists one of the three major varieties of the Sioux language. The Lakota language represents one of the largest Native American language speech communities in the United States, with approximately 6,000 speakers living mostly in northern plains states of North Dakota and South Dakota. No syllables end with consonantal .
in scheme: Lexvo - ISO 639-3 language codes
notation: lkt
preferred label: Lingua lakota @it
preferred label: Língua dacota @pt

Záparo
type: Language
type: Concept
ISO 639-3 code: zro
alternative label: Záparo language
definition: Záparo is a nearly extinct language from the borderlands of Peru, spoken by only one person out of an ethnic population of 170, in the Pastaza Province, between the Curaray river and Bobonaza rivers, as of 2000. Záparo is also known as Zápara and Kayapwe. Though it was spoken by 1 person in 2000, there is the distinct possibility that it may be extinct. The members of the Záparo ethnic group now speak Quichua, though there is a language revival effort beginning. Záparo is sometimes confused with Andoa, though the two languages are distinct. Záparo has a subject–verb–object word order.
in scheme: Lexvo - ISO 639-3 language codes
notation: zro
preferred label: Idioma záparo @es
preferred label: Língua záparo @pt

Kungkari
type: Language
type: Concept
in scheme: Lexvo - ISO 639-3 language codes

Kwegu
type: Language
type: Concept
ISO 639-3 code: xwg
alternative label: Kwegu language
definition: Kwegu (also Bacha, Koegu, Kwegi, Menja, Nidi) is a Nilo-Saharan Eastern Sudanic language, spoken in the Southwest of Ethiopia, on the west bank of the Omo River.
in scheme: Lexvo - ISO 639-3 language codes
notation: xwg

Lokoya
type: Language
type: Concept
ISO 639-3 code: lky
in scheme: Lexvo - ISO 639-3 language codes
notation: lky

Lala-Roba
type: Language
type: Concept
ISO 639-3 code: lla
alternative label: Lala-Roba language
definition: Lala-Roba ( Gworam) is an Adamawa language of Nigeria. Its name is a compound of two of its dialects, Lala (Lalla), Roba (Robba), and Ebode.
in scheme: Lexvo - ISO 639-3 language codes
notation: lla

Lolo
type: Language
type: Concept
ISO 639-3 code: llb
in scheme: Lexvo - ISO 639-3 language codes
notation: llb

Lele
type: Language
type: Concept
ISO 639-3 code: llc
alternative label: Lele (Guinea)
alternative label: Lele language
definition: Lele is a Mande language spoken by approximately 23,000 people in Kissidougou (12,000) and Guéckédou Prefectures (11,000) of Guinea.
in scheme: Lexvo - ISO 639-3 language codes
notation: llc

Ladin
type: Language
type: Concept
ISO 639-3 code: lld
alternative label: Ladin language
definition: Ladin (, ) is a language consisting of a group of dialects (which some consider part of a unitary Rhaeto-Romance language) spoken in the Dolomite Mountains in Northern Italy in the border regions of the provinces Trentino, South Tyrol and Belluno. It is closely related to the Swiss Romansh and Friulian.
in scheme: Lexvo - ISO 639-3 language codes
notation: lld
preferred label: Idioma ladino @es
preferred label: Ladinische Sprache @de
preferred label: Lingua ladina @it
preferred label: Língua ladino-dolomítica @pt

Lele
type: Language
type: Concept
ISO 639-3 code: lle
alternative label: Lele (Papua New Guinea)
alternative label: Lele language
definition: Lele is an East Manus language of the Austronesian language family spoken in the northeastern part of Manus Island, New Guinea by approximately 1,300 people. It has SVO word order.
in scheme: Lexvo - ISO 639-3 language codes
notation: lle

Hermit
type: Language
type: Concept
ISO 639-3 code: llf
alternative label: Hermit language
definition: The Hermit language is an extinct West Manus language formerly spoken on Hermit, Luf and Maron Islands, western Manus Province, Papua New Guinea.
in scheme: Lexvo - ISO 639-3 language codes
notation: llf

Lole
type: Language
type: Concept
ISO 639-3 code: llg
in scheme: Lexvo - ISO 639-3 language codes
notation: llg

Lamu
type: Language
type: Concept
ISO 639-3 code: llh
in scheme: Lexvo - ISO 639-3 language codes
notation: llh

Teke-Laali
type: Language
type: Concept
ISO 639-3 code: lli
in scheme: Lexvo - ISO 639-3 language codes
notation: lli

Ladji Ladji
type: Language
type: Concept
ISO 639-3 code: llj
in scheme: Lexvo - ISO 639-3 language codes
notation: llj

Wajuk
type: Language
type: Concept
in scheme: Lexvo - ISO 639-3 language codes

Lelak
type: Language
type: Concept
ISO 639-3 code: llk
in scheme: Lexvo - ISO 639-3 language codes
notation: llk

Lilau
type: Language
type: Concept
ISO 639-3 code: lll
alternative label: Lilau language
definition: Lilau is a Torricelli language of Papua New Guinea.
in scheme: Lexvo - ISO 639-3 language codes
notation: lll

Lasalimu
type: Language
type: Concept
ISO 639-3 code: llm
in scheme: Lexvo - ISO 639-3 language codes
notation: llm

Lele
type: Language
type: Concept
ISO 639-3 code: lln
alternative label: Lele (Chad)
alternative label: Lele language
definition: Lele is an East Chadic language spoken in the Tandjilé Region, in the Tandjilé Ouest department, south of Kélo.
in scheme: Lexvo - ISO 639-3 language codes
notation: lln

Khlor
type: Language
type: Concept
ISO 639-3 code: llo
in scheme: Lexvo - ISO 639-3 language codes
notation: llo

Wangkumara
type: Language
type: Concept
in scheme: Lexvo - ISO 639-3 language codes

North Efate
type: Language
type: Concept
ISO 639-3 code: llp
alternative label: Efate, North
alternative label: North Efate language
definition: North Efate, or Nguna, is an Oceanic language spoken on several islands of Vanuatu.
in scheme: Lexvo - ISO 639-3 language codes
notation: llp
preferred label: Éfaté du Nord @fr

Lolak
type: Language
type: Concept
ISO 639-3 code: llq
in scheme: Lexvo - ISO 639-3 language codes
notation: llq

Lithuanian Sign Language
type: Language
type: Concept
ISO 639-3 code: lls
definition: Lithuanian Sign Language (LGK) (Lithuanian: Lietuvių gestų kalba) is the national sign language used in Lithuania, with several regional variants. Very little is known about its history before 1945. From 1945 to 1990 it was used along with Russian Sign Language and the two sign languages became very similar. Russian lip-patterns used with some LGK signs indicate that the sign may have been originally borrowed from Russian Sign Language. When Lithuania became independent, its contacts with Russian Sign Language were almost cut off, and now it's developing as an independent language, with some influence from international signs.
in scheme: Lexvo - ISO 639-3 language codes
notation: lls
preferred label: Língua de sinais lituana @pt

Lau
type: Language
type: Concept
ISO 639-3 code: llu
alternative label: Lau language
definition: The Lau language is a Malayo-Polynesian group language spoken on northeast Malaita of the Solomon Islands. As of 1999 it had about 16,937 first-language speakers, with a large number of second-language speakers through Malaitan communities in the Solomon Islands, especially in Honiara.
in scheme: Lexvo - ISO 639-3 language codes
notation: llu

Lauan
type: Language
type: Concept
ISO 639-3 code: llx
alternative label: Lauan language
definition: Lauan is an East Fijian language spoken by about 16,000 people on a number of islands of eastern Fiji. *
in scheme: Lexvo - ISO 639-3 language codes
notation: llx
preferred label: Lau @fr
preferred label: Lauanische Sprache @de

Western Xwla Gbe
type: Language
type: Concept
ISO 639-3 code: xwl
alternative label: Gbe, Western Xwla
in scheme: Lexvo - ISO 639-3 language codes
notation: xwl

East Limba
type: Language
type: Concept
ISO 639-3 code: lma
alternative label: Limba, East
in scheme: Lexvo - ISO 639-3 language codes
notation: lma

Merei
type: Language
type: Concept
ISO 639-3 code: lmb
in scheme: Lexvo - ISO 639-3 language codes
notation: lmb

Limilngan
type: Language
type: Concept
ISO 639-3 code: lmc
alternative label: Limilngan language
definition: Limilngan is an extinct indigenous language of Australia. It had three speakers left in 1981, but was gone by 2009.
in scheme: Lexvo - ISO 639-3 language codes
notation: lmc

Lumun
type: Language
type: Concept
ISO 639-3 code: lmd
alternative label: Lumun language
definition: Lumun (Lomon), also Kuku-Lumun, is a Niger–Congo language in the Talodi family spoken in Kordofan, Sudan.
in scheme: Lexvo - ISO 639-3 language codes
notation: lmd

Pévé
type: Language
type: Concept
ISO 639-3 code: lme
alternative label: Peve language
definition: Pévé, also Lamé after its chief dialect, is an Afro-Asiatic language of Chad and Cameroon. Zime is a generic name.
in scheme: Lexvo - ISO 639-3 language codes
notation: lme

South Lembata
type: Language
type: Concept
ISO 639-3 code: lmf
alternative label: Lembata, South
in scheme: Lexvo - ISO 639-3 language codes
notation: lmf

Lamogai
type: Language
type: Concept
ISO 639-3 code: lmg
alternative label: Lamogai language
definition: Lamogai is an Austronesian language spoken by about 3600 individuals in parts of West New Britain Province, Papua New Guinea on the island of New Britain.
in scheme: Lexvo - ISO 639-3 language codes
notation: lmg

Lambichhong
type: Language
type: Concept
ISO 639-3 code: lmh
in scheme: Lexvo - ISO 639-3 language codes
notation: lmh

Written Oirat
type: Language
type: Concept
ISO 639-3 code: xwo
alternative label: Oirat, Written
in scheme: Lexvo - ISO 639-3 language codes
notation: xwo

Lombi
type: Language
type: Concept
ISO 639-3 code: lmi
in scheme: Lexvo - ISO 639-3 language codes
notation: lmi

West Lembata
type: Language
type: Concept
ISO 639-3 code: lmj
alternative label: Lembata, West
in scheme: Lexvo - ISO 639-3 language codes
notation: lmj

Lamkang
type: Language
type: Concept
ISO 639-3 code: lmk
in scheme: Lexvo - ISO 639-3 language codes
notation: lmk

Hano
type: Language
type: Concept
ISO 639-3 code: lml
alternative label: Raga language
definition: Raga (also known as Hano) is the language of northern Pentecost island in Vanuatu. Raga belongs to the East Vanuatu languages, a branch of the Austronesian languages family. In old sources the language is sometimes referred to by the names of villages in which it is spoken, such as Bwatvenua (Qatvenua), Lamalanga, Vunmarama and Loltong.
in scheme: Lexvo - ISO 639-3 language codes
notation: lml
preferred label: Língua raga @pt

Lamam
type: Language
type: Concept
ISO 639-3 code: lmm
in scheme: Lexvo - ISO 639-3 language codes
notation: lmm

Lambadi
type: Language
type: Concept
ISO 639-3 code: lmn
alternative label: Lambadi language
definition: Lambadi is a Rajasthani language spoken by nomadic Banjara people across India.
in scheme: Lexvo - ISO 639-3 language codes
notation: lmn
preferred label: Língua lambadi @pt

Lombard
type: Language
type: Concept
ISO 639-3 code: lmo
alternative label: Lombard language
definition: Lombard is a member of the Cisalpine or Gallo-Italic group within the Romance languages. It is spoken natively in Northern Italy (most of Lombardy and some areas of neighbouring regions, notably the eastern side of Piedmont) and Southern Switzerland (Ticino and Graubünden).
in scheme: Lexvo - ISO 639-3 language codes
notation: lmo
preferred label: Idioma lombardo @es
preferred label: Lingua lombarda @it
preferred label: Lombardische Sprache @de
preferred label: Língua lombarda @pt

Limbum
type: Language
type: Concept
ISO 639-3 code: lmp
alternative label: Limbum language
definition: Limbum is a Grassfields language of Cameroon, with a small number in Nigeria. It's used as a trade language.
in scheme: Lexvo - ISO 639-3 language codes
notation: lmp

Kwerba Mamberamo
type: Language
type: Concept
ISO 639-3 code: xwr
in scheme: Lexvo - ISO 639-3 language codes
notation: xwr

Lamatuka
type: Language
type: Concept
ISO 639-3 code: lmq
in scheme: Lexvo - ISO 639-3 language codes
notation: lmq

Lamalera
type: Language
type: Concept
ISO 639-3 code: lmr
in scheme: Lexvo - ISO 639-3 language codes
notation: lmr

Lamenu
type: Language
type: Concept
ISO 639-3 code: lmu
in scheme: Lexvo - ISO 639-3 language codes
notation: lmu

Lomaiviti
type: Language
type: Concept
ISO 639-3 code: lmv
alternative label: Lomaiviti language
definition: Lomaiviti is an East Fijian language spoken by about 1600 people on a number of islands of Fiji. *
in scheme: Lexvo - ISO 639-3 language codes
notation: lmv
preferred label: Idioma lomaiviti @es

Lake Miwok
type: Language
type: Concept
ISO 639-3 code: lmw
alternative label: Lake Miwok language
alternative label: Miwok, Lake
definition: The Lake Miwok language is a moribund (or possibly extinct) language of Northern California, traditionally spoken in an area adjacent to the Clear Lake. It is one of the languages of the Clear Lake Linguistic Area, along with Patwin, East and Southeastern Pomo, and Wappo.
in scheme: Lexvo - ISO 639-3 language codes
notation: lmw
preferred label: Lake miwok @fr

Laimbue
type: Language
type: Concept
ISO 639-3 code: lmx
in scheme: Lexvo - ISO 639-3 language codes
notation: lmx

Lamboya
type: Language
type: Concept
ISO 639-3 code: lmy
in scheme: Lexvo - ISO 639-3 language codes
notation: lmy

Wotjobaluk
type: Language
type: Concept
in scheme: Lexvo - ISO 639-3 language codes

Lumbee
type: Language
type: Concept
ISO 639-3 code: lmz
in scheme: Lexvo - ISO 639-3 language codes
notation: lmz

Langbashe
type: Language
type: Concept
ISO 639-3 code: lna
in scheme: Lexvo - ISO 639-3 language codes
notation: lna

Mbalanhu
type: Language
type: Concept
ISO 639-3 code: lnb
in scheme: Lexvo - ISO 639-3 language codes
notation: lnb

Lundayeh
type: Language
type: Concept
ISO 639-3 code: lnd
alternative label: Lun Bawang
alternative label: Lun Bawang language
definition: | class="wikitable" style="margin:auto; text-align:center" align="center" width="50%" |+caption | Table of consonant phonemes of Lun Bawang |- ! ! colspan="2" | Bilabial ! colspan="2" | Dental ! colspan="2" | Alveolar ! colspan="2" | Post-Alveolar ! colspan="2" | Palatal ! colspan="2" | Velar ! Glottal |- align="center" ! Nasal | colspan="2" | m | colspan="2" | | colspan="2" | n | colspan="2" | | colspan="2" | | colspan="2" | ng | |- align="center" ! Plosive | p | b | t | d | colspan="2" | | colspan="2" | | colspan="2" | | k | g | |- align="center" ! Affricate | colspan="2" | | colspan="2" | | colspan="2" | |c || | colspan="2" | | colspan="2" | | |- align="center" ! Fricative | colspan="2" | | colspan="2" | | s || | colspan="2" | | colspan="2" | | || |h |- align="center" ! Approximant | colspan="2" | | colspan="2" | | colspan="2" | l | colspan="2" | r | colspan="2" | y | colspan="2" |w |...
in scheme: Lexvo - ISO 639-3 language codes
notation: lnd

Langobardic
type: Language
type: Concept
ISO 639-3 code: lng
alternative label: Lombardic language
definition: Lombardic or Langobardic is the extinct language of the Lombards (Langobardi), the Germanic speaking people who settled in Italy in the 6th century. The language declined rapidly already in the 7th century as the invaders quickly adopted the Latin vernacular spoken by the local Roman population. E.g. already the Edict of Rothari from 643 is written almost exclusively in Vulgar Latin although it only covers Lombardic subjects and the laws were compiled by the Lombards themselves. Lombardic may have been in scattered use until as late as ca. AD 1000. The language is only preserved fragmentarily, the main evidence being individual words quoted in Latin texts.
in scheme: Lexvo - ISO 639-3 language codes
notation: lng
preferred label: Idioma lombardo @es
preferred label: Langobardische Sprache @de
preferred label: Lingua longobarda @it
preferred label: Língua longobarda @pt

Wemba Wemba
type: Language
type: Concept
in scheme: Lexvo - ISO 639-3 language codes

Lanoh
type: Language
type: Concept
ISO 639-3 code: lnh
alternative label: Lanoh language
definition: Lanoh is an aboriginal Mon–Khmer language of Malaya.
in scheme: Lexvo - ISO 639-3 language codes
notation: lnh

Daantanai'
type: Language
type: Concept
ISO 639-3 code: lni
in scheme: Lexvo - ISO 639-3 language codes
notation: lni

Leningitij
type: Language
type: Concept
ISO 639-3 code: lnj
alternative label: Linngithigh dialect
definition: Linngithigh is an extinct Paman language formerly spoken on the Cape York Peninsula of Queensland, Australia, by the Linngithigh people. Its date of extinction is unknown. This language variety is very similar phonologically to the related variety Alngith.
in scheme: Lexvo - ISO 639-3 language codes
notation: lnj

South Central Banda
type: Language
type: Concept
ISO 639-3 code: lnl
alternative label: Banda, South Central
in scheme: Lexvo - ISO 639-3 language codes
notation: lnl

Langam
type: Language
type: Concept
ISO 639-3 code: lnm
in scheme: Lexvo - ISO 639-3 language codes
notation: lnm

Boro
type: Language
type: Concept
ISO 639-3 code: xxb
alternative label: Boro (Ghana)
alternative label: Boro language
definition: Boro is an extinct language once spoken in central eastern Ghana. In the vicinity of Worawora and Tapa, Rudolf Plehn found one old man who could still remember some words of this language, which according to him was spoken by more people in his younger years. The language is only known from the 12 lexical items collected by Plehn around the end of the 19th century and published in Seidel (1898). Westermann (1922) classified it as one of the Togorestsprachen, while Heine (1968:300) treats it as unclassified.
in scheme: Lexvo - ISO 639-3 language codes
notation: xxb

Lorediakarkar
type: Language
type: Concept
ISO 639-3 code: lnn
alternative label: Lorediakarkar language
definition: Lorediakarkar is a language of the East Santo languages a group of languages in the Austronesian family of Languages. It is spoken by about 340 people out of an ethnic population of 850 on Espiritu Santo Island in Vanuatu. It is close to the Shark Bay language.
in scheme: Lexvo - ISO 639-3 language codes
notation: lnn

Lango
type: Language
type: Concept
ISO 639-3 code: lno
alternative label: Lango (Sudan)
alternative label: Lango language
definition: Lango (or Langgo) is an Eastern Nilotic language spoken by the Lango of South Sudan, Equatoria Province, Torit District. It had approximately 20,000 speakers in 1987.
in scheme: Lexvo - ISO 639-3 language codes
notation: lno

Lamnso'
type: Language
type: Concept
ISO 639-3 code: lns
alternative label: Nso language
definition: Lamnso (Lamnsɔ’) is the language of the Nso people of Cameroon. A few may remain in Nigeria. It is a Grassfields language with ten major noun classes. The ISO 639-3 code is lns. This language is spoken by about over 100,000 people.
in scheme: Lexvo - ISO 639-3 language codes
notation: lns
preferred label: Lamnso @de

Longuda
type: Language
type: Concept
ISO 639-3 code: lnu
alternative label: Longuda language
definition: Longuda is a Niger–Congo language of Nigeria. Joseph Greenberg counted it as a distinct branch, G10, of his Adamawa family. Boyd (1989) assigned it a branch within Waja–Jen. When Blench (2008) broke up Adamawa, Longuda was made a branch of the Bambukic languages.
in scheme: Lexvo - ISO 639-3 language codes
notation: lnu

Lanima
type: Language
type: Concept
in scheme: Lexvo - ISO 639-3 language codes

Lonzo
type: Language
type: Concept
ISO 639-3 code: lnz
in scheme: Lexvo - ISO 639-3 language codes
notation: lnz

Loloda
type: Language
type: Concept
ISO 639-3 code: loa
alternative label: Loloda language
definition: Loloda is a Papuan Halmahera language of Indonesia.
in scheme: Lexvo - ISO 639-3 language codes
notation: loa

Lobi
type: Language
type: Concept
ISO 639-3 code: lob
alternative label: Lobi language
definition: Lobi (also Miwa) is a Gur language of Burkina Faso and Ivory Coast.
in scheme: Lexvo - ISO 639-3 language codes
notation: lob
preferred label: Lobiri @de

Inonhan
type: Language
type: Concept
ISO 639-3 code: loc
alternative label: Onhan language
definition: The Onhan language is a Kinaray-a language spoken, along with the Romblomanon and Asi languages, in the province of Romblon, Philippines. The language is also known as Inunhan and Loocnon. * Onhan language has three variants- those speaking in the municipalities of Santa Maria, and Alcantara uses letter "L" instead of "R". Example "Kararaw" is "Kalalaw", and other speakers change "R" for "D" as in "run" to "dun"
in scheme: Lexvo - ISO 639-3 language codes
notation: loc

Saluan
type: Language
type: Concept
ISO 639-3 code: loe
in scheme: Lexvo - ISO 639-3 language codes
notation: loe

Logol
type: Language
type: Concept
ISO 639-3 code: lof
alternative label: Logol language
definition: The Logol language, or Lukha, is a Niger–Congo language in the Heiban family spoken in Kordofan, Sudan.
in scheme: Lexvo - ISO 639-3 language codes
notation: lof

Logo
type: Language
type: Concept
ISO 639-3 code: log
alternative label: Logo language
definition: Logo is a Central Sudanic language spoken in the Democratic Republic of the Congo by 210,000 people in 1989 according to SIL.
in scheme: Lexvo - ISO 639-3 language codes
notation: log

Ke'o
type: Language
type: Concept
ISO 639-3 code: xxk
in scheme: Lexvo - ISO 639-3 language codes
notation: xxk

Narim
type: Language
type: Concept
ISO 639-3 code: loh
in scheme: Lexvo - ISO 639-3 language codes
notation: loh

Loma
type: Language
type: Concept
ISO 639-3 code: loi
alternative label: Loma (Côte d'Ivoire)
alternative label: Lomakka language
definition: Loma, or Lomakka (also Lomasse, or—ambiguously—Malinke), is a Niger–Congo language of Ivory Coast.
in scheme: Lexvo - ISO 639-3 language codes
notation: loi

Lou
type: Language
type: Concept
ISO 639-3 code: loj
alternative label: Lou language
definition: Lou is a Southeast Admiralty Islands language spoken on Lou Island of Manus Province, Papua New Guinea by approximately 1000 people.
in scheme: Lexvo - ISO 639-3 language codes
notation: loj

Loko
type: Language
type: Concept
ISO 639-3 code: lok
alternative label: Loko language
definition: The Loko language is a Mande language spoken in Sierra Leone by the Loko people, who live primarily in the Northern Province.
in scheme: Lexvo - ISO 639-3 language codes
notation: lok

Mongo
type: Language
type: Concept
ISO 639-2 Bibliographical code: lol
ISO 639-2 Terminological code: lol
ISO 639-3 code: lol
alternative label: Lomongo @de
alternative label: Mongo language
definition: Mongo, also called Nkundo or Mongo-Nkundu and Lomongo, is a language spoken by several of the Mongo peoples in the Democratic Republic of the Congo. Mongo speakers reside in central DRC, mostly south of the Congo River. Mongo is a tonal language.
in scheme: Lexvo - ISO 639-3 language codes
notation: lol
preferred label: lolo bantu @it
preferred label: mongo @es

Loma
type: Language
type: Concept
ISO 639-3 code: lom
alternative label: Loma (Liberia)
in scheme: Lexvo - ISO 639-3 language codes
notation: lom

Malawi Lomwe
type: Language
type: Concept
ISO 639-3 code: lon
alternative label: Lomwe, Malawi
alternative label: Malawi Lomwe language
definition: Lomwe is a mixed language spoken in southeastern Malawi.
in scheme: Lexvo - ISO 639-3 language codes
notation: lon
preferred label: Lomwe @fr

Minkin
type: Language
type: Concept
in scheme: Lexvo - ISO 639-3 language codes

Lombo
type: Language
type: Concept
ISO 639-3 code: loo
alternative label: Lombo language
definition: The Lombo language (also called Olombo, Turumbu, Ulumbu) is in the Kele language group of Bantu languages. It is spoken by the Turumbu people of the Tshopo District, Isangi Territory, in the Democratic Republic of the Congo.
in scheme: Lexvo - ISO 639-3 language codes
notation: loo

Lopa
type: Language
type: Concept
ISO 639-3 code: lop
in scheme: Lexvo - ISO 639-3 language codes
notation: lop

Lobala
type: Language
type: Concept
ISO 639-3 code: loq
alternative label: Bala language
definition: Bala (Lobala) is a Bantu language of DR Congo.
in scheme: Lexvo - ISO 639-3 language codes
notation: loq

Téén
type: Language
type: Concept
ISO 639-3 code: lor
alternative label: Lorhon language
definition: Lorhon, or Teen, is a Niger–Congo language of Ivory Coast and across the border in Burkina Faso.
in scheme: Lexvo - ISO 639-3 language codes
notation: lor

Loniu
type: Language
type: Concept
ISO 639-3 code: los
in scheme: Lexvo - ISO 639-3 language codes
notation: los

Koropó
type: Language
type: Concept
ISO 639-3 code: xxr
alternative label: Koropó language
definition: Koropó (Coropó) is an extinct language of eastern Brazil.
in scheme: Lexvo - ISO 639-3 language codes
notation: xxr

Otuho
type: Language
type: Concept
ISO 639-3 code: lot
alternative label: Lotuko language
definition: Otuho (also known as Lotuko or Lotuxo) is the language of the Lotuko people of Eastern Equatoria, an area in Southern Sudan. It is an Eastern Nilotic language, and has several dialects.
in scheme: Lexvo - ISO 639-3 language codes
notation: lot

Louisiana Creole French
type: Language
type: Concept
ISO 639-3 code: lou
alternative label: Creole French, Louisiana
definition: Louisiana Creole (Kréyol La Lwizyàn) (français: Créole louisianais) is a French Creole language spoken by the Louisiana Creole people of the state of Louisiana. The language consists of elements of French, Spanish, African, and Native American roots.
in scheme: Lexvo - ISO 639-3 language codes
notation: lou
preferred label: Créole louisianais @fr

Lopi
type: Language
type: Concept
ISO 639-3 code: lov
in scheme: Lexvo - ISO 639-3 language codes
notation: lov

Tampias Lobu
type: Language
type: Concept
ISO 639-3 code: low
alternative label: Lobu, Tampias
in scheme: Lexvo - ISO 639-3 language codes
notation: low

Loun
type: Language
type: Concept
ISO 639-3 code: lox
alternative label: Loun language
definition: The Loun language is an Austronesian language spoken in Indonesia, mainly in the Maluku archipelago. The language is critically endangered, even the most optimistic estimates give the language less than 100 speakers.
in scheme: Lexvo - ISO 639-3 language codes
notation: lox

Loke
type: Language
type: Concept
ISO 639-3 code: loy
in scheme: Lexvo - ISO 639-3 language codes
notation: loy

Lozi
type: Language
type: Concept
ISO 639-2 Bibliographical code: loz
ISO 639-2 Terminological code: loz
ISO 639-3 code: loz
alternative label: Idioma lozi @es
alternative label: Lozi language
alternative label: Língua lozi @pt
alternative label: Rotse-Sprache @de
preferred label: lozi @es
definition: Lozi, also known as siLozi and Rozi, is a Bantu language of the Niger–Congo language family within the Sotho languages branch of Zone S (S.30), that is spoken by the Lozi people, primarily in southwestern Zambia and in surrounding countries. This language is most closely related to Northern Sotho (Sesotho sa Leboa), Tswana (Setswana), Kgalagari (SheKgalagari) and Sotho (Sesotho/Southern Sotho). Lozi and its dialects are spoken and understood by approximately six percent of the population of Zambia. Silozi is the autoglottonym or name of the language used by its native speakers as defined by the United Nations. Lozi is the heteroglottonym.
in scheme: Lexvo - ISO 639-3 language codes
notation: loz

Lelepa
type: Language
type: Concept
ISO 639-3 code: lpa
in scheme: Lexvo - ISO 639-3 language codes
notation: lpa

Lepki
type: Language
type: Concept
ISO 639-3 code: lpe
alternative label: Lepki language
definition: Lepki is an unclassified Papuan language spoken in Western New Guinea, near the unclassified languages Murkim and Kembra.
in scheme: Lexvo - ISO 639-3 language codes
notation: lpe

Long Phuri Naga
type: Language
type: Concept
ISO 639-3 code: lpn
alternative label: Naga, Long Phuri
in scheme: Lexvo - ISO 639-3 language codes
notation: lpn

Lipo
type: Language
type: Concept
ISO 639-3 code: lpo
alternative label: Lipo language
definition: Lipo, or Eastern Lisu, is a language of the Lisu people of China, similar to but not intelligible with Lisu proper. Some Lipo are classified by the government as Lisu, others as Yi. In some areas, the people prefer the name Lolopo or Lolongo.
in scheme: Lexvo - ISO 639-3 language codes
notation: lpo

Tambora
type: Language
type: Concept
ISO 639-3 code: xxt
alternative label: Tambora language
definition: Tambora is the poorly attested non-Austronesian (Papuan) language of the Tambora culture of central Sumbawa, in what is now Indonesia, which was wiped out by the 1815 eruption of Mount Tambora. This was the westernmost known Papuan language (Donahue 2007), and was relatively unusual among such languages in being the language of a maritime trading state, though contemporary Papuan trading states were also found off Halmahera in Ternate and Tidore.
in scheme: Lexvo - ISO 639-3 language codes
notation: xxt

Lopit
type: Language
type: Concept
ISO 639-3 code: lpx
in scheme: Lexvo - ISO 639-3 language codes
notation: lpx

Rara Bakati'
type: Language
type: Concept
ISO 639-3 code: lra
alternative label: Lara language
definition: Lara’ (also called Luru, Berkati, Bakati, Bekatiq, Bekati’ Nyam-Pelayo, Bekati’ Kendayan, and Rara Bakati’) is a language spoken by some 19,000 people in Borneo, on both the Indonesian side (West Kalimantan) and Malaysian side (Sarawak) of the island. Most information about it has been gathered by various Christian missionary groups.
in scheme: Lexvo - ISO 639-3 language codes
notation: lra
preferred label: Rara bakati’ @fr

Northern Luri
type: Language
type: Concept
ISO 639-3 code: lrc
alternative label: Borujerdi dialect
alternative label: Luri, Northern
definition: The Borujerdi dialect is a local dialect spoken in Borujerd city and its surrounding areas in the province of Lorestan in Iran. Borujerdi is more similar to Persian than the Luri of Khurramabad, spoken in other parts of Lorestan, being in some aspects is completely different.
in scheme: Lexvo - ISO 639-3 language codes
notation: lrc

Laurentian
type: Language
type: Concept
ISO 639-3 code: lre
alternative label: Laurentian language
definition: Laurentian, or St. Lawrence Iroquoian, was an Iroquoian language spoken until the late 16th century along the shores of the Saint Lawrence River in present-day Quebec and Ontario, Canada. It is believed to have disappeared with the extinction of the St. Lawrence Iroquoians, likely as a result of warfare by the more powerful Mohawk from the Haudenosaunee or Iroquois Confederacy to the south, in present-day New York state.
in scheme: Lexvo - ISO 639-3 language codes
notation: lre
preferred label: Laurentien @fr
preferred label: Laurentisch @de

Laragia
type: Language
type: Concept
ISO 639-3 code: lrg
alternative label: Laragiya language
definition: The Laragiya language is an Australian language isolate spoken by just six people near the city of Darwin in northern Australia as of 1983. Ethnologue (2009) reported that it was extinct.
in scheme: Lexvo - ISO 639-3 language codes
notation: lrg
preferred label: Lingua laragiya @it

Marachi
type: Language
type: Concept
ISO 639-3 code: lri
alternative label: Olumarachi
in scheme: Lexvo - ISO 639-3 language codes
notation: lri

Loarki
type: Language
type: Concept
ISO 639-3 code: lrk
alternative label: Loarki language
definition: Loarki is an Indo-Aryan language, classified as a Rajasthani language, and is spoken by 20,000 nomadic people in rural Sindh of Pakistan.
in scheme: Lexvo - ISO 639-3 language codes
notation: lrk

Lari
type: Language
type: Concept
ISO 639-3 code: lrl
alternative label: Larestani dialects
definition: Larestani or Lari ( or ) is a group of southwestern Iranian languages related to Luri and Persian, spoken in Larestan (Lar) region of Fars province and parts of Hormozgan province (including Bastak) in the south of Iran.
in scheme: Lexvo - ISO 639-3 language codes
notation: lrl

Marama
type: Language
type: Concept
ISO 639-3 code: lrm
alternative label: Olumarama
in scheme: Lexvo - ISO 639-3 language codes
notation: lrm

Lorang
type: Language
type: Concept
ISO 639-3 code: lrn
in scheme: Lexvo - ISO 639-3 language codes
notation: lrn

Laro
type: Language
type: Concept
ISO 639-3 code: lro
alternative label: Laro language
definition: Laro, also Laru, Aaleira, Ngwullaro, Yillaro, is a Niger–Congo language in the Heiban family spoken in Kordofan, Sudan.
in scheme: Lexvo - ISO 639-3 language codes
notation: lro

Zarphatic
type: Language
type: Concept
ISO 639-3 code: zrp
alternative label: Zarphatic language
definition: Zarphatic or Judæo-French (Zarphatic: Tsarfatit) is an extinct Jewish language, formerly spoken among the Jewish communities of northern France and in parts of what is now west-central Germany, in such cities as Mainz, Frankfurt am Main, and Aachen.
in scheme: Lexvo - ISO 639-3 language codes
notation: zrp
preferred label: Sarphatique @fr
preferred label: Zarfatico @it
preferred label: Zarfatische Sprache @de

Southern Yamphu
type: Language
type: Concept
ISO 639-3 code: lrr
alternative label: Yamphu, Southern
in scheme: Lexvo - ISO 639-3 language codes
notation: lrr

Yaygir
type: Language
type: Concept
in scheme: Lexvo - ISO 639-3 language codes

Larantuka Malay
type: Language
type: Concept
ISO 639-3 code: lrt
alternative label: Malay, Larantuka
definition: Larantuka Malay is a contact variety of Malay spoken in and around the city of Larantuka on the island of Flores in Indonesia, and in two enclaves: the village of Wure on the island of Adonara (across a narrow strait from Larantuka) and four villages on Konga Bay, about 40 kilometers south of Larantuka on Flores, and serves more generally as a lingua franca on the eastern tip of Flores and nearby islands. There are approximately 23,000 native speakers of Larantuka Malay. Second language speakers of Larantuka Malay are primarily found in and around the city of Larantuka and through the eastern part of Flores island, as well as the nearby islands of Adonara, Solor and Lembata (Lomblen), and natively speak Lamaholot or other languages closely related to Lamaholot, which, until recently, were believed to be dialects of Lamaholot.
in scheme: Lexvo - ISO 639-3 language codes
notation: lrt

Larevat
type: Language
type: Concept
ISO 639-3 code: lrv
in scheme: Lexvo - ISO 639-3 language codes
notation: lrv

Lemerig
type: Language
type: Concept
ISO 639-3 code: lrz
in scheme: Lexvo - ISO 639-3 language codes
notation: lrz

Lasgerdi
type: Language
type: Concept
ISO 639-3 code: lsa
in scheme: Lexvo - ISO 639-3 language codes
notation: lsa

Lishana Deni
type: Language
type: Concept
ISO 639-3 code: lsd
definition: Lishana Deni is a modern Jewish Aramaic language, often called Neo-Aramaic or Judeo-Aramaic. It was originally spoken in the town of Zakho and its surrounding villages in northern Iraq, on the border with Turkey. Most speakers now live in and around Jerusalem. The name Lishana Deni means our language, and is similar to names used by other Jewish Neo-Aramaic dialects (Lishan Didan, Lishanid Noshan). Other popular names for the language are Lishan Hozaye, the language of the Jews, and Kurdit, Kurdish. Scholarly sources tend simply to refer to Lishana Deni as Zakho Jewish Neo-Aramaic.
in scheme: Lexvo - ISO 639-3 language codes
notation: lsd

Yandjibara
type: Language
type: Concept
in scheme: Lexvo - ISO 639-3 language codes

Lusengo
type: Language
type: Concept
ISO 639-3 code: lse
in scheme: Lexvo - ISO 639-3 language codes
notation: lse

Lyons Sign Language
type: Language
type: Concept
ISO 639-3 code: lsg
definition: Lyons Sign Language is an old sign language of France. It is not intelligible with and apparently not related to French Sign Language, which developed in Paris. The number of current speakers is not attested.
in scheme: Lexvo - ISO 639-3 language codes
notation: lsg

Lish
type: Language
type: Concept
ISO 639-3 code: lsh
alternative label: Lish language
definition: Lishpa, or Lish, is a small Tibeto-Burman language spoken in India.
in scheme: Lexvo - ISO 639-3 language codes
notation: lsh

Lashi
type: Language
type: Concept
ISO 639-3 code: lsi
alternative label: Lashi language
definition: Lashi (endonym Lachik) is a Burmish language. It is according to Nishi (1999: 70) in the Maruic branch, which preserves the preglottalized initials of Proto-Burmish in the most phonotactic environments.
in scheme: Lexvo - ISO 639-3 language codes
notation: lsi

Latvian Sign Language
type: Language
type: Concept
ISO 639-3 code: lsl
in scheme: Lexvo - ISO 639-3 language codes
notation: lsl

Mayi-Yapi
type: Language
type: Concept
in scheme: Lexvo - ISO 639-3 language codes

Saamia
type: Language
type: Concept
ISO 639-3 code: lsm
alternative label: Olusamia
alternative label: Samia dialect
definition: Samia (Saamia) is a Luhya dialect of Uganda and Kenya.
in scheme: Lexvo - ISO 639-3 language codes
notation: lsm

Laos Sign Language
type: Language
type: Concept
ISO 639-3 code: lso
in scheme: Lexvo - ISO 639-3 language codes
notation: lso

Panamanian Sign Language
type: Language
type: Concept
ISO 639-3 code: lsp
alternative label: Lengua de Señas Panameñas
in scheme: Lexvo - ISO 639-3 language codes
notation: lsp

Aruop
type: Language
type: Concept
ISO 639-3 code: lsr
in scheme: Lexvo - ISO 639-3 language codes
notation: lsr

Lasi
type: Language
type: Concept
ISO 639-3 code: lss
in scheme: Lexvo - ISO 639-3 language codes
notation: lss

Mayi-Kulan
type: Language
type: Concept
in scheme: Lexvo - ISO 639-3 language codes

Trinidad and Tobago Sign Language
type: Language
type: Concept
ISO 639-3 code: lst
in scheme: Lexvo - ISO 639-3 language codes
notation: lst

Mauritian Sign Language
type: Language
type: Concept
ISO 639-3 code: lsy
in scheme: Lexvo - ISO 639-3 language codes
notation: lsy

Middle Chinese
type: Language
type: Concept
ISO 639-3 code: ltc
alternative label: Chinese, Late Middle
alternative label: Late Middle Chinese
definition: Middle Chinese , also called Ancient Chinese by the linguist Bernhard Karlgren, refers to the Chinese language spoken during Southern and Northern Dynasties and the Sui, Tang, and Song dynasties. The term "Middle Chinese", in contrast to Old Chinese and Modern Chinese, is usually used in the context of historical Chinese phonology, which seeks to reconstruct the pronunciation of Chinese used during these times.
in scheme: Lexvo - ISO 639-3 language codes
notation: ltc
preferred label: Chinois médiéval @fr
preferred label: Medio cinese @it

Latgalian
type: Language
type: Concept
ISO 639-3 code: ltg
alternative label: Latgalian language
definition: Latgalian language can mean one of the following: #It was a language spoken by Latgalians in a great part of the area which is now Latvia. Latgalian was a member of the Baltic group of the Indo-European language family. Historically the Latvian language is derived from Latgalian (with additions from a few other languages, e.g. Old Curonian, Semigallian and Livonian). #Nowadays it normally refers to a language spoken in Latgale, the eastern part of Latvia. Sometimes it is referred to as a distinct separate language, while others consider it to be a dialect of Latvian. This modern Latgalian developed as a result of two main factors: Latgalians having preserved more features of the archaic (tribal) Latgalian language than the other Latvians and Latgale being separated for several centuries from other parts of Latvia.
in scheme: Lexvo - ISO 639-3 language codes
notation: ltg
preferred label: Latgalien @fr
preferred label: Lettgallische Sprache @de
preferred label: Lingua latgalliana @it
preferred label: Língua latgália @pt

Leti
type: Language
type: Concept
ISO 639-3 code: lti
alternative label: Leti (Indonesia)
alternative label: Leti language
definition: Leti is an Austronesian language spoken on the island of Leti in Maluku. Although it shares a lot of vocabulary with the neighboring Luang language, and is marginally mutually intelligible, it is not clear that it is more closely related to Luang than to other Southwest Maluku languages.
in scheme: Lexvo - ISO 639-3 language codes
notation: lti

Yalakalore
type: Language
type: Concept
ISO 639-3 code: xyl
in scheme: Lexvo - ISO 639-3 language codes
notation: xyl

Latundê
type: Language
type: Concept
ISO 639-3 code: ltn
in scheme: Lexvo - ISO 639-3 language codes
notation: ltn

Tsotso
type: Language
type: Concept
ISO 639-3 code: lto
alternative label: Olutsotso
in scheme: Lexvo - ISO 639-3 language codes
notation: lto

Tachoni
type: Language
type: Concept
ISO 639-3 code: lts
alternative label: Lutachoni
in scheme: Lexvo - ISO 639-3 language codes
notation: lts

Latu
type: Language
type: Concept
ISO 639-3 code: ltu
in scheme: Lexvo - ISO 639-3 language codes
notation: ltu

Luxembourgish
type: Language
type: Concept
ISO 639-1 code: lb
ISO 639-2 Bibliographical code: ltz
ISO 639-2 Terminological code: ltz
ISO 639-3 code: ltz
alternative label: Idioma luxemburgués @es
alternative label: Letzeburgesch
alternative label: Lingua lussemburghese @it
alternative label: Luxembourgeois @fr
alternative label: Luxembourgish language
alternative label: Luxemburgische Sprache @de
alternative label: Língua luxemburguesa @pt
definition: Luxembourgish (Lëtzebuergesch; , , , ) is a High German language spoken mainly in Luxembourg. About 320,000 people worldwide speak Luxembourgish.
in scheme: Lexvo - ISO 639-3 language codes
notation: ltz
preferred label: Luxemburgisch @de
preferred label: lussemburghese @it
preferred label: luxembourgeois @fr
preferred label: luxemburgués @es
preferred label: luxemburguês @pt

Luba-Lulua
type: Language
type: Concept
ISO 639-2 Bibliographical code: lua
ISO 639-2 Terminological code: lua
ISO 639-3 code: lua
alternative label: Idioma chiluba @es
alternative label: Luba-Kasai language
alternative label: Língua tshiluba @pt
preferred label: luba-lulua @es
definition: Luba-Kasai (also called Luba-Lulua, Western Luba, Kasai, Luva, and Tshiluba) is a Bantu language spoken in the Democratic Republic of the Congo, where it is a national language, along with Lingala, Swahili, and Kikongo. It is one of two major Congolese languages called "Luba". (See Luba-Katanga.)
in scheme: Lexvo - ISO 639-3 language codes
notation: lua
preferred label: Tschiluba @de
preferred label: Tshiluba @fr

Luba-Katanga
type: Language
type: Concept
ISO 639-1 code: lu
ISO 639-2 Bibliographical code: lub
ISO 639-2 Terminological code: lub
ISO 639-3 code: lub
alternative label: Luba-Katanga language
definition: Luba-Katanga, also known as Luba-Shaba and Kiluba, is one of two major Bantu language spoken in the Democratic Republic of the Congo called "Luba". (See Luba-Kasai.) It is spoken mostly in the south-east area of the country by the Luba people.
in scheme: Lexvo - ISO 639-3 language codes
notation: lub
preferred label: Kiluba @de
preferred label: luba-catanga @pt
preferred label: luba-katanga @es

Mayi-Thakurti
type: Language
type: Concept
in scheme: Lexvo - ISO 639-3 language codes

Aringa
type: Language
type: Concept
ISO 639-3 code: luc
alternative label: Aringa language
definition: Aringa, also known as Low Lugbara, is a Central Sudanic language spoken by the Aringa people in the West Nile region of Uganda. It is related to the language spoken by the Lugbara and Madi peoples.
in scheme: Lexvo - ISO 639-3 language codes
notation: luc

Ludian
type: Language
type: Concept
ISO 639-3 code: lud
alternative label: Ludic language
definition: Ludic or Ludian or Ludic Karelian (Luudi, Lyydi, or lüüdi) is a Finnic language in the Uralic language family. Some consider it a transitional language between Olonets Karelian language and Veps language. It is spoken by 3,000 people in the Republic of Karelia in Russia, near the northwestern shore of Lake Onega, including some child-speakers. Some speakers also speak Russian.
in scheme: Lexvo - ISO 639-3 language codes
notation: lud
preferred label: Lingua ludica @it
preferred label: Lüdische Sprache @de

Luvale
type: Language
type: Concept
ISO 639-3 code: lue
alternative label: Luvale language
definition: Luvale (also spelled Chiluvale, Lovale, Lubale, Luena, Lwena) is a Bantu language spoken by the Lovale people of Angola and Zambia. It is recognized as a regional language for educational and administrative purposes in Zambia, where about 168,000 (2006) people speak it.
in scheme: Lexvo - ISO 639-3 language codes
notation: lue

Laua
type: Language
type: Concept
ISO 639-3 code: luf
alternative label: Laua language
definition: Laua, also known as Labu, is a native language of Papua New Guinea. It is spoken in the Central Province, north and west of Laua according to Ethnologue. Laua now has only one remaining speaker as of 1987, making it nearly extinct. There is little hope of recovering Laua since only one elder speaker remains. The last speaker was registered in 2000. Laua may even be extinct. It is classified as Trans-New Guinea, Southeast Papuan, Mailuan. Note that it is not the same thing as the Labu language of Morobe Province.
in scheme: Lexvo - ISO 639-3 language codes
notation: luf

Ganda
type: Language
type: Concept
ISO 639-1 code: lg
ISO 639-2 Bibliographical code: lug
ISO 639-2 Terminological code: lug
ISO 639-3 code: lug
alternative label: Ganda-Sprache @de
alternative label: Idioma luganda @es
alternative label: Lingua luganda @it
preferred label: Luganda
alternative label: Língua luganda @pt
alternative label: luganda @pt
definition: Ganda, or Luganda (Ganda: Oluganda ), is the major language of Uganda, spoken by over sixteen million Ganda and other people mainly in Southern Uganda, including the capital Kampala. It belongs to the Bantu branch of the Niger–Congo language family. Typologically, it is a highly agglutinating language with subject–verb–object word order and nominative–accusative morphosyntactic alignment.
in scheme: Lexvo - ISO 639-3 language codes
notation: lug
preferred label: ganda @es

Yorta Yorta
type: Language
type: Concept
ISO 639-3 code: xyy
alternative label: Yorta Yorta language
definition: Yorta Yorta (Yotayota) is a a dialect cluster, or perhaps a group of closely related languages, once spoken by Yorta Yorta people, Indigenous Australians from the junction of the Goulburn and Murray Rivers in present-day northeast Victoria. Dixon considers it an isolate.
in scheme: Lexvo - ISO 639-3 language codes
notation: xyy

Luiseno
type: Language
type: Concept
ISO 639-2 Bibliographical code: lui
ISO 639-2 Terminological code: lui
ISO 639-3 code: lui
alternative label: Idioma luiseño @es
alternative label: Luiseño @fr
alternative label: Luiseño language
definition: The Luiseño language is an Uto-Aztecan language of California spoken by the Luiseño, a Native American people who at the time of the first contacts with the Spanish in the 16th century inhabited the coastal area of southern California, ranging 50 miles from the southern part of Los Angeles County, California, to the northern part of San Diego County, California, and inland 30 miles. The people are called "Luiseño" due to their proximity to the Mission San Luis Rey de Francia.
in scheme: Lexvo - ISO 639-3 language codes
notation: lui
preferred label: Luiseno-Sprache @de
preferred label: luiseno @fr
preferred label: luiseño @es

Luna
type: Language
type: Concept
ISO 639-3 code: luj
in scheme: Lexvo - ISO 639-3 language codes
notation: luj

Lunanakha
type: Language
type: Concept
ISO 639-3 code: luk
alternative label: Lunana language
definition: Lunanakha (Dzongkha: ལུང་ནག་ན་ཁ་; Wylie: lung-nag-na-kha) is a Tibetan language spoken in Bhutan (Lunana Gewog, Gasa District) by some 1,700 people as of 1998. Most are yak-herding pastoralists. Lunanakha is closely related to Dzongkha, the national language of Bhutan.
in scheme: Lexvo - ISO 639-3 language codes
notation: luk

Olu'bo
type: Language
type: Concept
ISO 639-3 code: lul
alternative label: Olu'bo language
definition: Olubo is a Central Sudanic language spoken by 15.000 Olubo people in Southern Sudan
in scheme: Lexvo - ISO 639-3 language codes
notation: lul

Luimbi
type: Language
type: Concept
ISO 639-3 code: lum
in scheme: Lexvo - ISO 639-3 language codes
notation: lum

Lunda
type: Language
type: Concept
ISO 639-2 Bibliographical code: lun
ISO 639-2 Terminological code: lun
ISO 639-3 code: lun
alternative label: Lunda language
alternative label: Lunda-Sprache @de
preferred label: lunda @es
definition: Lunda, also known as Chilunda, is a Bantu language spoken in Zambia, Angola and, to a lesser extent, in the Democratic Republic of the Congo. Lunda and its dialects are spoken and understood by perhaps 2.6% of Zambians (1986 estimate), and the language is used mainly in the northern part of that country.
in scheme: Lexvo - ISO 639-3 language codes
notation: lun
preferred label: Chilunda @de

Luo
type: Language
type: Concept
ISO 639-2 Bibliographical code: luo
ISO 639-2 Terminological code: luo
ISO 639-3 code: luo
alternative label: Dholuo
alternative label: Luo (Kenya and Tanzania)
alternative label: Luo language
alternative label: Luo-Sprache @de
alternative label: Língua luo @pt
alternative label: luo (Kenya et Tanzanie) @fr
definition: The Luo language, Dholuo (pronounced ) or Luo proper, is the eponymous language of the Luo group of Nilotic languages, spoken by about 4.4 million Luo people of Kenya and Tanzania, who occupy parts of the eastern shore of Lake Victoria and areas to the south. It is used for broadcasts on KBC (Kenya Broadcasting Corporation, formerly the Voice of Kenya) and Radio Ramogi. Dholuo is closely related to Lango, Acholi, and Adhola of Uganda. It is somewhat more distantly related to Luwo, also a Western Nilotic language, spoken in Sudan.
in scheme: Lexvo - ISO 639-3 language codes
notation: luo
preferred label: luo @es

Lumbu
type: Language
type: Concept
ISO 639-3 code: lup
alternative label: Lumbu language
definition: Lumbu is a Bantu language spoken in Gabon and the Republic of Congo.
in scheme: Lexvo - ISO 639-3 language codes
notation: lup

Lucumi
type: Language
type: Concept
ISO 639-3 code: luq
alternative label: Lucumi language
definition: Lucumi is a Yoruba dialect spoken by practitioners of the Santería religion in Cuba, Puerto Rico, and Dominican Republic. It is also known as Yoruba and Santeria. Lucumi is a liturgical language used in Santeria's prayers, chants and songs.
in scheme: Lexvo - ISO 639-3 language codes
notation: luq
preferred label: Lukumí @de

Laura
type: Language
type: Concept
ISO 639-3 code: lur
in scheme: Lexvo - ISO 639-3 language codes
notation: lur

Mizo
type: Language
type: Concept
ISO 639-2 Bibliographical code: lus
ISO 639-2 Terminological code: lus
ISO 639-3 code: lus
alternative label: Lushai
alternative label: Lushai-Sprache @de
alternative label: Mizo language
preferred label: lushai @es
definition: The Mizo language (Mizo: Mizo ṭawng) is natively spoken by Mizo people in Mizoram, a state in the Indian Union; Chin State of Burma and in the Chittagong Hill Tracts of Bangladesh. The language is also known as Lushai (by the Colonial British), as Lusei people are the first clan who have an external exposure. For this reason, even in most of modern writings Lushai (or Lusei) is being used instead of Mizo.
in scheme: Lexvo - ISO 639-3 language codes
notation: lus

Zhang-Zhung
type: Language
type: Concept
ISO 639-3 code: xzh
alternative label: Zhang-Zhung language
definition: Zhang-Zhung is an extinct Tibeto-Burman language that was spoken in what is now western Tibet. The term Zhang-zhung language has been used to refer to two different entities. The first Old Zhang-zhung refers to the language which appears in a small number of documents preserved in Dunhuang. The language of these text was identified as Zhang-zhung by F. W. Thomas and this identification has been accepted by Takeuchi Tsuguhito (武内紹人). However, Dan Martin questions the wisdom of connecting the language of these texts to the language which occurs occasionally in the scriptures of the Bon religion.
in scheme: Lexvo - ISO 639-3 language codes
notation: xzh

Idioma lushootseed
type: Language
type: Concept
ISO 639-3 code: lut
alternative label: Lushootseed language
definition: Lushootseed (also xʷəlšucid, dxʷləšúcid, Puget Salish, Puget Sound Salish, Skagit-Nisqually) is the language or dialect continuum of several Salish Native American groups of modern-day Washington state. Lushootseed is a member of Coast Salish, one of the two main divisions of the Salishan language group.
in scheme: Lexvo - ISO 639-3 language codes
notation: lut
preferred label: Lushootseed

Lumba-Yakkha
type: Language
type: Concept
ISO 639-3 code: luu
in scheme: Lexvo - ISO 639-3 language codes
notation: luu

Luwati
type: Language
type: Concept
ISO 639-3 code: luv
alternative label: Luwati language
definition: Luwati is an Indo-Iranian language spoken by over 5,000 people (1996 census) in Oman of the Al-Lawati tribe.
in scheme: Lexvo - ISO 639-3 language codes
notation: luv

Luo
type: Language
type: Concept
ISO 639-3 code: luw
alternative label: Luo (Cameroon)
alternative label: Luo language
definition: The Luo language is an unclassified language spoken in a section of the Atta region of Cameroon. It is a critically endangered language, with only one speaker remaining as of 1995. Ethnologue calls it "nearly extinct," but admits that it is highly likely that this language is extinct.
in scheme: Lexvo - ISO 639-3 language codes
notation: luw

Luyia
type: Language
type: Concept
ISO 639-3 code: luy
alternative label: Luhya language
alternative label: Língua luhya @pt
alternative label: Olulujia @de
alternative label: Oluluyia
definition: Luhya (also Luyia, Luhia) is a Bantu dialect cluster spoken in the western part of Kenya by the Luhya people. Minor populations of Luhya speakers are also found in Uganda, especially in Busia. Although the Luhya principally occupy the Western province of Kenya, substantial populations have settled in the Kitale area of the Rift Valley Province. The Luhya population in Kenya is about 8,000,000, while those in Uganda and Tanzania account for about 50,000.
in scheme: Lexvo - ISO 639-3 language codes
notation: luy
preferred label: Luhya @de
preferred label: louhya @fr
preferred label: luyia @es

Southern Luri
type: Language
type: Concept
ISO 639-3 code: luz
alternative label: Luri, Southern
in scheme: Lexvo - ISO 639-3 language codes
notation: luz

Maku'a
type: Language
type: Concept
ISO 639-3 code: lva
alternative label: Makuv'a language
definition: Makuv'a, also spelled Makua and also known as Lovaea (Lovaia), is a nearly extinct Austronesian language spoken at the northeast tip of East Timor near the town of Tutuala.
in scheme: Lexvo - ISO 639-3 language codes
notation: lva

Lavukaleve
type: Language
type: Concept
ISO 639-3 code: lvk
alternative label: Lavukaleve language
definition: Lavukaleve is one of the four Central Solomons languages of the Solomon Islands. It is thus assumed to be the descendant of the languages spoken in the Solomon Islands before the spread of the much more numerous Austronesian languages. The name Lavukaleve derives from the ethnonym Lavukal. The Lavukals are the indigenous peoples of the Russell Islands, part of the Solomon Islands Central Province. A comprehensive grammatical description of Lavukaleve was published by the linguist Angela Terrill in 2003.
in scheme: Lexvo - ISO 639-3 language codes
notation: lvk

Latvian language
type: Language
type: Concept
ISO 639-3 code: lvs
alternative label: Latvian, Standard
alternative label: Standard Latvian
definition: Latvian (latviešu valoda) is the official state language of Latvia. It is also sometimes referred to as Lettish. There are about 1.4 million native Latvian speakers in Latvia and about 150,000 abroad. The Latvian language has a relatively large number of non-native speakers, atypical for a small language. Because of the language policy in Latvia about 1.9 million or 79% of Latvian population speak Latvian. The use of the Latvian language in various areas of social life in Latvia is increasing.
in scheme: Lexvo - ISO 639-3 language codes
notation: lvs
preferred label: Idioma letón @es
preferred label: Lettische Sprache @de
preferred label: Letton @fr
preferred label: Lingua lettone @it
preferred label: Língua letã @pt

Levuka
type: Language
type: Concept
ISO 639-3 code: lvu
in scheme: Lexvo - ISO 639-3 language codes
notation: lvu

Lwalu
type: Language
type: Concept
ISO 639-3 code: lwa
alternative label: Lwalu language
definition: Lwalu, also known as Lwalwa, is a Bantu language of the Democratic Republic of the Congo. Its classification is uncertain: Nurse (2003), following Ahmed (1995), assigns all of Guthrie's L.20 languages to Luban, and Lwalu is L.23. Ehret, however, places it as a distant relative of many of the Zone B and C languages.
in scheme: Lexvo - ISO 639-3 language codes
notation: lwa

Zemgalian
type: Language
type: Concept
ISO 639-3 code: xzm
alternative label: Semigallian language
definition: Semigallian is an extinct language of the Baltic language sub-family of the Indo-European languages.
in scheme: Lexvo - ISO 639-3 language codes
notation: xzm
preferred label: Lingua semigallica @it
preferred label: Sémigalien @fr

Lewo Eleng
type: Language
type: Concept
ISO 639-3 code: lwe
in scheme: Lexvo - ISO 639-3 language codes
notation: lwe

Wanga
type: Language
type: Concept
ISO 639-3 code: lwg
alternative label: Oluwanga
in scheme: Lexvo - ISO 639-3 language codes
notation: lwg

White Lachi
type: Language
type: Concept
ISO 639-3 code: lwh
alternative label: Lachi, White
in scheme: Lexvo - ISO 639-3 language codes
notation: lwh

Eastern Lawa
type: Language
type: Concept
ISO 639-3 code: lwl
alternative label: Lawa, Eastern
in scheme: Lexvo - ISO 639-3 language codes
notation: lwl

Laomian
type: Language
type: Concept
ISO 639-3 code: lwm
in scheme: Lexvo - ISO 639-3 language codes
notation: lwm

Luwo
type: Language
type: Concept
ISO 639-3 code: lwo
alternative label: Luwo language
definition: Dheluo (also known as Luwo or Luo) is a language spoken by Jo Luo people of Bahr el Ghazal region in South Sudan. The language is most prominently spoken in western and northern parts of Bahr El Ghazal. These people are one of the Luo peoples of East Africa.
in scheme: Lexvo - ISO 639-3 language codes
notation: lwo

Lewotobi
type: Language
type: Concept
ISO 639-3 code: lwt
in scheme: Lexvo - ISO 639-3 language codes
notation: lwt

Lawu
type: Language
type: Concept
in scheme: Lexvo - ISO 639-3 language codes

Lewo
type: Language
type: Concept
ISO 639-3 code: lww
in scheme: Lexvo - ISO 639-3 language codes
notation: lww

Layakha
type: Language
type: Concept
ISO 639-3 code: lya
alternative label: Laya language
definition: Layakha (Dzongkha: ལ་ཡ་ཁ་, ལ་ཡག་ཁ་; Wylie: la-ya-kha, la-yag-kha) is a Tibeto-Burman language spoken by indigenous Layaps inhabiting the high mountains of northwest Bhutan in the village of Laya, Gasa District. Speakers also inhabit the northern regions of Thimphu (Lingzhi Gewog) and Punakha Districts. Its speakers are ethnically related to Tibetans. Most speakers live at an altitude of , just below the Tsendagang peak. Layakha speakers are also called Bjop by the Bhutanese, sometimes considered a condescending term. Their population in 2003 stood at 1,100.
in scheme: Lexvo - ISO 639-3 language codes
notation: lya

Lyngngam
type: Language
type: Concept
ISO 639-3 code: lyg
in scheme: Lexvo - ISO 639-3 language codes
notation: lyg

Luyana
type: Language
type: Concept
ISO 639-3 code: lyn
alternative label: Luyana language
definition: Luyana (Louyi, Lui, Luyi, Rouyi) is a Bantu language spoken by almost half a million people in Zambia and in discontinuous areas of Nambia and Angola. It appears to be an divergent lineage of Bantu.
in scheme: Lexvo - ISO 639-3 language codes
notation: lyn

Literary Chinese
type: Language
type: Concept
ISO 639-3 code: lzh
alternative label: Chinese, Literary
alternative label: Classical Chinese
definition: Classical Chinese or Literary Chinese (古文/文言) is a traditional style of written Chinese based on the grammar and vocabulary of ancient Chinese, making it different from any modern spoken form of Chinese. Classical Chinese was used for almost all formal correspondence in China until the early 20th century, and also, during various periods, in Japan, Korea and Vietnam. Among Chinese speakers, Classical Chinese has been largely replaced by written vernacular Chinese (; pinyin: báihuà, "plain speech"), a style of writing that is similar to modern spoken Mandarin Chinese, while speakers of non-Chinese languages have largely abandoned Classical Chinese in favor of local vernaculars.
in scheme: Lexvo - ISO 639-3 language codes
notation: lzh
preferred label: Chino clásico @es
preferred label: Chinois classique @fr
preferred label: Klassisches Chinesisch @de

Ancient Zapotec
type: Language
type: Concept
ISO 639-3 code: xzp
alternative label: Zapotec, Ancient
in scheme: Lexvo - ISO 639-3 language codes
notation: xzp

Litzlitz
type: Language
type: Concept
ISO 639-3 code: lzl
in scheme: Lexvo - ISO 639-3 language codes
notation: lzl

Leinong Naga
type: Language
type: Concept
ISO 639-3 code: lzn
alternative label: Naga, Leinong
in scheme: Lexvo - ISO 639-3 language codes
notation: lzn

Laz
type: Language
type: Concept
ISO 639-3 code: lzz
alternative label: Laz language
definition: The Laz language (ლაზური ნენა, lazuri nena; , lazuri ena, or ჭანური ენა, č'anuri ena, also chanuri ena; ) is a South Caucasian language (also known as Kartvelian language) spoken by the Laz people on the Southeast shore of the Black Sea. It is estimated that there are around 30,000 native speakers of Laz in Turkey, in a strip of land extending from Melyat to the Georgian border (officially called Lazistan until 1925), and about 2,000 in Georgia. | c | |- | ძ | z’ | ʒ | |- | წ | ts’, or з’ | ċ | |- | ჭ | ç’ | č’ | |- | ხ | x | x | |- | ჯ | c | ǯ | |- | ჰ | h | h | |- | ჶ | f | f | |}
in scheme: Lexvo - ISO 639-3 language codes
notation: lzz
preferred label: Idioma laz @es
preferred label: Lasische Sprache @de
preferred label: Laze @fr
preferred label: Lingua laz @it
preferred label: Língua laz @pt

San Jerónimo Tecóatl Mazatec
type: Language
type: Concept
ISO 639-3 code: maa
alternative label: Mazatec, San Jerónimo Tecóatl
in scheme: Lexvo - ISO 639-3 language codes
notation: maa

Yutanduchi Mixtec
type: Language
type: Concept
ISO 639-3 code: mab
alternative label: Mixtec, Yutanduchi
in scheme: Lexvo - ISO 639-3 language codes
notation: mab

Madurese
type: Language
type: Concept
ISO 639-2 Bibliographical code: mad
ISO 639-2 Terminological code: mad
ISO 639-3 code: mad
alternative label: Língua maduresa @pt
alternative label: Madurais @fr
alternative label: Madurese language
alternative label: Maduresisch @de
alternative label: madourais @fr
definition: Madurese is a language of the Madurese people of Madura Island and eastern Java, Indonesia; it is also spoken on the neighbouring small Kangean Islands and Sapudi Islands, as well as from migrants to other parts of Indonesia, namely the Tapal Kuda area comprising Pasuruan, Surabaya, Malang until Banyuwangi, Masalembu Islands, even some on Kalimantan. The Kangean dialect may be a separate language. It was traditionally written in the Javanese script, but the Latin script is now more commonly used. The number of speakers, though shrinking, is estimated to be 8-13 million.
in scheme: Lexvo - ISO 639-3 language codes
notation: mad
preferred label: Madura @de
preferred label: madurais @fr
preferred label: madurese @it
preferred label: madurés @es
preferred label: madurês @pt

Bo-Rukul
type: Language
type: Concept
ISO 639-3 code: mae
alternative label: Barkul language
definition: Barkul is a Plateau language of Nigeria. The two dialects, Bo and Rukul, are notable distinct. The classification of Barkul is unclear, but it appears to be closest to Fyam and Horom.
in scheme: Lexvo - ISO 639-3 language codes
notation: mae

Mafa
type: Language
type: Concept
ISO 639-3 code: maf
alternative label: Mafa language
preferred label: mafa @es
definition: Mafa is an Afro-Asiatic language spoken in northern Cameroon and eastern Nigeria.
in scheme: Lexvo - ISO 639-3 language codes
notation: maf

Yaminahua
type: Language
type: Concept
ISO 639-3 code: yaa
alternative label: Yaminahua language
definition: The Yaminahua language is a Panoan language in Western Amazonia.
in scheme: Lexvo - ISO 639-3 language codes
notation: yaa

Magahi
type: Language
type: Concept
ISO 639-2 Bibliographical code: mag
ISO 639-2 Terminological code: mag
ISO 639-3 code: mag
alternative label: Lingua magadhi @it
alternative label: Magahi language
preferred label: magahi @fr
definition: The Magahi language (Devanagari: मगही; also known as Magadhi, मगधी) is a language spoken in India. Magadhi Prakrit was the ancestor of Magadhi, from which the latter's name derives. The ancestral language, Magadhi Prakrit, is believed to be the language spoken by the Buddha, and the language of the ancient kingdom of Magadha. Magadhi is closely related to Bhojpuri and Maithili, and these languages are sometimes referred to as a single language, Bihari. These languages, together with several other related languages, are known as the Bihari languages, which form a sub-group of the Eastern Zone of Indo-Aryan languages. Magadhi has approximately 18 million speakers.
in scheme: Lexvo - ISO 639-3 language codes
notation: mag
preferred label: Khotta @de

Marshallese
type: Language
type: Concept
ISO 639-1 code: mh
ISO 639-2 Bibliographical code: mah
ISO 639-2 Terminological code: mah
ISO 639-3 code: mah
alternative label: Idioma marshalés @es
alternative label: Lingua marshallese @it
alternative label: Língua marshalesa @pt
alternative label: Marshallais @fr
alternative label: Marshallese language
alternative label: Marshallesische Sprache @de
definition: The Marshallese language (Marshallese: , or in older orthography , pronounced ) is a Malayo-Polynesian language of the Marshall Islands, and the principal language of the country. There are two major dialects: Rālik (western) and Ratak (eastern).
in scheme: Lexvo - ISO 639-3 language codes
notation: mah
preferred label: Marschallesisch @de
preferred label: marshall @fr
preferred label: marshallese @it
preferred label: marshalés @es
preferred label: marshalês @pt

Maithili
type: Language
type: Concept
ISO 639-2 Bibliographical code: mai
ISO 639-2 Terminological code: mai
ISO 639-3 code: mai
alternative label: Lingua maithili @it
alternative label: Língua maithili @pt
alternative label: Maithili language
alternative label: Maïthili @fr
definition: Maithili language (मैथिली, মৈথিলী, Maithilī) is spoken in the eastern region of India and South-eastern region of Nepal. The native speakers of Maithili reside in Bihar, Jharkhand, parts of West Bengal and South-east Nepal. The cultural and linguistic centers of Maithili in Bihar are the districts of Madhubani, Supaul, Araria, Darbhanga, Sitamarhi, Saharsa, Begusarai, Muzaffarpur, Sheohar, Samastipur, and Vaishali . Maithili is also spoken in the Terai region of Nepal, mainly in Narayani Zone, Janakpur Zone, Koshi Zone, and Sagarmatha Zone of Nepal. It is the second largest spoken language of Nepal (around 12%).
in scheme: Lexvo - ISO 639-3 language codes
notation: mai
preferred label: maithili @es

Jalapa De Díaz Mazatec
type: Language
type: Concept
ISO 639-3 code: maj
alternative label: Jalapa Mazatec language
alternative label: Mazatec, Jalapa De Díaz
definition: Jalapa Mazatec is a Mazatecan language, spoken by ca. 15,000 people, one-third of whom are monolingual, in 13 villages in the vicinity of the town of San Felipe Jalapa de Díaz in the Tuxtepec District of the Mexican state of Oaxaca. It is most closely related to Ixcatlán Mazatec, and somewhat more distantly related to the prestige variety of Mazatec, Huautla. Literacy in Jalapa is taught alongside Spanish in local schools.
in scheme: Lexvo - ISO 639-3 language codes
notation: maj
preferred label: Mazatèque de Jalapa @fr

Makasar
type: Language
type: Concept
ISO 639-2 Bibliographical code: mak
ISO 639-2 Terminological code: mak
ISO 639-3 code: mak
alternative label: Língua makassaresa @pt
alternative label: Makassar-Sprache @de
alternative label: Makassarese language
alternative label: makassar @fr
definition: Makassarese (sometimes spelled Makasar, Makassar, or Macassar) is a language used by the Makassarese people in South Sulawesi island (Celebes) in Indonesia. It is a member of the Austronesian language family of the South Sulawesi group, and thus closely related to, among others, Buginese.
in scheme: Lexvo - ISO 639-3 language codes
notation: mak
preferred label: Makassar @fr
preferred label: Makassarisch @de
preferred label: macasar @es
preferred label: makasar @it

Malayalam
type: Language
type: Concept
ISO 639-1 code: ml
ISO 639-2 Bibliographical code: mal
ISO 639-2 Terminological code: mal
ISO 639-3 code: mal
alternative label: Lingua malayalam @it
alternative label: Língua malaiala @pt
definition: Malayalam (pronounced ; , ), is one of the four major Dravidian languages of southern India. It is one of the 22 scheduled languages of India with official language status in the state of Kerala and the union territories of Lakshadweep and Pondicherry. It is spoken by 35.9 million people. Overseas it is also used by a small population of Indian expatriates living around the globe.
in scheme: Lexvo - ISO 639-3 language codes
notation: mal
preferred label: malaiala @pt
preferred label: malayalam @es

Idioma mam
type: Language
type: Concept
ISO 639-3 code: mam
alternative label: Mam language
definition: Mam is a Mayan language with almost 480,000 speakers as of 2002, spoken in the Mexican state of Chiapas and the Guatemalan departments of Quetzaltenango, Huehuetenango, San Marcos, and Retalhuleu. There are also thousands of Mam speakers in California, United States.
in scheme: Lexvo - ISO 639-3 language codes
notation: mam
preferred label: Língua mam @pt
preferred label: Mam

Manding
type: Language
type: Concept
ISO 639-2 Bibliographical code: man
ISO 639-2 Terminological code: man
ISO 639-3 code: man
alternative label: Mandingo
in scheme: Lexvo - ISO 639-3 language codes
notation: man
preferred label: Manding-Sprache @de
preferred label: mandinga @pt
preferred label: mandingo @es
preferred label: mandingue @fr

Chiquihuitlán Mazatec
type: Language
type: Concept
ISO 639-3 code: maq
alternative label: Mazatec, Chiquihuitlán
in scheme: Lexvo - ISO 639-3 language codes
notation: maq

Marathi
type: Language
type: Concept
ISO 639-1 code: mr
ISO 639-2 Bibliographical code: mar
ISO 639-2 Terminological code: mar
ISO 639-3 code: mar
alternative label: Idioma maratí @es
alternative label: Lingua marathi @it
alternative label: Língua marata @pt
alternative label: Marathi language
definition: Marathi (; ) is an Indo-Aryan language spoken by the Marathi people of western and central India. There are over 68 million fluent speakers worldwide. and is the fifteenth most spoken language in the world. Marathi has some of the oldest literature of all modern Indo-Aryan languages, dating from about 1000 AD. The major dialects of Marathi are called Standard Marathi and Warhadi Marathi. There are a few other sub-dialects like Ahirani, Dangi, Vadvali, Samavedi, Khandeshi, and Malwani. Standard Marathi is the official language of the State of Maharashtra.
in scheme: Lexvo - ISO 639-3 language codes
notation: mar
preferred label: marata @pt
preferred label: marathe @fr
preferred label: marathi @es

Masai
type: Language
type: Concept
ISO 639-2 Bibliographical code: mas
ISO 639-2 Terminological code: mas
ISO 639-3 code: mas
alternative label: Kwavi dialect
alternative label: massaï @fr
definition: Kwavi is the dialect of Maasai spoken by the Kwavi people ( Parakuyo or Baraguyu) of Tanzania. It was formerly listed as "unclassified" by the Ethnologue, which corrected this mistake in the 15th edition by incorporating it in Maasai.
in scheme: Lexvo - ISO 639-3 language codes
notation: mas
preferred label: Massai-Sprache @de
preferred label: masai @es
preferred label: massai @pt

San Francisco Matlatzinca
type: Language
type: Concept
ISO 639-3 code: mat
alternative label: Matlatzinca, San Francisco
in scheme: Lexvo - ISO 639-3 language codes
notation: mat

Yuhup
type: Language
type: Concept
ISO 639-3 code: yab
in scheme: Lexvo - ISO 639-3 language codes
notation: yab

Huautla Mazatec
type: Language
type: Concept
ISO 639-3 code: mau
alternative label: Mazatec, Huautla
in scheme: Lexvo - ISO 639-3 language codes
notation: mau

Sateré-Mawé
type: Language
type: Concept
ISO 639-3 code: mav
alternative label: Mawé language
definition: The Mawe language of Brazil, also known as Sataré (Mabue, Maragua, Andira, Arapium), is one of the Tupian languages. It is spoken by 7000, many of them monolingual.
in scheme: Lexvo - ISO 639-3 language codes
notation: mav

Mampruli
type: Language
type: Concept
ISO 639-3 code: maw
alternative label: Mampruli language
definition: Mampruli is a Gur language spoken in Ghana.
in scheme: Lexvo - ISO 639-3 language codes
notation: maw

North Moluccan Malay
type: Language
type: Concept
ISO 639-3 code: max
alternative label: Malay, North Moluccan
in scheme: Lexvo - ISO 639-3 language codes
notation: max

Central Mazahua
type: Language
type: Concept
ISO 639-3 code: maz
alternative label: Mazahua, Central
in scheme: Lexvo - ISO 639-3 language codes
notation: maz

Higaonon
type: Language
type: Concept
ISO 639-3 code: mba
in scheme: Lexvo - ISO 639-3 language codes
notation: mba

Western Bukidnon Manobo
type: Language
type: Concept
ISO 639-3 code: mbb
alternative label: Manobo, Western Bukidnon
in scheme: Lexvo - ISO 639-3 language codes
notation: mbb

Pass Valley Yali
type: Language
type: Concept
ISO 639-3 code: yac
alternative label: Yali, Pass Valley
in scheme: Lexvo - ISO 639-3 language codes
notation: yac

Macushi
type: Language
type: Concept
ISO 639-3 code: mbc
alternative label: Macushi language
definition: Macushi is the most populous of the Cariban languages, spoken by 30,000 in Brazil and Guyana. It is also spelled Makushi, Makusi, Makuxi, Macusi, Macussi, and also known as Teweya (Teueia).
in scheme: Lexvo - ISO 639-3 language codes
notation: mbc
preferred label: Idioma macushi @es

Dibabawon Manobo
type: Language
type: Concept
ISO 639-3 code: mbd
alternative label: Manobo, Dibabawon
in scheme: Lexvo - ISO 639-3 language codes
notation: mbd

Molale
type: Language
type: Concept
ISO 639-3 code: mbe
alternative label: Molala language
definition: Molala (Molele, Molalla) is the extinct and poorly attested Plateau Penutian language of the Molala people. It is first attested along the Deschutes River, and later moved to the Molalla and Santiam rivers, and to the headwaters of the Umpqua and Rogue rivers. It was once thought to be close to Cayuse. There were three known dialects:
in scheme: Lexvo - ISO 639-3 language codes
notation: mbe
preferred label: Idioma molala @es

Baba Malay
type: Language
type: Concept
ISO 639-3 code: mbf
alternative label: Malay, Baba
in scheme: Lexvo - ISO 639-3 language codes
notation: mbf

Mangseng
type: Language
type: Concept
ISO 639-3 code: mbh
in scheme: Lexvo - ISO 639-3 language codes
notation: mbh

Ilianen Manobo
type: Language
type: Concept
ISO 639-3 code: mbi
alternative label: Manobo, Ilianen
in scheme: Lexvo - ISO 639-3 language codes
notation: mbi

Nadëb
type: Language
type: Concept
ISO 639-3 code: mbj
alternative label: Nadëb language
definition: Nadëb is a Nadahup language of the Brazilian Amazon, along the Uneiuxi, Japura, and Negro rivers. Various names for it include Nadöbö, Xïriwai, Hahöb, Guariba/Wariwa, Kaborí, Anodöub, sometimes compounded with the term Maku.
in scheme: Lexvo - ISO 639-3 language codes
notation: mbj

Malol
type: Language
type: Concept
ISO 639-3 code: mbk
in scheme: Lexvo - ISO 639-3 language codes
notation: mbk

Yagua
type: Language
type: Concept
ISO 639-3 code: yad
alternative label: Yagua language
definition: The Yagua language is spoken by the Yagua people, primarily in northeastern Peru. As of 2005, it appears that a few speakers may have migrated northward across the Peruvian-Colombian border near the town of Leticia. A third of the population is monolingual, and Yagua is the language of instruction in local primary schools.
in scheme: Lexvo - ISO 639-3 language codes
notation: yad

Maxakalí
type: Language
type: Concept
ISO 639-3 code: mbl
alternative label: Maxakalí language
definition: Maxakalí is a Maxakalían language spoken in fourteen villages in Minas Gerais, Brazil, by fewer than a thousand people.
in scheme: Lexvo - ISO 639-3 language codes
notation: mbl
preferred label: Língua maxakalí @pt
preferred label: Machacali @fr

Ombamba
type: Language
type: Concept
ISO 639-3 code: mbm
alternative label: Ombamba language
definition: Ombamba (Mbaama, Lembaamba) is a Bantu language spoken in the Bambama District (Lekoumou Region) of the Republic of Congo and in Haut-Ogooué Province, south of Okondja, in Gabon by the Obamba people.
in scheme: Lexvo - ISO 639-3 language codes
notation: mbm

Macaguán
type: Language
type: Concept
ISO 639-3 code: mbn
alternative label: Macaguán language
definition: Macaguán is a Guahiban language that was spoken by about 400 people in Colombia. Many of its speakers are monoglots.
in scheme: Lexvo - ISO 639-3 language codes
notation: mbn

Mbo
type: Language
type: Concept
ISO 639-3 code: mbo
alternative label: Mbo (Cameroon)
alternative label: Mbo language
definition: Mboo, also Manenguba, Sambo, is a language spoken in Cameroon by the Mbo people. A variety, Bafong, is reported for an area along the main road going north from Kumba. (J.A.Biddulph (talk) 20:25, 6 February 2012 (UTC))
in scheme: Lexvo - ISO 639-3 language codes
notation: mbo

Malayo
type: Language
type: Concept
ISO 639-3 code: mbp
alternative label: Wiwa language
definition: Damana (also known as Wiwa, Guamaco, Malayo, Sanja or Arosario) is a Chibchan language spoken by around 2000 Wiwa south and east of Sierra Nevada de Santa Marta in northern Colombia.
in scheme: Lexvo - ISO 639-3 language codes
notation: mbp
preferred label: Damana @fr

Maisin
type: Language
type: Concept
ISO 639-3 code: mbq
alternative label: Maisin language
definition: Maisin (or Maisan) is a language of Papua New Guinea with both Austronesian and Papuan features. The Austronesian elements are those of the Nuclear Papuan Tip languages. The Papuan element is Binanderean or Dagan. It is spoken by the Maisin people of Oro Province.
in scheme: Lexvo - ISO 639-3 language codes
notation: mbq

Nukak Makú
type: Language
type: Concept
ISO 639-3 code: mbr
alternative label: Nukak language
definition: The Nukak language is a tone language, perhaps part of the small Nadahup (Makú) language family. It is mutually intelligible with Kakwa.
in scheme: Lexvo - ISO 639-3 language codes
notation: mbr
preferred label: Idioma nukak @es
preferred label: Nukak @fr

Sarangani Manobo
type: Language
type: Concept
ISO 639-3 code: mbs
alternative label: Manobo, Sarangani
in scheme: Lexvo - ISO 639-3 language codes
notation: mbs

Matigsalug Manobo
type: Language
type: Concept
ISO 639-3 code: mbt
alternative label: Manobo, Matigsalug
in scheme: Lexvo - ISO 639-3 language codes
notation: mbt

Mbula-Bwazza
type: Language
type: Concept
ISO 639-3 code: mbu
alternative label: Mbula-Bwazza language
definition: Mbula-Bwazza is one of the Jarawan Bantu languages of Nigeria. It is a dialect cluster; Blench (2011) divides it into several languages, as follows: * Bwazza * Mbula: Mbula, Tambo, Kula, Gwamba.
in scheme: Lexvo - ISO 639-3 language codes
notation: mbu

Mbulungish
type: Language
type: Concept
ISO 639-3 code: mbv
alternative label: Mbulungish language
definition: Mbulungish is a Senegambian language of Guinea.
in scheme: Lexvo - ISO 639-3 language codes
notation: mbv
preferred label: Mbulungische Sprache @de

Mairasi
type: Language
type: Concept
ISO 639-3 code: zrs
alternative label: Mairasi language
definition: Mairasi ( Faranyao and Kaniran) is a Papuan language of the Bomberai Peninsula of Papua, Indonesia.
in scheme: Lexvo - ISO 639-3 language codes
notation: zrs

Maring
type: Language
type: Concept
ISO 639-3 code: mbw
alternative label: Maring language
definition: Maring (Mareng), or Yoadabe-Watoare, is a Trans–New Guinea language of the Chimbu–Wahgi branch spoken in the highlands of Papua New Guinea. Dialects are Central Maring, Eastern Maring, Timbunki, Tsuwenki, Karamba, Kambegl; Central Maring is understood by all.
in scheme: Lexvo - ISO 639-3 language codes
notation: mbw

Pumé
type: Language
type: Concept
ISO 639-3 code: yae
alternative label: Yaruro language
definition: Yaruro (also spelled Llaruro or Yaruru; also called Yuapín or Pumé) is an indigenous language language spoken along the Orinoco, Sinaruco, Meta, and Apure rivers of Venezuela. It is not well classified; it may be an isolate, or distantly related to the extinct Esmeralda language.
in scheme: Lexvo - ISO 639-3 language codes
notation: yae
preferred label: Idioma yaruro @es
preferred label: Yaruro @fr

Mari
type: Language
type: Concept
ISO 639-3 code: mbx
alternative label: Mari (East Sepik Province)
in scheme: Lexvo - ISO 639-3 language codes
notation: mbx

Memoni
type: Language
type: Concept
ISO 639-3 code: mby
in scheme: Lexvo - ISO 639-3 language codes
notation: mby

Amoltepec Mixtec
type: Language
type: Concept
ISO 639-3 code: mbz
alternative label: Mixtec, Amoltepec
in scheme: Lexvo - ISO 639-3 language codes
notation: mbz

Maca
type: Language
type: Concept
ISO 639-3 code: mca
alternative label: Maká language
definition: Maká is a Matacoan language spoken in Paraguay by the Maká people. Its 1500 speakers live primarily in Presidente Hayes Department near the Río Negro, as well as in and around Asunción.
in scheme: Lexvo - ISO 639-3 language codes
notation: mca
preferred label: Maká @fr

Machiguenga
type: Language
type: Concept
ISO 639-3 code: mcb
alternative label: Machiguenga language
definition: Machiguenga (Matsigenka) is a major Arawakan language of Peru. It is close enough to Nomatsiguenga to sometimes be considered dialects of a single language, especially given that both are spoken by the Machiguenga people.
in scheme: Lexvo - ISO 639-3 language codes
notation: mcb

Bitur
type: Language
type: Concept
ISO 639-3 code: mcc
in scheme: Lexvo - ISO 639-3 language codes
notation: mcc

Sharanahua
type: Language
type: Concept
ISO 639-3 code: mcd
alternative label: Sharanawa language
definition: Sharanawa is a Panoan language of Peru. There are 200 Sharanawa in Brazil, but they no longer speak the language.
in scheme: Lexvo - ISO 639-3 language codes
notation: mcd

Itundujia Mixtec
type: Language
type: Concept
ISO 639-3 code: mce
alternative label: Mixtec, Itundujia
in scheme: Lexvo - ISO 639-3 language codes
notation: mce

Matsés
type: Language
type: Concept
ISO 639-3 code: mcf
alternative label: Matsés language
definition: The Matsés language (sometimes called Mayoruna) is an indigenous language of the Peruvian and Brazilian Amazon basin which belongs to the Panoan language family and is spoken by ca. 2000 Matsés people (Fleck 2006). The language is vigorous and is spoken by all age groups in the Matsés communities. In the Matsés communities several other indigenous languages are also spoken by women who have been captured from neighboring tribes and some mixture of the languages occur (Fields & Wise 1976 p. 1, Fleck 2006 p. 542).
in scheme: Lexvo - ISO 639-3 language codes
notation: mcf
preferred label: Matses @fr

Mapoyo
type: Language
type: Concept
ISO 639-3 code: mcg
alternative label: Mapoyo language
definition: Mapoyo is a Carib language spoken along the Suapure and Parguaza Rivers, Venezuela. The ethnic population is about 365.
in scheme: Lexvo - ISO 639-3 language codes
notation: mcg

Maquiritari
type: Language
type: Concept
ISO 639-3 code: mch
alternative label: Ye'kuana language
definition: Maquiritari, Dekwana or Ye'kuana, is a Cariban language of Venezuela, with a few hundred speakers in Brazil.
in scheme: Lexvo - ISO 639-3 language codes
notation: mch

Mese
type: Language
type: Concept
ISO 639-3 code: mci
in scheme: Lexvo - ISO 639-3 language codes
notation: mci

Mvanip
type: Language
type: Concept
ISO 639-3 code: mcj
in scheme: Lexvo - ISO 639-3 language codes
notation: mcj

Yaka
type: Language
type: Concept
ISO 639-3 code: yaf
alternative label: Yaka (Democratic Republic of Congo)
alternative label: Yaka language
definition: Yaka, also spelled Iaca and Iyaka, is a Bantu language spoken in the Democratic Republic of the Congo and Angola. There are two dialects, Yaka proper and Ngoongo.
in scheme: Lexvo - ISO 639-3 language codes
notation: yaf
preferred label: Kiyaka @de

Mbunda
type: Language
type: Concept
ISO 639-3 code: mck
alternative label: Mbunda language
definition: Mbunda is a Bantu language of Zambia and Angola.
in scheme: Lexvo - ISO 639-3 language codes
notation: mck

Macaguaje
type: Language
type: Concept
ISO 639-3 code: mcl
in scheme: Lexvo - ISO 639-3 language codes
notation: mcl

Kristang language
type: Language
type: Concept
ISO 639-3 code: mcm
alternative label: Creole Portuguese, Malaccan
alternative label: Malaccan Creole Portuguese
definition: Papiá Kristang ("Christian language"), or just Kristang, is a creole language. It is spoken by the Kristang, a community of people of mixed Portuguese and Asian ancestry, chiefly in Malacca (Malaysia) and Singapore.
in scheme: Lexvo - ISO 639-3 language codes
notation: mcm
preferred label: Língua cristã @pt

Masana
type: Language
type: Concept
ISO 639-3 code: mcn
alternative label: Massa language
definition: Massa (or Masana, Masa) is a language spoken in southern Chad and northern Cameroon. It is a Chadic language with approximately 200,000 speakers.
in scheme: Lexvo - ISO 639-3 language codes
notation: mcn
preferred label: Massa @fr

Coatlán Mixe
type: Language
type: Concept
ISO 639-3 code: mco
alternative label: Mixe, Coatlán
in scheme: Lexvo - ISO 639-3 language codes
notation: mco

Makaa
type: Language
type: Concept
ISO 639-3 code: mcp
alternative label: Makaa language
definition: Makaa is a Bantu language of Cameroon.
in scheme: Lexvo - ISO 639-3 language codes
notation: mcp

Ese
type: Language
type: Concept
ISO 639-3 code: mcq
alternative label: Ese language
definition: Ese (Managalasi) is a language of Papua New Guinea. Dialects are Muaturaina, Chimona, Dea, Akabafa, Nami, Mesari, Averi, Afore, Minjori, Oko, Wakue, Numba, Jimuni, Karira. 40% of speakers are monolingual.
in scheme: Lexvo - ISO 639-3 language codes
notation: mcq

Menya
type: Language
type: Concept
ISO 639-3 code: mcr
alternative label: Menya language
definition: Menya (Menyama, Menye) is an Angan language of Papua New Guinea.
in scheme: Lexvo - ISO 639-3 language codes
notation: mcr

Mambai
type: Language
type: Concept
ISO 639-3 code: mcs
in scheme: Lexvo - ISO 639-3 language codes
notation: mcs

Mengisa
type: Language
type: Concept
ISO 639-3 code: mct
in scheme: Lexvo - ISO 639-3 language codes
notation: mct

Cameroon Mambila
type: Language
type: Concept
ISO 639-3 code: mcu
alternative label: Mambila, Cameroon
in scheme: Lexvo - ISO 639-3 language codes
notation: mcu

Minanibai
type: Language
type: Concept
ISO 639-3 code: mcv
in scheme: Lexvo - ISO 639-3 language codes
notation: mcv

Mawa
type: Language
type: Concept
ISO 639-3 code: mcw
alternative label: Mawa (Chad)
alternative label: Mawa language
definition: Mawa (also known as Mahwa, Mahoua) is an Afro-Asiatic language spoken in central Chad.
in scheme: Lexvo - ISO 639-3 language codes
notation: mcw

Yámana
type: Language
type: Concept
ISO 639-3 code: yag
alternative label: Yaghan language
definition: Yagán (originally Yahgan, but also now spelled Yaghan, Jagan, Iakan), also known as Yámana and Háusi Kúta, is one of the indigenous languages of Tierra del Fuego, spoken by the Yagán people. It is regarded as a language isolate, although some linguists have attempted to relate it to Kawésqar and Chon.
in scheme: Lexvo - ISO 639-3 language codes
notation: yag
preferred label: Idioma yagán @es
preferred label: Língua yagan @pt
preferred label: Yagan @fr

Mpiemo
type: Language
type: Concept
ISO 639-3 code: mcx
in scheme: Lexvo - ISO 639-3 language codes
notation: mcx

South Watut
type: Language
type: Concept
ISO 639-3 code: mcy
alternative label: Watut, South
in scheme: Lexvo - ISO 639-3 language codes
notation: mcy

Mawan
type: Language
type: Concept
ISO 639-3 code: mcz
in scheme: Lexvo - ISO 639-3 language codes
notation: mcz

Mada
type: Language
type: Concept
ISO 639-3 code: mda
alternative label: Mada (Nigeria)
alternative label: Mada language
definition: Mada is a regionally important Plateau language of Nigeria.
in scheme: Lexvo - ISO 639-3 language codes
notation: mda

Morigi
type: Language
type: Concept
ISO 639-3 code: mdb
in scheme: Lexvo - ISO 639-3 language codes
notation: mdb

Male
type: Language
type: Concept
ISO 639-3 code: mdc
alternative label: Male (Papua New Guinea)
in scheme: Lexvo - ISO 639-3 language codes
notation: mdc

Mboum
type: Language
type: Concept
ISO 639-3 code: mdd
alternative label: Mbum language
definition: Mbum is an Adamawa language of Cameroon spoken by about 51,000 people. Speakers are mostly bilingual in Fulfulde. It is also known as Buna, Mboum, Mboumtiba, and Wuna.
in scheme: Lexvo - ISO 639-3 language codes
notation: mdd
preferred label: Mbum

Maba
type: Language
type: Concept
ISO 639-3 code: mde
alternative label: Maba (Chad)
alternative label: Maba language
definition: Maba is a Maban language language of Chad, where it is a local trade language.
in scheme: Lexvo - ISO 639-3 language codes
notation: mde
preferred label: maba @es

Moksha
type: Language
type: Concept
ISO 639-2 Bibliographical code: mdf
ISO 639-2 Terminological code: mdf
ISO 639-3 code: mdf
alternative label: Idioma moksha @es
alternative label: Lingua mokša @it
alternative label: Mokcha @fr
alternative label: Mokschanische Sprache @de
alternative label: Moksha language
definition: The Moksha language is a member of the Finno-Volgaic subdivision of the Uralic languages with about 500,000 native speakers. Moksha is the majority language in the western part of Mordovia. Its closest relative is the Erzya language, with which it is not intelligible. Moksha is also considered to be closely related to the extinct Meshcherian and Muromian languages. There are presently six dialects of Moksha: Central, Western (or Zubu dialect), South-Western, Northern, South-Eastern and Southern.
in scheme: Lexvo - ISO 639-3 language codes
notation: mdf
preferred label: mocsa @pt
preferred label: moksa @fr
preferred label: moksha @es

Massalat
type: Language
type: Concept
ISO 639-3 code: mdg
in scheme: Lexvo - ISO 639-3 language codes
notation: mdg

Maguindanaon
type: Language
type: Concept
ISO 639-3 code: mdh
alternative label: Maguindanao language
definition: Maguindanaon is an Austronesian language spoken by majority of the population of Maguindanao Province in the Philippines. It is also spoken by sizable minorities in different parts of Mindanao such as the cities of Zamboanga, Davao, and General Santos, and the provinces of North Cotabato, Sultan Kudarat, South Cotabato, Sarangani, Zamboanga del Sur, Zamboanga Sibugay, as well as Metro Manila.
in scheme: Lexvo - ISO 639-3 language codes
notation: mdh
preferred label: Maguindanao @fr

Mamvu
type: Language
type: Concept
ISO 639-3 code: mdi
alternative label: Mamvu language
definition: Mamvu is a Central Sudanic language of northeastern Congo. It is quite similar to Lese.
in scheme: Lexvo - ISO 639-3 language codes
notation: mdi

Mangbetu
type: Language
type: Concept
ISO 639-3 code: mdj
in scheme: Lexvo - ISO 639-3 language codes
notation: mdj

Mangbutu
type: Language
type: Concept
ISO 639-3 code: mdk
alternative label: Mangbutu language
definition: Mangbutu is a Central Sudanic language of northeastern Congo. It, or its speakers, are also known as Mangu-Ngutu, Mombuttu, Wambutu. The 1200 Andinai are separated from other Mangbutu speakers by Lese; they speak a distinct dialect, as do the Andali tribe (Angwe dialect).
in scheme: Lexvo - ISO 639-3 language codes
notation: mdk

Yazgulyam
type: Language
type: Concept
ISO 639-3 code: yah
alternative label: Yazgulyam language
definition: The Yazgulyam language (also Yazgulyami, Iazgulem, Yazgulam; ) is a member of the Pamir subgroup of the Iranian languages, spoken by ca. 4,000 native speakers (as of 1994) along the Yazgulyam River, Gorno-Badakhshan, Tajikistan. Together with Shugni, it is classified as the Shugni-Yazgulami subgroup of the Pamir languages. Virtually all speakers are bilingual in the Tajik language.
in scheme: Lexvo - ISO 639-3 language codes
notation: yah

Maltese Sign Language
type: Language
type: Concept
ISO 639-3 code: mdl
in scheme: Lexvo - ISO 639-3 language codes
notation: mdl

Mayogo
type: Language
type: Concept
ISO 639-3 code: mdm
alternative label: Mayogo language
definition: Mayogo (also spelled Mayugo, Majugu, Maigo, Maiko, Mayko and also called Kiyogo) is a Ubangian language spoken by the Day (Angai), Maambi, and Mangbele peoples of DRC Congo. It is not close enough to Bangba, the most closely related language, for mutual intelligibility.
in scheme: Lexvo - ISO 639-3 language codes
notation: mdm

Mbati
type: Language
type: Concept
ISO 639-3 code: mdn
alternative label: Mbati language
definition: Mbati, also known as Songo, is the principal Bantu language spoken in the Central African Republic, along the Ubangi River in the extreme south of the country.
in scheme: Lexvo - ISO 639-3 language codes
notation: mdn

Mbala
type: Language
type: Concept
ISO 639-3 code: mdp
alternative label: Mbala language
definition: Mbala (Gimbala, Rumbala) is a Bantu language of the Congo.
in scheme: Lexvo - ISO 639-3 language codes
notation: mdp

Mbole
type: Language
type: Concept
ISO 639-3 code: mdq
alternative label: Mbole language
definition: Mbole is a Bantu language of the Democratic Republic of the Congo. It is spoken by the Mbole people, with a population of about 100,000 as of 1971 living in the Tshopo District, southwest of Kisangani in the Democratic Republic of the Congo.
in scheme: Lexvo - ISO 639-3 language codes
notation: mdq

Mandar
type: Language
type: Concept
ISO 639-2 Bibliographical code: mdr
ISO 639-2 Terminological code: mdr
ISO 639-3 code: mdr
alternative label: Língua mandar @pt
alternative label: Mandar language
alternative label: Mandaresisch @de
preferred label: mandar @es
definition: Mandar (also Andian, Manjar, Mandharsche) is an Austronesian language spoken by the group ethnic Mandar living in West Sulawesi province, Indonesia, especially in the sea side regencies like - Majene and Polewali-Mandar as well as few settlements in the islands of Pangkep District also known as Spermonde Archipelago and Ujung Lero, small peninsula near Pare-Pare).
in scheme: Lexvo - ISO 639-3 language codes
notation: mdr

Maria
type: Language
type: Concept
ISO 639-3 code: mds
alternative label: Maria (Papua New Guinea)
alternative label: Maria language
definition: Maria is a Manubaran language spoken in the "bird's tail" of Papua New Guinea by approximately 1,350 people.
in scheme: Lexvo - ISO 639-3 language codes
notation: mds

Mbere
type: Language
type: Concept
ISO 639-3 code: mdt
alternative label: Mbere language
definition: Mbere (Mbede, Mbete) is a Bantu language spoken in the Republic of Congo and Gabon.
in scheme: Lexvo - ISO 639-3 language codes
notation: mdt

Mboko
type: Language
type: Concept
ISO 639-3 code: mdu
alternative label: Mboko language
definition: :Not to be confused with the Kpwe-Mboko language Mboko (Mboxo) is a Bantu language of the Republic of Congo.
in scheme: Lexvo - ISO 639-3 language codes
notation: mdu

Santa Lucía Monteverde Mixtec
type: Language
type: Concept
ISO 639-3 code: mdv
alternative label: Mixtec, Santa Lucía Monteverde
in scheme: Lexvo - ISO 639-3 language codes
notation: mdv

Mbochi
type: Language
type: Concept
ISO 639-3 code: mdw
alternative label: Mboshi language
definition: Mbosi (Mboshi) is a Bantu language spoken in the Republic of Congo.
in scheme: Lexvo - ISO 639-3 language codes
notation: mdw
preferred label: Mbosi

Yagnobi
type: Language
type: Concept
ISO 639-3 code: yai
alternative label: Yaghnobi language
definition: The Yaghnobi language is a living East Iranian language (the other living members being Pashto, Ossetic and the Pamir languages). Yaghnobi is spoken in the upper valley of the Yaghnob River in the Zarafshan area of Tajikistan by the Yaghnobi people. It is considered to be a direct descendant of Sogdian and has often been called Neo-Sogdian in academic literature.
in scheme: Lexvo - ISO 639-3 language codes
notation: yai
preferred label: Idioma yagnobi @es
preferred label: Jaghnobi @de
preferred label: Língua yaghnobi @pt
preferred label: Yaghnobi @fr

Dizin
type: Language
type: Concept
ISO 639-3 code: mdx
alternative label: Dizin language
definition: Dizin (often called “Dizi” or “Maji” in the literature) is an Omotic language of the Afro-Asiatic language family spoken in the Dizi woreda of the Southern Nations, Nationalities and Peoples Region, located in southwestern Ethiopia. The 2007 census listed 33,927 speakers. A population of 17,583 was identified as monolinguals in 1994.
in scheme: Lexvo - ISO 639-3 language codes
notation: mdx
preferred label: Dizi @de
preferred label: Língua dizin @pt

Male
type: Language
type: Concept
ISO 639-3 code: mdy
alternative label: Male (Ethiopia)
alternative label: Male language
definition: Male (also spelled Maale), is an Omotic language spoken in the Omo Region of Ethiopia by the Male people. It is called in ISO 639-3 to distinguish it from .
in scheme: Lexvo - ISO 639-3 language codes
notation: mdy

Suruí Do Pará
type: Language
type: Concept
ISO 639-3 code: mdz
in scheme: Lexvo - ISO 639-3 language codes
notation: mdz

Menka
type: Language
type: Concept
ISO 639-3 code: mea
alternative label: Menka language
definition: Menka is a Grassfields language of Cameroon.
in scheme: Lexvo - ISO 639-3 language codes
notation: mea

Ikobi
type: Language
type: Concept
ISO 639-3 code: meb
in scheme: Lexvo - ISO 639-3 language codes
notation: meb

Mara
type: Language
type: Concept
ISO 639-3 code: mec
alternative label: Marra language
definition: :Not to be confused with the Maran languages of the Pama–Nyungan family Marra (also spelled Mara) is an Australian Aboriginal language, traditionally spoken on an area of the Gulf of Carpentaria coast in the Northern Territory around the Roper, Towns and Limmen Rivers. Marra is now an endangered language. The most recent survey was in 1991; at that time, there were only 15 speakers, all elderly. Most Marra people now speak Kriol as their main language. The remaining elderly Marra speakers live in the Aboriginal communities of Ngukurr, Numbulwar, Borroloola and Minyerri.
in scheme: Lexvo - ISO 639-3 language codes
notation: mec

Melpa
type: Language
type: Concept
ISO 639-3 code: med
alternative label: Melpa language
definition: Melpa (also written Medlpa) is a Papuan language spoken by about 130,000 people predominantly in Mount Hagen and the surrounding district of Western Highlands Province, Papua New Guinea.
in scheme: Lexvo - ISO 639-3 language codes
notation: med

Mengen
type: Language
type: Concept
ISO 639-3 code: mee
in scheme: Lexvo - ISO 639-3 language codes
notation: mee

Megam
type: Language
type: Concept
ISO 639-3 code: mef
alternative label: Megam language
definition: Megam is a Tibeto-Burman language of Bangladesh. It is most closely related to Garo, but has been strongly influenced by Khasian languages, to the extent that it is only 7–9% lexically similar to with A’beng, the neighboring Garo dialect, but 60% similar to the Khasian language Lyngngam.
in scheme: Lexvo - ISO 639-3 language codes
notation: mef

Mea
type: Language
type: Concept
ISO 639-3 code: meg
in scheme: Lexvo - ISO 639-3 language codes
notation: meg

Southwestern Tlaxiaco Mixtec
type: Language
type: Concept
ISO 639-3 code: meh
alternative label: Mixtec, Southwestern Tlaxiaco
in scheme: Lexvo - ISO 639-3 language codes
notation: meh

Midob
type: Language
type: Concept
ISO 639-3 code: mei
alternative label: Midob language
definition: Midob (also spelt Meidob) is the language of the Midob people in North Darfur. It is genetically part of the Nubian language family which is part of the Nilo-Saharan language phylum. Apart from their homeland, Midob speakers also live in the Khartoum area and Jezirat Aba. The Midob people call their language tìd-n-áal, literally "mouth of the Midob", and themselves tìddí (singular), tìd (plural). There are an estimated 50,000 Midob speakers in two main dialects, Urrti and Kaageddi.
in scheme: Lexvo - ISO 639-3 language codes
notation: mei

Meyah
type: Language
type: Concept
ISO 639-3 code: mej
alternative label: Meax language
definition: Meax (Meyah) is a Papuan language on the north coast of Papua, Indonesia.
in scheme: Lexvo - ISO 639-3 language codes
notation: mej

Mekeo
type: Language
type: Concept
ISO 639-3 code: mek
alternative label: Mekeo language
definition: Mekeo is a language spoken in Papua New Guinea and had 19,000 speakers in 2003. It is an Oceanic language of the Papuan Tip Linkage. The two major villages that the language is spoken in are located in the Central Province of Papua New Guinea. These are named Ongofoina and Inauaisa. The language is also broken up into four dialects: East Mekeo; North West Mekeo; West Mekeo and North Mekeo. The standard dialect is East Mekeo. This main dialect is addressed throughout the article.
in scheme: Lexvo - ISO 639-3 language codes
notation: mek

Central Melanau
type: Language
type: Concept
ISO 639-3 code: mel
alternative label: Melanau language
alternative label: Melanau, Central
definition: Melanau is an Austronesian language spoken in the coastal area of the Rejang delta on northwest Borneo, Sarawak, Malaysia and Brunei. There are several dialects—Mukah-Oya, Balingian, Bruit, Dalat, Igan, Sarikei, Segahan, Prehan, Segalang, and Siteng.
in scheme: Lexvo - ISO 639-3 language codes
notation: mel

Banda-Yangere
type: Language
type: Concept
ISO 639-3 code: yaj
alternative label: Yangere language
definition: Yangere is a Ubangian language of the Central African Republic. It is closely related to Central Banda.
in scheme: Lexvo - ISO 639-3 language codes
notation: yaj

Mangala
type: Language
type: Concept
ISO 639-3 code: mem
in scheme: Lexvo - ISO 639-3 language codes
notation: mem

Mende
type: Language
type: Concept
ISO 639-2 Bibliographical code: men
ISO 639-2 Terminological code: men
ISO 639-3 code: men
alternative label: Idioma mende @es
alternative label: Lingua mende @it
alternative label: Língua mende @pt
alternative label: Mende (Sierra Leone)
alternative label: Mende language
alternative label: Mende-Sprache @de
alternative label: Mendé @fr
definition: Mende is a major language of Sierra Leone, with some speakers in neighboring Liberia. It is spoken by the Mende people and by other ethnic groups as a regional lingua franca in southern Sierra Leone.
in scheme: Lexvo - ISO 639-3 language codes
notation: men
preferred label: mende @es
preferred label: mendé @fr

Kedah Malay
type: Language
type: Concept
ISO 639-3 code: meo
alternative label: Malay, Kedah
definition: Kedah Malay is a form of Malay spoken in the Malaysian states of Kedah, Penang, Perak, and Perlis. It is also spoken in Thailand's southern province of Satun, where it is called "Satun Malay".
in scheme: Lexvo - ISO 639-3 language codes
notation: meo

Miriwung
type: Language
type: Concept
ISO 639-3 code: mep
alternative label: Miriwoong language
definition: Miriwoong is an Australian Indigenous language which today has about 20 speakers, most of whom live in or near Kununurra in Western Australia.
in scheme: Lexvo - ISO 639-3 language codes
notation: mep
preferred label: Miriwoong @fr

Merey
type: Language
type: Concept
ISO 639-3 code: meq
alternative label: Merey language
definition: Merey is an Afro-Asiatic language spoken in northern Cameroon. Dugur is a dialect.
in scheme: Lexvo - ISO 639-3 language codes
notation: meq

Meru
type: Language
type: Concept
ISO 639-3 code: mer
alternative label: Meru language
definition: Meru is the language spoken by the Meru people (Ameru) who live on the Eastern and Northern slopes of Mount Kenya, Kenya, Africa and on the Nyambene ranges. They settled in this area after centuries of migration from the north.
in scheme: Lexvo - ISO 639-3 language codes
notation: mer
preferred label: meru @es

Masmaje
type: Language
type: Concept
ISO 639-3 code: mes
alternative label: Masmaje language
definition: Masmaje (also known as Masmadje, Mesmedje) is an Afro-Asiatic language spoken in central Chad.
in scheme: Lexvo - ISO 639-3 language codes
notation: mes

Mato
type: Language
type: Concept
ISO 639-3 code: met
in scheme: Lexvo - ISO 639-3 language codes
notation: met

Motu
type: Language
type: Concept
ISO 639-3 code: meu
alternative label: Motu language
definition: Motu (sometimes called Pure Motu or True Motu to distinguish it from Hiri Motu) is one of many Central Papuan Tip languages, and is spoken by the Motuans, native inhabitants of Papua New Guinea. It is still commonly used today in the region, particularly around the capital, Port Moresby.
in scheme: Lexvo - ISO 639-3 language codes
notation: meu
preferred label: Idioma motu @es

Mano
type: Language
type: Concept
ISO 639-3 code: mev
alternative label: Mann
alternative label: Mann language
definition: The Mann language, also known as Maa, Mah, Mano and Mawe, is a significant Mande language of Liberia and Guinea. It is spoken primarily in Nimba County in north-central Liberia by 188,000 and by 71,000 in Nzérékoré, Lola and Yomou Prefectures in Guinea.
in scheme: Lexvo - ISO 639-3 language codes
notation: mev

Maaka
type: Language
type: Concept
ISO 639-3 code: mew
alternative label: Maaka language
definition: Maaka (also known as Maha, Maka, Maga, Magha) is an Afro-Asiatic language spoken in Nigeria.
in scheme: Lexvo - ISO 639-3 language codes
notation: mew

Yakama
type: Language
type: Concept
ISO 639-3 code: yak
in scheme: Lexvo - ISO 639-3 language codes
notation: yak

Hassaniyya
type: Language
type: Concept
ISO 639-3 code: mey
alternative label: Hassānīya language
definition: Hassānīya ( Hassānīya; also known as Hassaniyya, Klem El Bithan, Hasanya, Hassani, Hassaniya) is the variety of Arabic originally spoken by the Beni Hassān Bedouin tribes, who extended their authority over most of Mauritania and the Western Sahara between the fifteenth and seventeenth centuries. It has almost completely replaced the Berber languages spoken in this region. Though clearly a western dialect, Hassānīya is relatively distant from other North African variants of Arabic. Its geographical location exposed it to influence from Zenaga and Wolof. There are several dialects of Hassaniya. The primary differences among them are phonetic. Today Hassaniya is spoken by inhabitants of Algeria, Morocco, Mauritania, Mali, Niger, Senegal and the Western Sahara.
in scheme: Lexvo - ISO 639-3 language codes
notation: mey
preferred label: Hassania @de
preferred label: Hassanya @fr
preferred label: Hassanía @es

Menominee
type: Language
type: Concept
ISO 639-3 code: mez
alternative label: Menominee language
definition: The Menominee language (also spelled Menomini) is an Algonquian language originally spoken by the Menominee people of northern Wisconsin and Michigan. It is still spoken on the Menominee Nation lands in Northern Wisconsin in the United States.
in scheme: Lexvo - ISO 639-3 language codes
notation: mez

Pattani Malay
type: Language
type: Concept
ISO 639-3 code: mfa
alternative label: Malay, Pattani
definition: Pattani Malay or Patani Malay, often referred to in Thailand as Yawi (in Thai) or Jawi (in Patani Malay), is a dialect of the Malay language spoken in the southernmost provinces of Thailand along the border with Malaysia. It is the primary spoken language of the Thai Malay ethnic group, but is also used as a linga franca by ethnic Thai in rural areas, Muslim and non-Muslim, and the samsam, a mostly Thai-speaking population of mixed Malay and Thai ancestry. Pattani Malay is a highly divergent dialect of Malay, influenced by Thai and isolated from the rest of the Malay world by high mountains. Several varieties exist, but they are mutually comprehensible. It is almost identical to the Kelantanese Malay spoken just across the border; there has not been any detailed study to determine if they are in fact still the same language or have diverged.
in scheme: Lexvo - ISO 639-3 language codes
notation: mfa
preferred label: Yawi @de

Bangka
type: Language
type: Concept
ISO 639-3 code: mfb
alternative label: Bangka language
definition: Bangka is an Austronesian language spoken in Indonesia, specifically on the Island of Bangka in the Bangka-Belitung of Sumatra. There are about 340,000 speakers as of 2000. It is also known as Lom, Belom, Mapor or Maporese, and has a distinct vocabulary, grammar and phonology from other Malayan languages
in scheme: Lexvo - ISO 639-3 language codes
notation: mfb

Mba
type: Language
type: Concept
ISO 639-3 code: mfc
alternative label: Mba language
definition: Mba, also known as (Ki)Manga or (Ki)Mbanga, is a Ubangian language spoken in DRC Congo.
in scheme: Lexvo - ISO 639-3 language codes
notation: mfc

Mendankwe-Nkwen
type: Language
type: Concept
ISO 639-3 code: mfd
in scheme: Lexvo - ISO 639-3 language codes
notation: mfd

Creolo mauriziano
type: Language
type: Concept
ISO 639-3 code: mfe
alternative label: Crioulo de Maurício @pt
alternative label: Mauritian Creole
alternative label: creolo mauriziano @it
alternative label: criollo mauriciano @es
alternative label: crioulo das Ilhas Maurícias @pt
alternative label: créole mauricien @fr
definition: Mauritian Creole (called Kreol Morisien in creole) is a French-based creole language spoken in Mauritius. In addition to the French base of the language, there are also some words from English and from the many African and Asian languages that have been spoken on the island.
in scheme: Lexvo - ISO 639-3 language codes
notation: mfe
preferred label: Criollo mauriciano @es
preferred label: Créole mauricien @fr
preferred label: Morisyen

Yalunka
type: Language
type: Concept
ISO 639-3 code: yal
alternative label: Yalunka language
definition: Yalunka (or Jallonka) is the language of the Yalunka people of Guinea, Mali, Senegal, and Sierra Leone in West Africa. It is in the Mande language family.
in scheme: Lexvo - ISO 639-3 language codes
notation: yal
preferred label: Jalonke @de
preferred label: Jalonké @fr

Naki
type: Language
type: Concept
ISO 639-3 code: mff
in scheme: Lexvo - ISO 639-3 language codes
notation: mff

Mogofin
type: Language
type: Concept
ISO 639-3 code: mfg
alternative label: Mixifore
in scheme: Lexvo - ISO 639-3 language codes
notation: mfg

Matal
type: Language
type: Concept
ISO 639-3 code: mfh
alternative label: Matal language
definition: Matal, also known as Muktele, is an Afro-Asiatic language spoken in northern Cameroon.
in scheme: Lexvo - ISO 639-3 language codes
notation: mfh

Wandala
type: Language
type: Concept
ISO 639-3 code: mfi
alternative label: Wandala language
definition: Wandala, also Mandara, Mura, or Malgwa, is an Afro-Asiatic language of Cameroon and Nigeria.
in scheme: Lexvo - ISO 639-3 language codes
notation: mfi

Mefele
type: Language
type: Concept
ISO 639-3 code: mfj
alternative label: Mefele language
definition: Mefele is an Afro-Asiatic language spoken in northern Cameroon. Dialects are Mefele, Muhura, Serak, and Shugule.
in scheme: Lexvo - ISO 639-3 language codes
notation: mfj

North Mofu
type: Language
type: Concept
ISO 639-3 code: mfk
alternative label: Mofu, North
alternative label: North Mofu language
definition: North Mofu is an Afro-Asiatic language spoken in northern Cameroon. Dialects are Douroun and Wazan.
in scheme: Lexvo - ISO 639-3 language codes
notation: mfk

Putai
type: Language
type: Concept
ISO 639-3 code: mfl
alternative label: Putai language
definition: Putai (also known as Marghi West) is a nearly extinct Afro-Asiatic language spoken in Nigeria. The language is dying out in favor of Kanuri.
in scheme: Lexvo - ISO 639-3 language codes
notation: mfl

Marghi South
type: Language
type: Concept
ISO 639-3 code: mfm
alternative label: Marghi South language
definition: Marghi South is a Chadic language of Nigeria. It is perhaps closer to Huba than it is to Margi.
in scheme: Lexvo - ISO 639-3 language codes
notation: mfm

Mbembe language
type: Language
type: Concept
ISO 639-3 code: mfn
alternative label: Cross River Mbembe
alternative label: Mbembe, Cross River
definition: Mbembe is a Cross River language of Nigeria.
in scheme: Lexvo - ISO 639-3 language codes
notation: mfn

Mbe
type: Language
type: Concept
ISO 639-3 code: mfo
alternative label: Mbe language
definition: Mbe is a language spoken by the Mbube people of the Ogoja, Cross River State, region of Nigeria, numbering about 14,300 people in 1973. As the closest relative of the Ekoid family of the Southern Bantoid languages, Mbe is fairly close to the Bantu languages. It is tonal and has a typical Niger–Congo noun-class system.
in scheme: Lexvo - ISO 639-3 language codes
notation: mfo

Makassar Malay
type: Language
type: Concept
ISO 639-3 code: mfp
alternative label: Malay, Makassar
in scheme: Lexvo - ISO 639-3 language codes
notation: mfp

Moba
type: Language
type: Concept
ISO 639-3 code: mfq
in scheme: Lexvo - ISO 639-3 language codes
notation: mfq

Marithiel
type: Language
type: Concept
ISO 639-3 code: mfr
in scheme: Lexvo - ISO 639-3 language codes
notation: mfr

Yamba
type: Language
type: Concept
ISO 639-3 code: yam
alternative label: Yamba language
definition: Yamba is a Grassfields language of Cameroon, with a small number in Nigeria.
in scheme: Lexvo - ISO 639-3 language codes
notation: yam

Mexican Sign Language
type: Language
type: Concept
ISO 639-3 code: mfs
definition: Mexican Sign Language (“lengua de señas mexicana” or LSM, also known by several other names), is the language of the Deaf community in the urban regions of Mexico. It is the language of 87,000 to 100,000 signers (1986 T. C. Smith-Stark).
in scheme: Lexvo - ISO 639-3 language codes
notation: mfs
preferred label: Lengua de señas mexicana @es
preferred label: Língua de sinais mexicana @pt

Mokerang
type: Language
type: Concept
ISO 639-3 code: mft
in scheme: Lexvo - ISO 639-3 language codes
notation: mft

Mbwela
type: Language
type: Concept
ISO 639-3 code: mfu
alternative label: Mbwela language
definition: Mbwela (Ambuella) is a Bantu language of Angola. It is closely related to Ngangela.
in scheme: Lexvo - ISO 639-3 language codes
notation: mfu

Mandjak
type: Language
type: Concept
ISO 639-3 code: mfv
alternative label: Mandjak language
definition: Mandjak (Manjack) is a Bak language of Guinea-Bissau and Senegal.
in scheme: Lexvo - ISO 639-3 language codes
notation: mfv
preferred label: Manjaque @fr

Mulaha
type: Language
type: Concept
ISO 639-3 code: mfw
in scheme: Lexvo - ISO 639-3 language codes
notation: mfw

Melo
type: Language
type: Concept
ISO 639-3 code: mfx
alternative label: Melo language
definition: Melo (also known as Malo) is an Afro-Asiatic language spoken in the Gamo Gofa Zone of the Southern Nations, Nationalities, and People's Region in Ethiopia.
in scheme: Lexvo - ISO 639-3 language codes
notation: mfx

Mayo
type: Language
type: Concept
ISO 639-3 code: mfy
alternative label: Mayo language
definition: Mayo is an Uto-Aztecan language. It is spoken by about 40,000 people, the Mexican Mayo or Yoreme Indians, who live in the South of the Mexican state of Sonora and in the North of the neighboring state of Sinaloa. Under the "Law of Linguistic Rights" it is recognized as a "national language" along with 62 other indigenous languages and Spanish which have the same validity in Mexico.
in scheme: Lexvo - ISO 639-3 language codes
notation: mfy
preferred label: Idioma mayo @es

Mabaan
type: Language
type: Concept
ISO 639-3 code: mfz
alternative label: Mabaan language
definition: Mabaan, or Southern Burun, is a Luo language of South Sudan. It forms a dialect continuum with Burun.
in scheme: Lexvo - ISO 639-3 language codes
notation: mfz

Middle Irish
type: Language
type: Concept
ISO 639-2 Bibliographical code: mga
ISO 639-2 Terminological code: mga
ISO 639-3 code: mga
alternative label: Idioma irlandés medio @es
alternative label: Irish, Middle (900-1200)
alternative label: Irlandês médio @pt
alternative label: Middle Irish (900-1200)
alternative label: Mittelirische Sprache @de
alternative label: irlandais moyen (900-1200) @fr
alternative label: irlandês, medieval @pt
alternative label: moyen irlandais @fr
definition: Middle Irish is the name given by historical philologists to the Goidelic language spoken in Ireland, Scotland and the Isle of Man from the 10th to 12th centuries; it is therefore a contemporary of late Old English and early Middle English. The modern Goidelic languages, Irish, Scottish Gaelic, and Manx, are all descendants of Middle Irish.
in scheme: Lexvo - ISO 639-3 language codes
notation: mga
preferred label: Mittelirisch @de
preferred label: Moyen irlandais @fr
preferred label: irlandese medio @it
preferred label: irlandés medieval @es
preferred label: irlandês médio @pt

Mararit
type: Language
type: Concept
ISO 639-3 code: mgb
alternative label: Mararit language
definition: The Mararit language is a Nilo-Saharan language spoken in eastern Chad. language group of the Western branch of Nilo-Saharan. There are two dialects. One is called Mararit and the other is called Abou Charib. The majority speak the Abou Charid dialect of the language. Mararit people live in Argid Mararit, Abid Mararit, Wadah area, Donkey Kuma, Sani Kiro,in North Darfur State; in Silala area in South Darfur State and in Gienena provinvce in West Darfur State. Furthermore, the Talgai, Mirakawi,wilkawi,Tirgawi are sections of Mararit people .
in scheme: Lexvo - ISO 639-3 language codes
notation: mgb

Morokodo
type: Language
type: Concept
ISO 639-3 code: mgc
in scheme: Lexvo - ISO 639-3 language codes
notation: mgc

Moru
type: Language
type: Concept
ISO 639-3 code: mgd
alternative label: Moru language
definition: Moru is a Central Sudanic language spoken in South Sudan by the Moru people. Dialects are Agi, Andri ~ ’Bali’ba, Kadiro = Lakama’di, Miza, Moruwa’di.
in scheme: Lexvo - ISO 639-3 language codes
notation: mgd

Mayangna
type: Language
type: Concept
ISO 639-3 code: yan
in scheme: Lexvo - ISO 639-3 language codes
notation: yan

Mango
type: Language
type: Concept
ISO 639-3 code: mge
in scheme: Lexvo - ISO 639-3 language codes
notation: mge

Maklew
type: Language
type: Concept
ISO 639-3 code: mgf
in scheme: Lexvo - ISO 639-3 language codes
notation: mgf

Mpumpong
type: Language
type: Concept
ISO 639-3 code: mgg
in scheme: Lexvo - ISO 639-3 language codes
notation: mgg

Makhuwa-Meetto
type: Language
type: Concept
ISO 639-3 code: mgh
alternative label: Makhuwa-Meetto language
definition: Makhuwa-Meetto (also known as Meto or Imeetto) is a Bantu language spoken by about 800,000 people in northern Mozambique and southern Tanzania. It is a member of the Makua group (P.30 in Guthrie's classification).
in scheme: Lexvo - ISO 639-3 language codes
notation: mgh
preferred label: makhuwa-meetto @es

Lijili
type: Language
type: Concept
ISO 639-3 code: mgi
alternative label: Jili language
definition: Jili (Lijili) is a Plateau language of Nigeria. It is one of several languages which go by the name Koro.
in scheme: Lexvo - ISO 639-3 language codes
notation: mgi

Abureni
type: Language
type: Concept
ISO 639-3 code: mgj
in scheme: Lexvo - ISO 639-3 language codes
notation: mgj

Mawes
type: Language
type: Concept
ISO 639-3 code: mgk
alternative label: Mawes language
definition: Mawes is a Papuan language of Indonesia.
in scheme: Lexvo - ISO 639-3 language codes
notation: mgk

Yao
type: Language
type: Concept
ISO 639-2 Bibliographical code: yao
ISO 639-2 Terminological code: yao
ISO 639-3 code: yao
alternative label: Língua maconde @pt
alternative label: Makonde @fr
alternative label: Makonde language
alternative label: Yao-Sprache @de
definition: Makonde is the language spoken by the Makonde, an ethnic group in southeast Tanzania and northern Mozambique. Makonde is a central Bantu language closely related to Yao. The Matembwe dialect is divergent, and may not be Makonde.
in scheme: Lexvo - ISO 639-3 language codes
notation: yao
preferred label: Chimakonde @de
preferred label: yao @es
preferred label: yao (bantu) @it

Maleu-Kilenge
type: Language
type: Concept
ISO 639-3 code: mgl
alternative label: Maleu-Kilenge language
definition: Maleu-Kilenge is an Austronesian language spoken by about 5200 swidden farmers, including about 1500 ethnic Kilenge, in the Talasea District of West New Britain Province, Papua New Guinea.
in scheme: Lexvo - ISO 639-3 language codes
notation: mgl
preferred label: Maleu-kilenge @fr

Mambae
type: Language
type: Concept
ISO 639-3 code: mgm
in scheme: Lexvo - ISO 639-3 language codes
notation: mgm

Mbangi
type: Language
type: Concept
ISO 639-3 code: mgn
alternative label: Moronene language
definition: Moronene is an Austronesian language (one of the Celebic languages) spoken in Bombana district, Southeast Sulawesi, Indonesia.
in scheme: Lexvo - ISO 639-3 language codes
notation: mgn
preferred label: Moronene @fr

Meta'
type: Language
type: Concept
ISO 639-3 code: mgo
alternative label: Meta' language
definition: Meta’ is a Grassfields Bantu language of Cameroon. The Moghamo variety is perhaps divergent enough to be considered a distinct language.
in scheme: Lexvo - ISO 639-3 language codes
notation: mgo

Eastern Magar
type: Language
type: Concept
ISO 639-3 code: mgp
alternative label: Magar, Eastern
in scheme: Lexvo - ISO 639-3 language codes
notation: mgp

Malila
type: Language
type: Concept
ISO 639-3 code: mgq
in scheme: Lexvo - ISO 639-3 language codes
notation: mgq

Mambwe-Lungu
type: Language
type: Concept
ISO 639-3 code: mgr
alternative label: Mambwe-Lungu language
in scheme: Lexvo - ISO 639-3 language codes
notation: mgr
preferred label: Mambwe @de

Manda
type: Language
type: Concept
ISO 639-3 code: mgs
alternative label: Manda (Tanzania)
alternative label: Manda language
definition: Manda, or Manda-Matumba, is a Bantu language of Tanzania. It was assigned to the Bena–Kinga (G60) group by Nurse (1988), though Ehret retains it in N10 Rufiji–Ruvuma (Songea).
in scheme: Lexvo - ISO 639-3 language codes
notation: mgs

Mongol
type: Language
type: Concept
ISO 639-3 code: mgt
in scheme: Lexvo - ISO 639-3 language codes
notation: mgt

Mailu
type: Language
type: Concept
ISO 639-3 code: mgu
alternative label: Mailu language
definition: Mailu or Magi is a Papuan language of Papua New Guinea.
in scheme: Lexvo - ISO 639-3 language codes
notation: mgu

Matengo
type: Language
type: Concept
ISO 639-3 code: mgv
alternative label: Matengo language
definition: Matengo is a Bantu language of Tanzania. Speakers are mostly monolingual, and neighboring languages are not intelligible.
in scheme: Lexvo - ISO 639-3 language codes
notation: mgv

Matumbi
type: Language
type: Concept
ISO 639-3 code: mgw
alternative label: Matumbi language
definition: Matuumbi, also known as Kimatumbi, is a language spoken in Tanzania in the Kipatimu region of the Kilwa District, south of the Rufiji river. It is a Bantu language, P13 in Guthrie's classification. Kimatuumbi is closely related to the Ngindo, Mbunga, Rufiji and Ndengereko languages. It is spoken by about 70 000 people, according to the Ethnologue.
in scheme: Lexvo - ISO 639-3 language codes
notation: mgw

Mbunga
type: Language
type: Concept
ISO 639-3 code: mgy
alternative label: Mbunga language
definition: Mbunga is a Bantu language of Tanzania.
in scheme: Lexvo - ISO 639-3 language codes
notation: mgy

Mbugwe
type: Language
type: Concept
ISO 639-3 code: mgz
alternative label: Mbugwe language
definition: Mbugwe or Mbuwe (Kimbugwe) is a Bantu language of spoken by the Mbugwe people of Lake Manyara in the Manyara Region of Tanzania.
in scheme: Lexvo - ISO 639-3 language codes
notation: mgz

Manda
type: Language
type: Concept
ISO 639-3 code: mha
alternative label: Manda (India)
in scheme: Lexvo - ISO 639-3 language codes
notation: mha

Mahongwe
type: Language
type: Concept
ISO 639-3 code: mhb
in scheme: Lexvo - ISO 639-3 language codes
notation: mhb

Mocho
type: Language
type: Concept
ISO 639-3 code: mhc
alternative label: Mocho’ language
definition: Mocho’ or Mototzintlec is a language belonging to the western branch of Mayan languages spoken in the Mexican state of Chiapas. The two dialects of Mocho' are spoken in two different villages: the Tuzantec dialect in Tuzantán and the Motozintlec dialect in Motozintla.
in scheme: Lexvo - ISO 639-3 language codes
notation: mhc
preferred label: Língua mochó @pt

Mbugu
type: Language
type: Concept
ISO 639-3 code: mhd
alternative label: Mbugu language
definition: Mbugu, or Ma’a, is a mixed language of Tanzania.
in scheme: Lexvo - ISO 639-3 language codes
notation: mhd

Besisi
type: Language
type: Concept
ISO 639-3 code: mhe
alternative label: Mah Meri
alternative label: Mah Meri language
definition: Mah Meri, also known as Besisi and Betise’, is an aboriginal Mon–Khmer language spoken in Malaya. It is the only such language spoken on the coast, in Malacca outside of the capital Kuala Lumpur. The small number of speakers is increasing.
in scheme: Lexvo - ISO 639-3 language codes
notation: mhe

Mamaa
type: Language
type: Concept
ISO 639-3 code: mhf
in scheme: Lexvo - ISO 639-3 language codes
notation: mhf

Margu
type: Language
type: Concept
ISO 639-3 code: mhg
alternative label: Marrgu language
in scheme: Lexvo - ISO 639-3 language codes
notation: mhg

Maskoy Pidgin
type: Language
type: Concept
ISO 639-3 code: mhh
in scheme: Lexvo - ISO 639-3 language codes
notation: mhh

Ma'di
type: Language
type: Concept
ISO 639-3 code: mhi
alternative label: Ma'di language
definition: The Madi language (pronounced ) is found in Uganda and South Sudan. (The apostrophe before the letter d denotes it as an implosive). The Madi people refer to their language as Madi ti literally: Ma'di mouth.
in scheme: Lexvo - ISO 639-3 language codes
notation: mhi

Sarasira
type: Language
type: Concept
ISO 639-3 code: zsa
in scheme: Lexvo - ISO 639-3 language codes
notation: zsa

Mogholi
type: Language
type: Concept
ISO 639-3 code: mhj
alternative label: Moghol language
definition: Moghol (also known as Mogholi [ISO 639-3]) is a Mongolic language spoken in the region of Herat, Afghanistan, by a few members of the Hazara community. In the 1970s, when the German scholar Michael Weiers did fieldwork on the language, few people spoke the language, most knew it passively and most were older than 40 years.
in scheme: Lexvo - ISO 639-3 language codes
notation: mhj
preferred label: Moghol @de

Yapese
type: Language
type: Concept
ISO 639-2 Bibliographical code: yap
ISO 639-2 Terminological code: yap
ISO 639-3 code: yap
alternative label: Lingua yapese @it
alternative label: Língua yap @pt
alternative label: Yapese language
alternative label: Yapesische Sprache @de
alternative label: yapois @fr
definition: Yapese is a language spoken by the people on the island of Yap (Federated States of Micronesia).
in scheme: Lexvo - ISO 639-3 language codes
notation: yap
preferred label: Yap @fr
preferred label: Yapesisch @de
preferred label: yapese @it
preferred label: yapés @es

Mungaka
type: Language
type: Concept
ISO 639-3 code: mhk
alternative label: Nga'ka language
definition: The Ngaka language, Mungaka, also Bali, is a Grassfields language of Cameroon.
in scheme: Lexvo - ISO 639-3 language codes
notation: mhk

Mauwake
type: Language
type: Concept
ISO 639-3 code: mhl
alternative label: Mauwake language
definition: Mauwake (Mawake) is a Papuan language of Madang Province, Papua New Guinea.
in scheme: Lexvo - ISO 639-3 language codes
notation: mhl

Makhuwa-Moniga
type: Language
type: Concept
ISO 639-3 code: mhm
in scheme: Lexvo - ISO 639-3 language codes
notation: mhm

Mócheno
type: Language
type: Concept
ISO 639-3 code: mhn
alternative label: Mócheno language
definition: Mócheno is an Upper German variety spoken in three towns of the Mocheni Valley (German: Fersental, Italian: Valle del Fersina, Mócheno: Bersntol), in Trentino, northeastern Italy.
in scheme: Lexvo - ISO 639-3 language codes
notation: mhn
preferred label: Fersentalerisch @de
preferred label: Lingua mochena @it
preferred label: Língua mochena @pt
preferred label: Mochène @fr

Mashi
type: Language
type: Concept
ISO 639-3 code: mho
alternative label: Mashi (Zambia)
in scheme: Lexvo - ISO 639-3 language codes
notation: mho

Balinese Malay
type: Language
type: Concept
ISO 639-3 code: mhp
alternative label: Malay, Balinese
in scheme: Lexvo - ISO 639-3 language codes
notation: mhp

Mandan
type: Language
type: Concept
ISO 639-3 code: mhq
alternative label: Mandan language
definition: Mandan is an endangered Siouan language.
in scheme: Lexvo - ISO 639-3 language codes
notation: mhq

Eastern Mari
type: Language
type: Concept
ISO 639-3 code: mhr
alternative label: Mari, Eastern
alternative label: Meadow Mari language
definition: Meadow Mari or Eastern Mari is a standardized dialect of the Mari language used by about half a million people mostly in the European part of the Russian Federation. Meadow Mari, Hill Mari, and Russian are official languages in the Mariy El Autonomous Republic of the Russian Federation.
in scheme: Lexvo - ISO 639-3 language codes
notation: mhr

Buru
type: Language
type: Concept
ISO 639-3 code: mhs
alternative label: Buru (Indonesia)
alternative label: Buru language
in scheme: Lexvo - ISO 639-3 language codes
notation: mhs

Mandahuaca
type: Language
type: Concept
ISO 639-3 code: mht
alternative label: Mandawaca language
definition: Mandahuaca (Mandawaka) is an Arawakan language of Venezuela and formerly of Brazil. The number of speakers is not known; the most recent data was published in 1975. It is one of several languages which goes by the generic name Baré.
in scheme: Lexvo - ISO 639-3 language codes
notation: mht

Darang Deng
type: Language
type: Concept
ISO 639-3 code: mhu
alternative label: Deng, Darang
alternative label: Digaro Mishmi language
alternative label: Digaro-Mishmi
definition: Digaro, also Taraon or Darang, is a small Tibeto-Burman language of India.
in scheme: Lexvo - ISO 639-3 language codes
notation: mhu

Mbukushu
type: Language
type: Concept
ISO 639-3 code: mhw
alternative label: Mbukushu language
definition: Mbukushu or Thimbukushu is a Bantu language spoken by 45,000 people along the Okavango River in Namibia, where it is a national language; in Botswana; in Angola; and in Zambia, where it is an official regional language. It appears to be an divergent lineage of Bantu.
in scheme: Lexvo - ISO 639-3 language codes
notation: mhw

Maru
type: Language
type: Concept
ISO 639-3 code: mhx
alternative label: Lhaovo
alternative label: Maru language
definition: Lhao Vo, is a Burmish language of Burma with a few thousand speakers in China.
in scheme: Lexvo - ISO 639-3 language codes
notation: mhx

Ma'anyan
type: Language
type: Concept
ISO 639-3 code: mhy
alternative label: Ma'anyan language
definition: Maanyan or Maanjan or Maanyak Dayak is an Austronesian language belonging to the East Barito languages. It is spoken by about 150,000 Ma'anyan people (subgroup of Dayak people) living in the central Kalimantan, Indonesia. It is closely related to Malagasy languages spoken in Madagascar. There is high lexical similarity with other East Barito languages like Paku language (77%) or Dusun Witu (75%).
in scheme: Lexvo - ISO 639-3 language codes
notation: mhy

Mor
type: Language
type: Concept
ISO 639-3 code: mhz
alternative label: Mor (Mor Islands)
alternative label: Mor language
definition: Mor is a tonal Austronesian language in the putative Cenderawasih (Geelvink Bay) of Indonesian Papua. It is not closely related to other languages.
in scheme: Lexvo - ISO 639-3 language codes
notation: mhz

Miami
type: Language
type: Concept
ISO 639-3 code: mia
alternative label: Miami-Illinois language
definition: The Miami-Illinois language (Miami-Illinois: Myaamia ) is a Native American Algonquian language formerly spoken in the United States, primarily in Illinois, Missouri, Indiana, western Ohio and adjacent areas along the Mississippi River by the tribes of the Inoca or Illinois Confederacy, including the Kaskaskia, Peoria, Tamaroa, Cahokia, and Mitchigamea. Since the 1990s the Miami Tribe of Oklahoma has worked to revive it in a joint project with Miami University in Oxford, Ohio.
in scheme: Lexvo - ISO 639-3 language codes
notation: mia
preferred label: Língua Miami-Illinois @pt
preferred label: Miami-illinois @fr

Atatláhuca Mixtec
type: Language
type: Concept
ISO 639-3 code: mib
alternative label: Mixtec, Atatláhuca
in scheme: Lexvo - ISO 639-3 language codes
notation: mib

Micmac
type: Language
type: Concept
ISO 639-2 Bibliographical code: mic
ISO 639-2 Terminological code: mic
ISO 639-3 code: mic
alternative label: Mi'kmaq
alternative label: Mi'kmaq language
alternative label: Míkmaq language
alternative label: mi'kmaq @fr
definition: The Mikmaq language (spelled Micmac in English, and Míkmaq, Míkmaw or Mìgmao in Mikmaq) is an Eastern Algonquian language spoken by nearly 11,000 Mikmaq in Canada and the United States out of a total ethnic Mikmaq population of roughly 20,000. The word Mikmaq is a plural word meaning my friends (singular Míkm ); the adjectival form is Míkmaw. The languages native name is Lnuismk, Míkmawísimk or Míkmwei (in some dialects).
in scheme: Lexvo - ISO 639-3 language codes
notation: mic
preferred label: Micmac-Sprache @de
preferred label: micmac @es
preferred label: miquemaque @pt

Mandaic
type: Language
type: Concept
ISO 639-3 code: mid
in scheme: Lexvo - ISO 639-3 language codes
notation: mid

Ocotepec Mixtec
type: Language
type: Concept
ISO 639-3 code: mie
alternative label: Mixtec, Ocotepec
in scheme: Lexvo - ISO 639-3 language codes
notation: mie

Mofu-Gudur
type: Language
type: Concept
ISO 639-3 code: mif
alternative label: Mofu-Gudur language
definition: Mofu-Gudur is an Afro-Asiatic language spoken in northern Cameroon. Dialects are Dimeo, Gudur, Massagal, Mokong, Njeleng, and Zidim.
in scheme: Lexvo - ISO 639-3 language codes
notation: mif

San Miguel El Grande Mixtec
type: Language
type: Concept
ISO 639-3 code: mig
alternative label: Mixtec, San Miguel El Grande
in scheme: Lexvo - ISO 639-3 language codes
notation: mig

Chayuco Mixtec
type: Language
type: Concept
ISO 639-3 code: mih
alternative label: Mixtec, Chayuco
in scheme: Lexvo - ISO 639-3 language codes
notation: mih

Chigmecatitlán Mixtec
type: Language
type: Concept
ISO 639-3 code: mii
alternative label: Mixtec, Chigmecatitlán
in scheme: Lexvo - ISO 639-3 language codes
notation: mii

Abar
type: Language
type: Concept
ISO 639-3 code: mij
alternative label: Abar language
alternative label: Mungbam
definition: Abar is a Bantoid language of Cameroon. It is traditionally classified as a Western Beboid language, but that has not been demonstrated to be a valid family.
in scheme: Lexvo - ISO 639-3 language codes
notation: mij

Yaqui
type: Language
type: Concept
ISO 639-3 code: yaq
alternative label: Yaqui language
definition: Yaqui (or Hiaki), locally known as Yoeme or Yoem Noki, is a Native American language of the Uto-Aztecan family. It is spoken by about 15,000 people, mostly of the border Yaqui people, in the region around the Mexican state of Sonora, and Arizona in the United States.
in scheme: Lexvo - ISO 639-3 language codes
notation: yaq
preferred label: Idioma yaqui @es
preferred label: Língua yaqui @pt

Mikasuki
type: Language
type: Concept
ISO 639-3 code: mik
alternative label: Mikasuki language
definition: The Mikasuki language (also Miccosukee or Hitchiti-Mikasuki) is a Muskogean language spoken by around 500 people in southern Florida. It is spoken by the Miccosukee tribe as well as many Florida Seminoles. The now-extinct Hitchiti language was mutually intelligible with Mikasuki.
in scheme: Lexvo - ISO 639-3 language codes
notation: mik
preferred label: Hitchiti-Mikasuki-Sprache @de
preferred label: Idioma hitchiti-mikasuki @es
preferred label: Língua mikazuki @pt

Peñoles Mixtec
type: Language
type: Concept
ISO 639-3 code: mil
alternative label: Mixtec, Peñoles
in scheme: Lexvo - ISO 639-3 language codes
notation: mil

Alacatlatzala Mixtec
type: Language
type: Concept
ISO 639-3 code: mim
alternative label: Mixtec, Alacatlatzala
in scheme: Lexvo - ISO 639-3 language codes
notation: mim

Minangkabau
type: Language
type: Concept
ISO 639-2 Bibliographical code: min
ISO 639-2 Terminological code: min
ISO 639-3 code: min
alternative label: Minangkabau language
alternative label: Minangkabauische Sprache @de
definition: The Minangkabau language (autonym: Baso Minang(kabau); ) is an Austronesian language, spoken by the Minangkabau of West Sumatra, the western part of Riau, South Aceh Regency, the northern part of Bengkulu and Jambi, also in several cities throughout Indonesia by migrated Minangkabau, who often trade or have a restaurant. The language is also a lingua franca along the western coastal region of the province of North Sumatra, and is even used in parts of Aceh, where the language is called Aneuk Jamee. It is also spoken in some parts of Malaysia, especially Negeri Sembilan.
in scheme: Lexvo - ISO 639-3 language codes
notation: min
preferred label: Minangkabau-Sprache @de
preferred label: menangkabau @it
preferred label: minangkabau @es

Pinotepa Nacional Mixtec
type: Language
type: Concept
ISO 639-3 code: mio
alternative label: Mixtec, Pinotepa Nacional
in scheme: Lexvo - ISO 639-3 language codes
notation: mio

Apasco-Apoala Mixtec
type: Language
type: Concept
ISO 639-3 code: mip
alternative label: Mixtec, Apasco-Apoala
in scheme: Lexvo - ISO 639-3 language codes
notation: mip

Mískito
type: Language
type: Concept
ISO 639-3 code: miq
alternative label: Miskito language
definition: Miskito (Mískitu in the Miskito language) is a Misumalpan language spoken by the Miskito people in northeastern Nicaragua, especially in the North Atlantic Autonomous Region, and in eastern Honduras.
in scheme: Lexvo - ISO 639-3 language codes
notation: miq
preferred label: Idioma mísquito @es
preferred label: Miskito @de

Isthmus Mixe
type: Language
type: Concept
ISO 639-3 code: mir
alternative label: Mixe, Isthmus
in scheme: Lexvo - ISO 639-3 language codes
notation: mir

Uncoded languages
type: Language
type: Concept
ISO 639-2 Bibliographical code: mis
alternative label: Miscellaneous Language
alternative label: langues non codées @fr
in scheme: Lexvo - ISO 639-3 language codes
preferred label: Andere Sprache @de
preferred label: idiomas diversos @pt
preferred label: langue diverse @fr
preferred label: lenguas varias @es
preferred label: lingue diverse @it

Southern Puebla Mixtec
type: Language
type: Concept
ISO 639-3 code: mit
alternative label: Mixtec, Southern Puebla
in scheme: Lexvo - ISO 639-3 language codes
notation: mit

Cacaloxtepec Mixtec
type: Language
type: Concept
ISO 639-3 code: miu
alternative label: Mixtec, Cacaloxtepec
in scheme: Lexvo - ISO 639-3 language codes
notation: miu

Akoye
type: Language
type: Concept
ISO 639-3 code: miw
in scheme: Lexvo - ISO 639-3 language codes
notation: miw

Mixtepec Mixtec
type: Language
type: Concept
ISO 639-3 code: mix
alternative label: Mixtec, Mixtepec
in scheme: Lexvo - ISO 639-3 language codes
notation: mix

Ayutla Mixtec
type: Language
type: Concept
ISO 639-3 code: miy
alternative label: Mixtec, Ayutla
in scheme: Lexvo - ISO 639-3 language codes
notation: miy

Yabarana
type: Language
type: Concept
ISO 639-3 code: yar
alternative label: Yabarana language
definition: Yabarana is a Carib language that was spoken by 20 to 50 people in 1977 in Venezuela. It is nearly extinct.
in scheme: Lexvo - ISO 639-3 language codes
notation: yar
preferred label: Idioma yabarana @es

Coatzospan Mixtec
type: Language
type: Concept
ISO 639-3 code: miz
alternative label: Mixtec, Coatzospan
in scheme: Lexvo - ISO 639-3 language codes
notation: miz

San Juan Colorado Mixtec
type: Language
type: Concept
ISO 639-3 code: mjc
alternative label: Mixtec, San Juan Colorado
in scheme: Lexvo - ISO 639-3 language codes
notation: mjc

Konkow language
type: Language
type: Concept
ISO 639-3 code: mjd
alternative label: Maidu, Northwest
alternative label: Northwest Maidu
definition: The Konkow language (also called Northwestern Maidu — or Koyoomkawi, in the language itself) is a part of the Maiduan language group. The word koyoo means, "meadow", with the additional m being the adjective form of the word. Koyoo+ [m, adj.] kawi + [m, adj.] Maa [tribe].' It is spoken in California and is a severely endangered language, as only two or three persons remain who speak it as a first language are still living. As part of an effort to regain official recognition of one of the Konkow groups as an officially recognized tribe from the U.S. Bureau of Indian Affairs, an effort to provide language instruction amongst the descendants of the original tribe and affiliated family members has begun.
in scheme: Lexvo - ISO 639-3 language codes
notation: mjd
preferred label: Konkow @fr

Muskum
type: Language
type: Concept
ISO 639-3 code: mje
alternative label: Muskum language
definition: Muskum (Muzgum) is an extinct Chadic (Biu–Mandara) language of Chad. Speakers have shifted to Musgu. One speaker remained in 1976.
in scheme: Lexvo - ISO 639-3 language codes
notation: mje

Tu
type: Language
type: Concept
ISO 639-3 code: mjg
alternative label: Monguor language
definition: The Monguor language (; also written Mongour and Mongor) is a Mongolic language of its Shirongolic branch and part of the Gansu-Qinghai-Sprachbund. There are several dialects, mostly spoken by the Monguor people. A written script was devised for Huzhu Monguor (Mongghul) in the late 20th century, but has been little used. A division into two languages, namely Mongghul in Huzhu Tu Autonomous County and Mangghuer in Minhe Hui and Tu Autonomous County, is considered necessary by some scientists. While Mongghul was under strong influence from Tibetan, the same holds for Mangghuer and Chinese.
in scheme: Lexvo - ISO 639-3 language codes
notation: mjg
preferred label: Mangghuer @de
preferred label: Monguor @fr

Mwera
type: Language
type: Concept
ISO 639-3 code: mjh
alternative label: Mwera (Nyasa)
alternative label: Mwera (Nyasa) language
definition: Mwera Nyasa is a poorly attested Bantu language of Tanzania.
in scheme: Lexvo - ISO 639-3 language codes
notation: mjh

Kim Mun
type: Language
type: Concept
ISO 639-3 code: mji
alternative label: Kim Mun language
definition: Kim Mun language (金门方言) is a Hmong–Mien language spoken by some of the Yao people in the provinces of Guangxi, Hunan and Hainan.
in scheme: Lexvo - ISO 639-3 language codes
notation: mji

Mawak
type: Language
type: Concept
ISO 639-3 code: mjj
in scheme: Lexvo - ISO 639-3 language codes
notation: mjj

Matukar
type: Language
type: Concept
ISO 639-3 code: mjk
alternative label: Matukar language
definition: Matukar is an Austronesian language spoken by about 400 people near Madang town, Madang Province, Papua New Guinea. It is universally spoken by its ethnic group.
in scheme: Lexvo - ISO 639-3 language codes
notation: mjk

Mandeali
type: Language
type: Concept
ISO 639-3 code: mjl
in scheme: Lexvo - ISO 639-3 language codes
notation: mjl

Medebur
type: Language
type: Concept
ISO 639-3 code: mjm
in scheme: Lexvo - ISO 639-3 language codes
notation: mjm

Ma
type: Language
type: Concept
ISO 639-3 code: mjn
alternative label: Ma (Papua New Guinea)
in scheme: Lexvo - ISO 639-3 language codes
notation: mjn

Nugunu
type: Language
type: Concept
ISO 639-3 code: yas
alternative label: Gunu language
alternative label: Nugunu (Cameroon)
definition: The Gunu language (Nu Gunu or Nugunu) is a Southern Bantoid language of Cameroon.
in scheme: Lexvo - ISO 639-3 language codes
notation: yas

Malankuravan
type: Language
type: Concept
ISO 639-3 code: mjo
in scheme: Lexvo - ISO 639-3 language codes
notation: mjo

Malapandaram
type: Language
type: Concept
ISO 639-3 code: mjp
in scheme: Lexvo - ISO 639-3 language codes
notation: mjp

Malaryan
type: Language
type: Concept
ISO 639-3 code: mjq
in scheme: Lexvo - ISO 639-3 language codes
notation: mjq

Malavedan
type: Language
type: Concept
ISO 639-3 code: mjr
in scheme: Lexvo - ISO 639-3 language codes
notation: mjr

Miship
type: Language
type: Concept
ISO 639-3 code: mjs
alternative label: Miship language
definition: Miship is an Afro-Asiatic language spoken in Plateau State, Nigeria. Doka is a dialect.
in scheme: Lexvo - ISO 639-3 language codes
notation: mjs

Sauria Paharia
type: Language
type: Concept
ISO 639-3 code: mjt
alternative label: Sauria Paharia language
definition: The Sauria Paharia (Devnagri: सौरिया पहाड़िया) language is spoken in the Bihar and West Bengal states of India, and some pockets of Bangladesh. Most of the speakers are in India with around 110,000. There are about 7,000 speakers in Bangladesh.
in scheme: Lexvo - ISO 639-3 language codes
notation: mjt
preferred label: Malto @de
preferred label: Sauria paharia @fr

Manna-Dora
type: Language
type: Concept
ISO 639-3 code: mju
in scheme: Lexvo - ISO 639-3 language codes
notation: mju

Mannan
type: Language
type: Concept
ISO 639-3 code: mjv
in scheme: Lexvo - ISO 639-3 language codes
notation: mjv

Karbi
type: Language
type: Concept
ISO 639-3 code: mjw
alternative label: Karbi language
definition: The Karbí language, also known as Mikir or Arleng, is spoken by the Karbi people of Assam. It belongs to the Tibeto-Burman language family, but its position is unclear. Shafer (1974) and Bradley (1997) classify the Mikir languages as an aberrant Kukish branch, but Thurgood (2003) leaves them unclassified within Tibeto-Burman.
in scheme: Lexvo - ISO 639-3 language codes
notation: mjw

Mahali
type: Language
type: Concept
ISO 639-3 code: mjx
in scheme: Lexvo - ISO 639-3 language codes
notation: mjx

Mahican
type: Language
type: Concept
ISO 639-3 code: mjy
alternative label: Mahican language
definition: Mahican (also known as Mohican) is an extinct language of the Eastern Algonquian subgroup of the Algonquian language family, itself a member of the Algic language family.
in scheme: Lexvo - ISO 639-3 language codes
notation: mjy
preferred label: Língua moicana @pt
preferred label: Mohican @fr

Majhi
type: Language
type: Concept
ISO 639-3 code: mjz
in scheme: Lexvo - ISO 639-3 language codes
notation: mjz

Mbre
type: Language
type: Concept
ISO 639-3 code: mka
alternative label: Mbre language
definition: Mbre, also spelled Bre, Bεrε, Pre, is an endangered language spoken not far from the city of Bouaké, Ivory Coast. It had 200 speakers out of an ethnic population of 700 in the year 2000, in two villages, down from 15 villages some years earlier. Speakers are shifting to the neighboring Manding language Koro, and the language has large numbers of Manding loan words.
in scheme: Lexvo - ISO 639-3 language codes
notation: mka

Yambeta
type: Language
type: Concept
ISO 639-3 code: yat
in scheme: Lexvo - ISO 639-3 language codes
notation: yat

Mal Paharia
type: Language
type: Concept
ISO 639-3 code: mkb
alternative label: Mal Paharia language
definition: Mal Paharia, is an Indo-Aryan language spoken by about 60,000 of 111,000 ethnic Mal Paharia in the states of Jharkhand and West Bengal in India and possibly in Bangladesh. There is a positive attitude amongst speakers of the language, and the language health is considered vigorous. Nonetheless, some speakers have shifted to Bengali.
in scheme: Lexvo - ISO 639-3 language codes
notation: mkb

Siliput
type: Language
type: Concept
ISO 639-3 code: mkc
in scheme: Lexvo - ISO 639-3 language codes
notation: mkc

Macedonian
type: Language
type: Concept
ISO 639-1 code: mk
ISO 639-2 Bibliographical code: mac
ISO 639-2 Terminological code: mkd
ISO 639-3 code: mkd
alternative label: Idioma macedonio @es
alternative label: Lingua macedone @it
alternative label: Língua macedônia @pt
alternative label: Macedonian language
alternative label: Mazedonische Sprache @de
alternative label: macedónio @pt
alternative label: macédonien @fr
definition: Macedonian (, makedonski jazik, ) is a South Slavic language spoken as a first language by approximately 2–3 million people principally in the region of Macedonia but also in the Macedonian diaspora. It is the official language of the Republic of Macedonia and holds the status of official minority language in parts of Albania, Romania and Serbia.
in scheme: Lexvo - ISO 639-3 language codes
notation: mkd
preferred label: Macédonien @fr
preferred label: Mazedonisch @de
preferred label: macedone @it
preferred label: macedonio @es
preferred label: macedônio @pt

Mawchi
type: Language
type: Concept
ISO 639-3 code: mke
in scheme: Lexvo - ISO 639-3 language codes
notation: mke

Miya
type: Language
type: Concept
ISO 639-3 code: mkf
alternative label: Miya language
definition: Miya is an Afro-Asiatic language spoken in Bauchi State, Nigeria.
in scheme: Lexvo - ISO 639-3 language codes
notation: mkf

Mak
type: Language
type: Concept
ISO 639-3 code: mkg
alternative label: Mak (China)
alternative label: Mak language
definition: The Mak language (; autonym: ʔai3 ma:k8) is a Kam–Sui language spoken in Libo County, Qiannan Prefecture, Guizhou, China. It is spoken mainly in the four townships of Yangfeng, Fangcun, Jialian, and Diwo in Jialiang District, Libo County. Mak speakers can also be found in Dushan County. Mak is spoken alongside Ai-Cham and Buyei.
in scheme: Lexvo - ISO 639-3 language codes
notation: mkg

Dhatki
type: Language
type: Concept
ISO 639-3 code: mki
alternative label: Dhatki language
definition: Dhatki, also known as Dhati or Thari, is one of the Rajasthani languages of the Indo-Aryan branch of the Indo-European language family. It is most closely related to Marwari.
in scheme: Lexvo - ISO 639-3 language codes
notation: mki

Yuwana
type: Language
type: Concept
ISO 639-3 code: yau
alternative label: Hodï language
definition: The Hodï (Jotí, Hoti) language, also known as Yuwana (Yoana), Waruwaru, or Chikano (Chicano), is a small unclassified language of Venezuela. Almost nothing is known of it; its several hundred speakers are monolingual hunter-gatherers.
in scheme: Lexvo - ISO 639-3 language codes
notation: yau
preferred label: Idioma hoti @es

Mokilese
type: Language
type: Concept
ISO 639-3 code: mkj
alternative label: Mokilese language
definition: Mokilese or Mwoakilloan is a Micronesian language originally spoken on Mokil Atoll, Federated States of Micronesia. Of the 1200 Mokilese speakers, only about 500 live on Mokil.
in scheme: Lexvo - ISO 639-3 language codes
notation: mkj
preferred label: Mokil @fr

Byep
type: Language
type: Concept
ISO 639-3 code: mkk
in scheme: Lexvo - ISO 639-3 language codes
notation: mkk

Mokole
type: Language
type: Concept
ISO 639-3 code: mkl
alternative label: Mokole language
definition: Mokole (or Mokollé, Mokwale, Monkole, Féri) is a Yoruba language spoken in the villages surrounding the town of Kandi in Benin. It's the northernmost variety of Yoruba.
in scheme: Lexvo - ISO 639-3 language codes
notation: mkl

Moklen
type: Language
type: Concept
ISO 639-3 code: mkm
alternative label: Moklen language
definition: Moklen is an Austronesian language of coastal Thailand. Like its relative Moken, it has been strongly influenced by Mon–Khmer languages.
in scheme: Lexvo - ISO 639-3 language codes
notation: mkm

Kupang Malay
type: Language
type: Concept
ISO 639-3 code: mkn
alternative label: Malay, Kupang
in scheme: Lexvo - ISO 639-3 language codes
notation: mkn

Mingang Doso
type: Language
type: Concept
ISO 639-3 code: mko
alternative label: Mingang Doso language
definition: Mingang Doso (Məŋgáŋ Dosó) is an Adamawa language of Nigeria.
in scheme: Lexvo - ISO 639-3 language codes
notation: mko

Moikodi
type: Language
type: Concept
ISO 639-3 code: mkp
in scheme: Lexvo - ISO 639-3 language codes
notation: mkp

Bay Miwok
type: Language
type: Concept
ISO 639-3 code: mkq
alternative label: Miwok, Bay
in scheme: Lexvo - ISO 639-3 language codes
notation: mkq

Malas
type: Language
type: Concept
ISO 639-3 code: mkr
in scheme: Lexvo - ISO 639-3 language codes
notation: mkr

Silacayoapan Mixtec
type: Language
type: Concept
ISO 639-3 code: mks
alternative label: Mixtec, Silacayoapan
in scheme: Lexvo - ISO 639-3 language codes
notation: mks

Vamale
type: Language
type: Concept
ISO 639-3 code: mkt
in scheme: Lexvo - ISO 639-3 language codes
notation: mkt

Konyanka Maninka
type: Language
type: Concept
ISO 639-3 code: mku
alternative label: Maninka, Konyanka
in scheme: Lexvo - ISO 639-3 language codes
notation: mku

Yangben
type: Language
type: Concept
ISO 639-3 code: yav
in scheme: Lexvo - ISO 639-3 language codes
notation: yav
preferred label: yangben @es

Mafea
type: Language
type: Concept
ISO 639-3 code: mkv
alternative label: Mavea language
definition: Mavea (also known as Mav̋ea or Mafea) is an Oceanic language spoken on the island of Mavea in Vanuatu, off the eastern coast of Espiritu Santo. It belongs to the North–Central Vanuatu linkage of Southern Oceanic. The total population of the island is approximately 172, with only 34 fluent speakers of the Mavea language remaining as of 2008.
in scheme: Lexvo - ISO 639-3 language codes
notation: mkv
preferred label: Mavea @fr

Kituba
type: Language
type: Concept
ISO 639-3 code: mkw
alternative label: Kituba (Congo)
in scheme: Lexvo - ISO 639-3 language codes
notation: mkw

Kinamiging Manobo
type: Language
type: Concept
ISO 639-3 code: mkx
alternative label: Kinamigin language
alternative label: Manobo, Kinamiging
definition: Kinamigin, also Cinamiguin, Kamigin, or Quinamiguin is a Manobo language spoken on the island of Camiguin in the Philippines. It is declining as most inhabitants have shifted to Cebuano.
in scheme: Lexvo - ISO 639-3 language codes
notation: mkx

East Makian
type: Language
type: Concept
ISO 639-3 code: mky
alternative label: Makian, East
alternative label: Taba language
definition: Taba (also known as East Makian or Makian Dalam) is a Malayo-Polynesian language of the South Halmahera – West New Guinea group. It is spoken mostly on the islands of Makian, Kayoa and southern Halmahera in North Maluku province of Indonesia by about 20,000 people.
in scheme: Lexvo - ISO 639-3 language codes
notation: mky
preferred label: Taba @fr

Idioma makasae
type: Language
type: Concept
ISO 639-3 code: mkz
alternative label: Makasae language
definition: Makasae (also known as Makassai, Macassai, Ma'asae, Makasai) is a Papuan language spoken by about 70,000 people on the eastern part of East Timor, in the districts of Baucau and Viqueque, just to the west of Fataluku. It is the most populous Papuan language in Timor and neighboring islands.
in scheme: Lexvo - ISO 639-3 language codes
notation: mkz
preferred label: Macassai @pt
preferred label: Makasae

Malo
type: Language
type: Concept
ISO 639-3 code: mla
alternative label: Tamambo language
definition: Tamambo is an Oceanic language spoken by at least 3,000 people on Malo and nearby islands in Vanuatu.
in scheme: Lexvo - ISO 639-3 language codes
notation: mla
preferred label: Tamambo @fr

Mbule
type: Language
type: Concept
ISO 639-3 code: mlb
alternative label: Mbule language
definition: The Mbule language, also called Dumbule or Mbola, is an endangered southern Bantoid language spoken by a few people in central Cameroon.
in scheme: Lexvo - ISO 639-3 language codes
notation: mlb

Cao Lan
type: Language
type: Concept
ISO 639-3 code: mlc
alternative label: Caolan language
definition: Caolan, sometimes Man Cao Lan, is a Tai language of northern Vietnam. It is spoken by the San Chay people, who are also known as the Cao Lan. According to Pittayaporn (2009), it is closest to the Zhuang varieties of Chongzuo 崇左 and Shangsi 上思 across the border in China, both of which are lumped under the apparently polyphyletic Yongnan Zhuang by Ethnologue. Together, Caolan, Chongzuo, and Shangsi form a primary branch of the Tai languages.
in scheme: Lexvo - ISO 639-3 language codes
notation: mlc

Malakhel
type: Language
type: Concept
ISO 639-3 code: mld
in scheme: Lexvo - ISO 639-3 language codes
notation: mld

Manambu
type: Language
type: Concept
ISO 639-3 code: mle
alternative label: Manambu language
definition: Manambu is one of the Ndu languages of Sepik River region of northern Papua New Guinea.
in scheme: Lexvo - ISO 639-3 language codes
notation: mle

Kaskean
type: Language
type: Concept
ISO 639-3 code: zsk
alternative label: Kaskian language
definition: Kaskian (Kaskean) was a non-Indo-European language of the Kaskians of northeastern Bronze Age Anatolia, in the mountains along the Black Sea coast.
in scheme: Lexvo - ISO 639-3 language codes
notation: zsk

Mal
type: Language
type: Concept
ISO 639-3 code: mlf
in scheme: Lexvo - ISO 639-3 language codes
notation: mlf

Yawalapití
type: Language
type: Concept
ISO 639-3 code: yaw
in scheme: Lexvo - ISO 639-3 language codes
notation: yaw

Malagasy
type: Language
type: Concept
ISO 639-1 code: mg
ISO 639-2 Bibliographical code: mlg
ISO 639-2 Terminological code: mlg
ISO 639-3 code: mlg
alternative label: Idioma malgache @es
alternative label: Lingua malgascia @it
alternative label: Língua malgaxe @pt
alternative label: Malagassi-Sprache @de
alternative label: Malagasy language
preferred label: malgache @es
definition: Malagasy is the national language of Madagascar, a member of the Austronesian family of languages. Most people in Madagascar speak it as a first language as do some people of Malagasy descent elsewhere.
in scheme: Lexvo - ISO 639-3 language codes
notation: mlg
preferred label: Malgache @fr
preferred label: malgascio @it
preferred label: malgaxe @pt

Mape
type: Language
type: Concept
ISO 639-3 code: mlh
alternative label: Mape language
definition: Mape is a Papuan language spoken in Morobe Province, Papua New Guinea. Dialects are Mape, Fukac, Naga, Nigac; the latter two may be extinct.
in scheme: Lexvo - ISO 639-3 language codes
notation: mlh

Malimpung
type: Language
type: Concept
ISO 639-3 code: mli
in scheme: Lexvo - ISO 639-3 language codes
notation: mli

Miltu
type: Language
type: Concept
ISO 639-3 code: mlj
alternative label: Miltu language
definition: Miltu (also known as Miltou) is an endangered Afro-Asiatic language spoken in southwestern Chad. Speakers are shifting to Bagirmi
in scheme: Lexvo - ISO 639-3 language codes
notation: mlj

Ilwana
type: Language
type: Concept
ISO 639-3 code: mlk
alternative label: Ilwana language
alternative label: Kiwilwana
definition: Ilwana (Kiwilwana), or Malakote, is a minor Bantu language of Kenya.
in scheme: Lexvo - ISO 639-3 language codes
notation: mlk

Malua Bay
type: Language
type: Concept
ISO 639-3 code: mll
in scheme: Lexvo - ISO 639-3 language codes
notation: mll

Mulam
type: Language
type: Concept
ISO 639-3 code: mlm
alternative label: Mulam language
definition: The Mulam language is a Kam–Sui language spoken mainly in Luocheng County, Hechi, northern Guangxi by the Mulao people. The greatest concentrations are in Dongmen and Siba communes. Their autonym is mu6 lam1. The Mulam also call themselves kjam1, which is probably cognate with lam1 and the Dong people's autonym "Kam" (Wang & Zheng 1980).
in scheme: Lexvo - ISO 639-3 language codes
notation: mlm

Yauma
type: Language
type: Concept
ISO 639-3 code: yax
alternative label: Yauma dialect
definition: The Yauma dialect is spoken in Angola and Zambia in the Kwando River area. The Ethnologue gives its family as "unclassified", an apparent error, as it notes that Yauma is "part of the Ngangela subgroup" of the Chokwe–Luchazi (K.10) Bantu languages. (It may be unclassified within that group.) describes it as a variety of Mbunda, also a K.10 Bantu language, citing Maniacky 1997.
in scheme: Lexvo - ISO 639-3 language codes
notation: yax

Malango
type: Language
type: Concept
ISO 639-3 code: mln
in scheme: Lexvo - ISO 639-3 language codes
notation: mln

Mlomp
type: Language
type: Concept
ISO 639-3 code: mlo
alternative label: Mlomp language
definition: The Mlomp language, also known as Gulompaay, is spoken in Senegal. It belongs to the Bak branch of the Niger–Congo language family, and is closely related to the Karon language.
in scheme: Lexvo - ISO 639-3 language codes
notation: mlo

Bargam
type: Language
type: Concept
ISO 639-3 code: mlp
alternative label: Bargam language
definition: Bargam is a Papuan language of Madang Province, Papua New Guinea, mainly by adults.
in scheme: Lexvo - ISO 639-3 language codes
notation: mlp

Western Maninkakan
type: Language
type: Concept
ISO 639-3 code: mlq
alternative label: Maninkakan, Western
in scheme: Lexvo - ISO 639-3 language codes
notation: mlq

Vame
type: Language
type: Concept
ISO 639-3 code: mlr
alternative label: Vame language
definition: Vame is an Afro-Asiatic language spoken in northern Cameroon. Dialects are Demwa, Hurza, Mayo-Plata, Mberem, and Ndreme.
in scheme: Lexvo - ISO 639-3 language codes
notation: mlr

Masalit
type: Language
type: Concept
ISO 639-3 code: mls
in scheme: Lexvo - ISO 639-3 language codes
notation: mls

Maltese
type: Language
type: Concept
ISO 639-1 code: mt
ISO 639-2 Bibliographical code: mlt
ISO 639-2 Terminological code: mlt
ISO 639-3 code: mlt
alternative label: Idioma maltés @es
alternative label: Lingua maltese @it
alternative label: Língua maltesa @pt
alternative label: Maltese language
alternative label: Maltesische Sprache @de
alternative label: maltais @fr
definition: Maltese (Malti) is the national language of Malta, and a co-official language of the country alongside English, while also serving as an official language of the European Union, the only Semitic language so distinguished. Maltese is descended from Siculo-Arabic (the Arabic dialect that developed in Malta and Sicily between the ninth and the fourteenth centuries). and the first known Maltese dictionary was written by the French Knight Francois de Vion Thezan Court in 1640. It includes notes about Maltese grammar and a concluding section detailing, in Italian and Maltese, phrases to be used when giving orders to soldiers. Facsimiles of the work are currently published.
in scheme: Lexvo - ISO 639-3 language codes
notation: mlt
preferred label: Maltais @fr
preferred label: Maltesisch @de
preferred label: maltese @it
preferred label: maltés @es
preferred label: maltês @pt

To'abaita
type: Language
type: Concept
ISO 639-3 code: mlu
in scheme: Lexvo - ISO 639-3 language codes
notation: mlu

Motlav
type: Language
type: Concept
ISO 639-3 code: mlv
preferred label: Mwotlap
alternative label: Mwotlap language
definition: Mwotlap (pronounced ; formerly known as Motlav) is an Oceanic language spoken by about 2,100 people, on the island of Mota Lava (or Motalava), in the Banks Islands, in the northern part of Vanuatu.
in scheme: Lexvo - ISO 639-3 language codes
notation: mlv

Moloko
type: Language
type: Concept
ISO 639-3 code: mlw
alternative label: Moloko language
definition: Moloko is an Afro-Asiatic language spoken in northern Cameroon.
in scheme: Lexvo - ISO 639-3 language codes
notation: mlw

Naha'ai
type: Language
type: Concept
ISO 639-3 code: mlx
alternative label: Malfaxal
in scheme: Lexvo - ISO 639-3 language codes
notation: mlx

Malaynon
type: Language
type: Concept
ISO 639-3 code: mlz
in scheme: Lexvo - ISO 639-3 language codes
notation: mlz

Agwagwune
type: Language
type: Concept
ISO 639-3 code: yay
alternative label: Gwune language
definition: The Gwune language, also known as Agwagwune, is a Upper Cross River language of Nigeria. It is a dialect cluster named after its prestige variety; others are Abayongo, Abini, Dim, Orum, Erei, Etono.
in scheme: Lexvo - ISO 639-3 language codes
notation: yay

Mama
type: Language
type: Concept
ISO 639-3 code: mma
alternative label: Mama language
definition: Mama is one of the Bantoid Jarawan languages of Nigeria. The number of speakers is not known; a figure of 20,000 was published in 1973.
in scheme: Lexvo - ISO 639-3 language codes
notation: mma

Momina
type: Language
type: Concept
ISO 639-3 code: mmb
alternative label: Momina language
definition: Momina is a Papuan language of Indonesia.
in scheme: Lexvo - ISO 639-3 language codes
notation: mmb

Michoacán Mazahua
type: Language
type: Concept
ISO 639-3 code: mmc
alternative label: Mazahua, Michoacán
in scheme: Lexvo - ISO 639-3 language codes
notation: mmc

Maonan
type: Language
type: Concept
ISO 639-3 code: mmd
alternative label: Maonan language
definition: The Maonan language is a Kam–Sui language spoken mainly in Huanjiang Maonan Autonomous County, Hechi, northern Guangxi by the Maonan people.
in scheme: Lexvo - ISO 639-3 language codes
notation: mmd

Mae
type: Language
type: Concept
ISO 639-3 code: mme
in scheme: Lexvo - ISO 639-3 language codes
notation: mme

Mundat
type: Language
type: Concept
ISO 639-3 code: mmf
alternative label: Mundat language
definition: Mundat is an Afro-Asiatic language spoken in Plateau State, Nigeria in the Mundat village of Bokkos LGA.
in scheme: Lexvo - ISO 639-3 language codes
notation: mmf

North Ambrym
type: Language
type: Concept
ISO 639-3 code: mmg
alternative label: Ambrym, North
in scheme: Lexvo - ISO 639-3 language codes
notation: mmg

Mehináku
type: Language
type: Concept
ISO 639-3 code: mmh
alternative label: Mehinaku language
definition: Mehináku (Meinaku) is an Arawakan language spoken in Brazil. It is "somewhat intelligible" with Waurá (Ethnologue 2009).
in scheme: Lexvo - ISO 639-3 language codes
notation: mmh

Musar
type: Language
type: Concept
ISO 639-3 code: mmi
in scheme: Lexvo - ISO 639-3 language codes
notation: mmi

Majhwar
type: Language
type: Concept
ISO 639-3 code: mmj
in scheme: Lexvo - ISO 639-3 language codes
notation: mmj

Mukha-Dora
type: Language
type: Concept
ISO 639-3 code: mmk
in scheme: Lexvo - ISO 639-3 language codes
notation: mmk

Man Met
type: Language
type: Concept
ISO 639-3 code: mml
in scheme: Lexvo - ISO 639-3 language codes
notation: mml

Lokaa
type: Language
type: Concept
ISO 639-3 code: yaz
alternative label: Loko language
definition: Loko, or Lokaa, is a Upper Cross River language of Nigeria.
in scheme: Lexvo - ISO 639-3 language codes
notation: yaz

Maii
type: Language
type: Concept
ISO 639-3 code: mmm
in scheme: Lexvo - ISO 639-3 language codes
notation: mmm

Mamanwa
type: Language
type: Concept
ISO 639-3 code: mmn
alternative label: Mamanwa language
definition: The Mamanwa language is a Central Philippine language spoken in the provinces of Agusan del Norte and Surigao in Mindanao, Philippines. It had about 5,000 speakers as of 1990.
in scheme: Lexvo - ISO 639-3 language codes
notation: mmn

Mangga Buang
type: Language
type: Concept
ISO 639-3 code: mmo
alternative label: Buang, Mangga
in scheme: Lexvo - ISO 639-3 language codes
notation: mmo

Siawi
type: Language
type: Concept
ISO 639-3 code: mmp
alternative label: Siawi language
definition: Siawi (also known as Musian, Musa) is an Amto–Musan language. It is spoken in Sandaun Province of Papua New Guinea in the Amanab and Rocky Peak Districts, south of the Upper Sepik River, toward the headwaters of the Left May River on the Samaia River east of Amto.
in scheme: Lexvo - ISO 639-3 language codes
notation: mmp

Musak
type: Language
type: Concept
ISO 639-3 code: mmq
in scheme: Lexvo - ISO 639-3 language codes
notation: mmq

Western Xiangxi Miao
type: Language
type: Concept
ISO 639-3 code: mmr
alternative label: Miao, Western Xiangxi
in scheme: Lexvo - ISO 639-3 language codes
notation: mmr

Malalamai
type: Language
type: Concept
ISO 639-3 code: mmt
in scheme: Lexvo - ISO 639-3 language codes
notation: mmt

Mmaala
type: Language
type: Concept
ISO 639-3 code: mmu
in scheme: Lexvo - ISO 639-3 language codes
notation: mmu

Miriti
type: Language
type: Concept
ISO 639-3 code: mmv
alternative label: Miriti language
definition: Miriti is an extinct Tucanoan language of Brazil.
in scheme: Lexvo - ISO 639-3 language codes
notation: mmv

Emae
type: Language
type: Concept
ISO 639-3 code: mmw
in scheme: Lexvo - ISO 639-3 language codes
notation: mmw

Madak
type: Language
type: Concept
ISO 639-3 code: mmx
in scheme: Lexvo - ISO 639-3 language codes
notation: mmx

Yala
type: Language
type: Concept
ISO 639-3 code: yba
in scheme: Lexvo - ISO 639-3 language codes
notation: yba

Migaama
type: Language
type: Concept
ISO 639-3 code: mmy
alternative label: Migaama language
definition: Migaama (also known as Migama, Jongor, Djonkor, Dionkor, Dyongor, Djonkor About Telfane) is an Afro-Asiatic language spoken in central Chad.
in scheme: Lexvo - ISO 639-3 language codes
notation: mmy

Mabaale
type: Language
type: Concept
ISO 639-3 code: mmz
in scheme: Lexvo - ISO 639-3 language codes
notation: mmz

Mbula
type: Language
type: Concept
ISO 639-3 code: mna
alternative label: Mbula language
definition: Mbula (also known as Mangap-Mbula, Mangaaba, Mangaawa, Mangaava, Kaimanga) is an Austronesian language spoken by around 2,500 people on Umboi Island and Sakar Island in the Morobe Province of Papua New Guinea. Its basic word order is subject–verb–object; it has a nominative–accusative case-marking strategy.
in scheme: Lexvo - ISO 639-3 language codes
notation: mna

Muna
type: Language
type: Concept
ISO 639-3 code: mnb
in scheme: Lexvo - ISO 639-3 language codes
notation: mnb

Manchu
type: Language
type: Concept
ISO 639-2 Bibliographical code: mnc
ISO 639-2 Terminological code: mnc
ISO 639-3 code: mnc
alternative label: Idioma manchú @es
alternative label: Lingua mancese @it
alternative label: Língua manchu @pt
alternative label: Manchu language
alternative label: Mandschurische Sprache @de
alternative label: mandchou @fr
definition: Manchu is a Tungusic endangered language spoken in Northeast China; it used to be the language of the Manchu, though now most Manchus speak Mandarin Chinese and there are fewer than 70 native speakers of Manchu out of a total of nearly 10 million ethnic Manchus. Although the Xibe language, with 40,000 speakers, is in almost every respect identical to Manchu, Xibe speakers, who live in far western Xinjiang, are ethnically distinct from Manchus.
in scheme: Lexvo - ISO 639-3 language codes
notation: mnc
preferred label: Mandchou @fr
preferred label: Mandschurisch @de
preferred label: manchu @it
preferred label: manchú @es

Mondé
type: Language
type: Concept
ISO 639-3 code: mnd
in scheme: Lexvo - ISO 639-3 language codes
notation: mnd

Naba
type: Language
type: Concept
ISO 639-3 code: mne
alternative label: Naba language
definition: Naba is a Nilo-Saharan language spoken by 232,000 people in Chad. Those who speak this language are called Lisi, a collective name for three closely associated ethnic groups, the Bilala, the Kuka and the Medogo, that represent the three dialects in which Naba is subdivided. They live mainly in the Batha Prefecture, but the Kuka are also in Chari-Baguirmi. Ethnologue estimates the lexical similarity among the three dialects to be no less than 99%. Arabic is often known as a second language.
in scheme: Lexvo - ISO 639-3 language codes
notation: mne

Yemba
type: Language
type: Concept
ISO 639-3 code: ybb
alternative label: Yemba language
definition: Yɛmba is a major Grassfields language of Cameroon.
in scheme: Lexvo - ISO 639-3 language codes
notation: ybb
preferred label: yemba @es
preferred label: yémba @fr

Mundani
type: Language
type: Concept
ISO 639-3 code: mnf
alternative label: Mundani language
definition: Mundani is a Grassfields Bantu language of Cameroon.
in scheme: Lexvo - ISO 639-3 language codes
notation: mnf

Eastern Mnong
type: Language
type: Concept
ISO 639-3 code: mng
alternative label: Mnong, Eastern
in scheme: Lexvo - ISO 639-3 language codes
notation: mng

Mono
type: Language
type: Concept
ISO 639-3 code: mnh
alternative label: Mono (Democratic Republic of Congo)
alternative label: Mono language
definition: Mono is a language spoken by about 65,000 people in the northwestern corner of the Democratic Republic of the Congo. It is one of the Banda languages, a subbranch of the Ubangian branch of the Niger–Congo languages. It has five dialects: Bili, Bubanda, Mpaka, Galaba, and Kaga.
in scheme: Lexvo - ISO 639-3 language codes
notation: mnh

Manipuri
type: Language
type: Concept
ISO 639-2 Bibliographical code: mni
ISO 639-2 Terminological code: mni
ISO 639-3 code: mni
alternative label: Idioma meitei @es
alternative label: Lingua manipuri @it
alternative label: Língua manipuri @pt
alternative label: Meitei language
alternative label: Meithei-Sprache @de
preferred label: manipuri @es
definition: Meitei-lon (মৈতৈলোন্ ), also Meitei-lol (মৈতৈলোল্ ) and Manipuri (মণিপুরি ) (and sometimes, the 19th century British term, Meithei (মৈথৈ ), which is the name of the people, not of the language), is the predominant language and lingua franca in the southeastern Himalayan state of Manipur, in northeastern India. It is the official language in government offices. Meitei-lon is also spoken in the Indian states of Assam and Tripura, and in Bangladesh and Burma (now Myanmar).
in scheme: Lexvo - ISO 639-3 language codes
notation: mni
preferred label: Meitei @de

Munji
type: Language
type: Concept
ISO 639-3 code: mnj
alternative label: Munji language
definition: The Munji language, also Munjani language, is a Pamir language spoken in Badakhshan Province in Afghanistan. It is similar to the Yidgha language which is spoken in the Upper Lutkuh Valley of Chitral, west of Garam Chishma in Pakistan.
in scheme: Lexvo - ISO 639-3 language codes
notation: mnj

Lingua mandinka
type: Language
type: Concept
ISO 639-3 code: mnk
alternative label: Mandinka language
definition: The Mandinka language (Mandinka kango) is a Mandé language spoken by millions of Mandinka people in Mali, Senegal, The Gambia, Guinea, Côte dIvoire, Burkina Faso, Sierra Leone, Liberia, and Guinea-Bissau and Chad; it is the main language of The Gambia. It belongs to the Manding branch of Mandé, and is thus fairly similar to Bambara and Maninka or Malinké. In a majority of areas, it is tonal language with two tones: low and high, although the particular variety spoken in The Gambia and Senegal is non-tonal and uses a pitch accent.
in scheme: Lexvo - ISO 639-3 language codes
notation: mnk
preferred label: Língua mandinga @pt
preferred label: Mandinka

Tiale
type: Language
type: Concept
ISO 639-3 code: mnl
in scheme: Lexvo - ISO 639-3 language codes
notation: mnl

Mapena
type: Language
type: Concept
ISO 639-3 code: mnm
in scheme: Lexvo - ISO 639-3 language codes
notation: mnm

Southern Mnong
type: Language
type: Concept
ISO 639-3 code: mnn
alternative label: Mnong, Southern
in scheme: Lexvo - ISO 639-3 language codes
notation: mnn

Min Bei
type: Language
type: Concept
ISO 639-3 code: mnp
alternative label: Chinese, Min Bei
alternative label: Min Bei Chinese
definition: The Min-Bei language, or Northern Min is a collection of dialects of Min spoken in Nanping Prefecture of northwestern Fujian which, apart from Shao-Jiang Min, are mutually intelligible.
in scheme: Lexvo - ISO 639-3 language codes
notation: mnp
preferred label: Minbei @fr

Minriq
type: Language
type: Concept
ISO 639-3 code: mnq
alternative label: Minriq language
definition: Menriq (Minriq) is an aboriginal Mon–Khmer language of Malaya.
in scheme: Lexvo - ISO 639-3 language codes
notation: mnq

Mono
type: Language
type: Concept
ISO 639-3 code: mnr
alternative label: Mono (USA)
alternative label: Mono language
definition: Mono is a Native American language of the Numic group of Uto-Aztecan languages, the ancestral language of the Mono people. Mono consists of two dialects, Eastern and Western. The name "Monachi" is commonly used in reference to Western Mono and "Owens Valley Paiute" in reference to Eastern Mono.
in scheme: Lexvo - ISO 639-3 language codes
notation: mnr
preferred label: Idioma mono @es

Mansi
type: Language
type: Concept
ISO 639-3 code: mns
alternative label: Mansi language
definition: The Mansi language (also Vogul, although this is obsolete, and "Maansi") is a language of the Mansi people. It is spoken in territories of Russia along the Ob River and its tributaries, including the Khanty–Mansi Autonomous Okrug and the Sverdlovsk Oblast. According to the 1989 census, there were 3,184 Mansi-speaking people in Russia.
in scheme: Lexvo - ISO 639-3 language codes
notation: mns
preferred label: Idioma mansi @es
preferred label: Lingua vogula @it
preferred label: Língua mansi @pt
preferred label: Mansische Sprache @de

Maykulan
type: Language
type: Concept
ISO 639-3 code: mnt
in scheme: Lexvo - ISO 639-3 language codes
notation: mnt

Mer
type: Language
type: Concept
ISO 639-3 code: mnu
alternative label: Mer language
definition: Mer (also called Muri, Miere) is a Papuan language spoken in Papua province of Indonesia.
in scheme: Lexvo - ISO 639-3 language codes
notation: mnu

Rennell-Bellona
type: Language
type: Concept
ISO 639-3 code: mnv
alternative label: Rennellese language
definition: Rennell-Bellona, or Rennellese, is a Polynesian language spoken in the Rennell and Bellona Province of the Solomon Islands. A dictionary has been published in the language. It is a Polynesian outlier language.
in scheme: Lexvo - ISO 639-3 language codes
notation: mnv

Idioma mon
type: Language
type: Concept
ISO 639-3 code: mnw
alternative label: Mon language
definition: The Mon language (; ) is an Austroasiatic language spoken by the Mon, who live in Burma (Myanmar) and Thailand. Mon, like the related language Cambodian—but unlike most languages in Mainland Southeast Asia—is not tonal. Mon is spoken by more than a million people today. In recent years, usage of Mon has declined rapidly, especially among the younger generation.
in scheme: Lexvo - ISO 639-3 language codes
notation: mnw
preferred label: Mon
preferred label: Môn @fr

West Yugur
type: Language
type: Concept
ISO 639-3 code: ybe
alternative label: Western Yugur language
alternative label: Yugur, West
definition: Western Yugur and Eastern Yugur are terms coined by Chinese linguists to distinguish between the Turkic and Mongolic Yugur language, both spoken within the Yugur nationality. The terms may also indicate the speakers of these languages. Traditionally, both languages are indicated by the term Yellow Uygur, from the endonym of the Yugur.
in scheme: Lexvo - ISO 639-3 language codes
notation: ybe
preferred label: West-Yugurisch @de
preferred label: Yugur occidental @fr

Manikion
type: Language
type: Concept
ISO 639-3 code: mnx
alternative label: Mantion language
definition: Mantion (Manikion), also known as Sougb or Sogh, is a language of the East Birds Head language family spoken in East Birds Head, east of Meyah, south of Manokwari. It consists of four dialects and is spoken by around 12,000 people in all.
in scheme: Lexvo - ISO 639-3 language codes
notation: mnx

Manyawa
type: Language
type: Concept
ISO 639-3 code: mny
in scheme: Lexvo - ISO 639-3 language codes
notation: mny

Moni
type: Language
type: Concept
ISO 639-3 code: mnz
alternative label: Moni language
definition: Moni, also Djonggunu~Jonggunu or Migani, is a Papuan language spoken by about 20,000 people in the Paniai lakes region of the Indonesian province of Papua. Awembak (Awembiak) is a dialect.
in scheme: Lexvo - ISO 639-3 language codes
notation: mnz

Mwan
type: Language
type: Concept
ISO 639-3 code: moa
alternative label: Mwan language
definition: Mwan (Mwa, Mouan, Muan, Muana, Mona) is a Mande language of Ivory Coast.
in scheme: Lexvo - ISO 639-3 language codes
notation: moa

Mocoví
type: Language
type: Concept
ISO 639-3 code: moc
alternative label: Mocoví language
definition: The Mocoví language is a Guaicuruan language of Argentina spoken by about 4,500 people mostly in Santa Fé province.
in scheme: Lexvo - ISO 639-3 language codes
notation: moc

Mobilian
type: Language
type: Concept
ISO 639-3 code: mod
alternative label: Mobilian Jargon
definition: Mobilian Jargon (also Mobilian trade language, Mobilian Trade Jargon, Chickasaw–Choctaw trade language, Yamá) was a pidgin used as a lingua franca among Native American groups living along the Gulf of Mexico around the time of European settlement of the region. The name refers to the Mobile Indians of the central Gulf Coast.
in scheme: Lexvo - ISO 639-3 language codes
notation: mod

Montagnais
type: Language
type: Concept
ISO 639-3 code: moe
alternative label: Innu language
definition: Innu-aimun or Montagnais is an Algonquian language spoken by over 11,000 people, called the Innu, in Labrador and Quebec in Eastern Canada. It is a member of the Cree-Montagnais-Naskapi dialect continuum and is spoken in various dialects depending on the community.
in scheme: Lexvo - ISO 639-3 language codes
notation: moe
preferred label: Innu-aimun @fr

Mongondow
type: Language
type: Concept
ISO 639-3 code: mog
alternative label: Bolaang Mongondow language
definition: The Bolaang Mongondow language (also called simply Mongondow) is a Philippine language spoken in the district (Kabupaten) of Bolaang Mongondow in North Sulawesi (Celebes), Indonesia.
in scheme: Lexvo - ISO 639-3 language codes
notation: mog

Mohawk
type: Language
type: Concept
ISO 639-2 Bibliographical code: moh
ISO 639-2 Terminological code: moh
ISO 639-3 code: moh
alternative label: Lengua mohawk @es
alternative label: Mohawk language
alternative label: Mohawk-Sprache @de
preferred label: mohawk @es
definition: Mohawk is an Iroquoian language spoken by around 3,000 people of the Mohawk nation in the United States (mainly western and northern New York) and Canada (southern Ontario and Quebec). Mohawk has the largest number of speakers of the Northern Iroquoian languages; today it is the only one with greater than a thousand remaining. At Akwesasne, residents have begun a language immersion school (pre-K to grade 8) in to revive the language. With their children learning it, parents and other family members are taking language classes, too.
in scheme: Lexvo - ISO 639-3 language codes
notation: moh

Mboi
type: Language
type: Concept
ISO 639-3 code: moi
alternative label: Mboi language
definition: Mboi (Mboire, Mboyi) is an Adamawa language of Nigeria. Its name is that of one of its dialects, the other two being Banga and Handa. These are rather divergent, and might be considered distinct languages.
in scheme: Lexvo - ISO 639-3 language codes
notation: moi

Monzombo
type: Language
type: Concept
ISO 639-3 code: moj
in scheme: Lexvo - ISO 639-3 language codes
notation: moj

Morori
type: Language
type: Concept
ISO 639-3 code: mok
alternative label: Morori language
definition: Morori (Marori, Moaraeri, Moraori, Morari) is a Trans–New Guinea language that forms an independent branch of Trans–New Guinea in the classification of Malcolm Ross (2005).
in scheme: Lexvo - ISO 639-3 language codes
notation: mok

Mangue
type: Language
type: Concept
ISO 639-3 code: mom
alternative label: Chorotega language
definition: Chorotega, also known as Mangue, was a language indigenous people of Honduras, Costa Rica and Nicaragua. The ethnic population number around 10,000. The Chorotega language, which was a member of the Manguean branch of the Oto-Manguean language family, is now extinct. Chorotega-speaking peoples included the Mangue and Monimbo; dialects were Chorotega proper, Diria, Nagrandan, Nicoya, Orisi, and Orotiña.
in scheme: Lexvo - ISO 639-3 language codes
notation: mom
preferred label: Chorotega @de
preferred label: Idioma chorotega @es

Mongolian
type: Language
type: Concept
ISO 639-1 code: mn
ISO 639-2 Bibliographical code: mon
ISO 639-2 Terminological code: mon
ISO 639-3 code: mon
ISO 639-5 code: xgn
alternative label: Langues mongoles @fr
alternative label: Lenguas mongólicas @es
alternative label: Lingue mongoliche @it
alternative label: Línguas mongólicas @pt
alternative label: Mongolian language
alternative label: Mongolian languages
alternative label: Mongolic language
alternative label: Mongolic languages
alternative label: Mongolische Sprachen @de
alternative label: langue mongoles @fr
alternative label: mongoles, langues @fr
definition: The Mongolic languages are a group of languages spoken in East-Central Asia, mostly in Mongolia and surrounding areas plus in Kalmykia. The best-known member of this language family, Mongolian, is the primary language of most of the residents of Mongolia and the Mongolian residents of Inner Mongolia, China with an estimated 5.2 million speakers. Mongolic is sometimes grouped with Turkic, Tungusic and possibly Korean and Japonic as part of the larger Altaic family.
in scheme: Lexvo - ISO 639-3 language codes
notation: mon
preferred label: Mongolisch @de
preferred label: mongol @es
preferred label: mongolo @it

ISO 639-5 code
type: Property
label: Código ISO 639-5 @pt

Yakha
type: Language
type: Concept
ISO 639-3 code: ybh
alternative label: Yakkha language
definition: Yakkha (also erroneously spelled as Yakha) is a language spoken in parts of Nepal, Darjeeling district and Sikkim. The Yakkha-speaking villages are located to the East of the Arun river, in the southern part of the Sankhuwasabha district and in the northern part of the Dhankuta district of Nepal. About 14,000 people still speak the language, out of 17,003 ethnic Yakkha in Nepal. Genealogically, Yakkha belongs to the Eastern Kiranti languages and is in one subgroup with several Rai languages, e.g. Belhare, Athpare, Chintang and Chulung (Chɨlɨng). Ethnically however, the Yakkha people perceive themselves as distinct from the other Kiranti groups such as Limbu and Rai. Yakkha has no own script, but recently published materials use a slightly adjusted Devanagari script.
in scheme: Lexvo - ISO 639-3 language codes
notation: ybh

Monom
type: Language
type: Concept
ISO 639-3 code: moo
in scheme: Lexvo - ISO 639-3 language codes
notation: moo

Mopán Maya
type: Language
type: Concept
ISO 639-3 code: mop
alternative label: Mopan Maya language
definition: Mopan is a language that belongs to the Yucatecan branch of the Mayan languages. It is spoken by the Mopan people. It is spoken in Belize and Guatemala.
in scheme: Lexvo - ISO 639-3 language codes
notation: mop
preferred label: Idioma mopán @es
preferred label: Língua mopan @pt
preferred label: Maya mopan @fr
preferred label: Mopan-Sprache @de

Mor
type: Language
type: Concept
ISO 639-3 code: moq
alternative label: Mor (Bomberai Peninsula)
alternative label: Mor language
definition: Mor is a nearly extinct Trans–New Guinea language that forms an independent branch of that family in the classification of Malcolm Ross (2005).
in scheme: Lexvo - ISO 639-3 language codes
notation: moq

Moro
type: Language
type: Concept
ISO 639-3 code: mor
alternative label: Moro language
definition: Moro is a Niger–Congo language in the Heiban family spoken in Kordofan, Sudan.
in scheme: Lexvo - ISO 639-3 language codes
notation: mor

Mossi
type: Language
type: Concept
ISO 639-2 Bibliographical code: mos
ISO 639-2 Terminological code: mos
ISO 639-3 code: mos
alternative label: Idioma mossi @es
alternative label: Lingua more @it
alternative label: Língua more @pt
alternative label: Mossi language
alternative label: Mossi-Sprache @de
alternative label: moré @fr
definition: The Mossi language, Mòoré (also Mooré, Moré, Moshi, Moore or More) is one of two official regional languages of Burkina Faso, closely related and mutually intelligible with the Dagbani language spoken in northern Ghana. It is the language of the Mossi people, spoken by approximately 5 million people in Burkina, plus another 60,000+ in Mali and Togo.
in scheme: Lexvo - ISO 639-3 language codes
notation: mos
preferred label: Moré @fr
preferred label: Mòoré @de
preferred label: mossi @es

Barí
type: Language
type: Concept
ISO 639-3 code: mot
alternative label: Barí language
definition: Barí is a Chibchan language spoken in Northwestern South America by the Baris (Motilones). Motilones are sometimes called "dobocubi", but this is a pejorative term.
in scheme: Lexvo - ISO 639-3 language codes
notation: mot
preferred label: Idioma barí @es

Mogum
type: Language
type: Concept
ISO 639-3 code: mou
alternative label: Mogum language
definition: Mogum (also known as Mogoum) is an Afro-Asiatic language spoken in south central Chad.
in scheme: Lexvo - ISO 639-3 language codes
notation: mou

Mohave
type: Language
type: Concept
ISO 639-3 code: mov
alternative label: Mojave language
definition: Mojave (also Mohave) is the native language of the Mohave people along the Colorado River in eastern California, northwestern Arizona, and southwestern Nevada. Approximately 70% of the speakers reside in Arizona, while approximately 30% reside in California.
in scheme: Lexvo - ISO 639-3 language codes
notation: mov
preferred label: Mojave @fr

Moi
type: Language
type: Concept
ISO 639-3 code: mow
alternative label: Moi (Congo)
in scheme: Lexvo - ISO 639-3 language codes
notation: mow

Molima
type: Language
type: Concept
ISO 639-3 code: mox
in scheme: Lexvo - ISO 639-3 language codes
notation: mox

Shekkacho
type: Language
type: Concept
ISO 639-3 code: moy
alternative label: Shekkacho language
definition: Shekkacho (also Mocha, Shakacho, Shekka) is an Afro-Asiatic Omotic language, spoken in the north Kafa region of southwest Ethiopia, in the Maasha area. It is closely related to Kafa.
in scheme: Lexvo - ISO 639-3 language codes
notation: moy

Yamphu
type: Language
type: Concept
ISO 639-3 code: ybi
alternative label: Yamphu language
definition: Yamphu is a Tibeto-Burman language spoken by the Yamphu Rai, a Kiranti people of the Himalayas of Nepal. Tomyang (Chongka) is a dialect.
in scheme: Lexvo - ISO 639-3 language codes
notation: ybi

Mukulu
type: Language
type: Concept
ISO 639-3 code: moz
alternative label: Gergiko
alternative label: Mukulu language
definition: Mukulu (also known as Gergiko, Guerguiko, Mokulu, Mokoulou, Djonkor Guera, Dyongor Guera, Diongor Guera, Jonkor-Gera, Mokilko) is an Afro-Asiatic language spoken in central Chad. The local name for the language is Gergiko (or Geurguiko in the French orthography). This is the name used for mother-tongue literacy materials. Mukulu is the name of a village.
in scheme: Lexvo - ISO 639-3 language codes
notation: moz

Mpoto
type: Language
type: Concept
ISO 639-3 code: mpa
alternative label: Mpoto language
definition: Mpoto is a Bantu language of Tanzania.
in scheme: Lexvo - ISO 639-3 language codes
notation: mpa

Mullukmulluk
type: Language
type: Concept
ISO 639-3 code: mpb
alternative label: Malak-Malak language
definition: Malak-Malak (also spelt Mullukmulluk, Malagmalag) or Ngolokwangga (Ngolak-Wonga, Ngolok-Wanggar, Nguluwongga) is an Australian Aboriginal language. It is nearly extinct, with children growing up speaking Kriol instead.
in scheme: Lexvo - ISO 639-3 language codes
notation: mpb

Mangarayi
type: Language
type: Concept
ISO 639-3 code: mpc
alternative label: Mangarayi language
definition: Mangarayi (Manggarrai, Mungerry, Ngarrabadji) is an Australian language spoken in the Northern Territory.
in scheme: Lexvo - ISO 639-3 language codes
notation: mpc

Machinere
type: Language
type: Concept
ISO 639-3 code: mpd
in scheme: Lexvo - ISO 639-3 language codes
notation: mpd

Majang
type: Language
type: Concept
ISO 639-3 code: mpe
alternative label: Majang language
definition: The Majang language is spoken by the Majangir of Ethiopia. Although it is a member of the Surmic cluster, this language is the most isolated one in that cluster (Fleming 1983). A language survey has shown that dialect variation from north to south is minor and does not seriously impede communication. The 2007 Ethiopian Census lists 6,433 speakers for Majang (Messengo), but also reports that the ethnic group consists of 32,822 individuals (Messengo and Mejengir). According to the census, almost no speakers can be found in Mezhenger Zone of Gambela Region; a total of eleven speakers are listed for the zone, but almost 10,000 ethnic Mejenger or Messengo people.
in scheme: Lexvo - ISO 639-3 language codes
notation: mpe
preferred label: Majangir @de

Marba
type: Language
type: Concept
ISO 639-3 code: mpg
alternative label: Marba language
definition: Marba is an Afro-Asiatic language of Chad.
in scheme: Lexvo - ISO 639-3 language codes
notation: mpg

Maung
type: Language
type: Concept
ISO 639-3 code: mph
alternative label: Maung language
definition: Maung (Mawung, Mawng) Australian language is the language of the Goulburn Islands, off the north coast of Arnhem Land, Northern Territory of Australia. Maung is closely related to Iwaidja language which occupies the northwestern corner of the opposite mainland. This is a language that belongs to the Iwaidjan language family of Non-Pama–Nyungan languages. As of 1983, there were 200 speakers of the language.( )
in scheme: Lexvo - ISO 639-3 language codes
notation: mph

Mpade
type: Language
type: Concept
ISO 639-3 code: mpi
alternative label: Mpade language
definition: √ Mpade is an Afro-Asiatic language spoken in northern Cameroon and southwestern Chad. Dialects are Bodo, Digam, Mpade, Shoe, and Woulki.
in scheme: Lexvo - ISO 639-3 language codes
notation: mpi

Martu Wangka
type: Language
type: Concept
ISO 639-3 code: mpj
in scheme: Lexvo - ISO 639-3 language codes
notation: mpj

Mbara
type: Language
type: Concept
ISO 639-3 code: mpk
alternative label: Mbara (Chad)
alternative label: Mbara language
definition: Mbara is an endangered Chadic (Biu–Mandara) language of Chad.
in scheme: Lexvo - ISO 639-3 language codes
notation: mpk

Hasha
type: Language
type: Concept
ISO 639-3 code: ybj
alternative label: Hasha language
definition: Hasha Yashi is a Plateau language of Nigeria. It has an idiosyncratic system of reduplicating the first syllable of noun stems, apparently under the influence of the Chadic language Sha.
in scheme: Lexvo - ISO 639-3 language codes
notation: ybj

Middle Watut
type: Language
type: Concept
ISO 639-3 code: mpl
alternative label: Watut, Middle
in scheme: Lexvo - ISO 639-3 language codes
notation: mpl

Yosondúa Mixtec
type: Language
type: Concept
ISO 639-3 code: mpm
alternative label: Mixtec, Yosondúa
in scheme: Lexvo - ISO 639-3 language codes
notation: mpm

Mindiri
type: Language
type: Concept
ISO 639-3 code: mpn
alternative label: Mindiri language
definition: Mindiri is an Austronesian language spoken by about 80 people in one village on the Rai Coast, Madang Province, Papua New Guinea.
in scheme: Lexvo - ISO 639-3 language codes
notation: mpn

Miu
type: Language
type: Concept
ISO 639-3 code: mpo
alternative label: Miu language
definition: Miu is an Austronesian language spoken by about 500 tropical forest agriculturists in the Gimi Rauto District of West New Britain Province, Papua New Guinea on the island of New Britain.
in scheme: Lexvo - ISO 639-3 language codes
notation: mpo

Migabac
type: Language
type: Concept
ISO 639-3 code: mpp
in scheme: Lexvo - ISO 639-3 language codes
notation: mpp

Matís
type: Language
type: Concept
ISO 639-3 code: mpq
in scheme: Lexvo - ISO 639-3 language codes
notation: mpq

Vangunu
type: Language
type: Concept
ISO 639-3 code: mpr
alternative label: Vangunu language
definition: Vangunu is an Oceanic language spoken by about 900 people on Vangunu Island, Solomon Islands. Speakers of Vangunu also use the closely related Marovo.
in scheme: Lexvo - ISO 639-3 language codes
notation: mpr

Dadibi
type: Language
type: Concept
ISO 639-3 code: mps
alternative label: Dadibi language
definition: Dadibi (also Daribi or Karimui) is a language of Papua New Guinea.
in scheme: Lexvo - ISO 639-3 language codes
notation: mps

Mian
type: Language
type: Concept
ISO 639-3 code: mpt
alternative label: Mian language
definition: Mian is an Ok language spoken in the Telefomin district of the Sandaun province in Papua New Guinea by the Mian people. It has some 3,500 speakers spread across two dialects: West Mian with approximately 1,000 speakers in around Yapsiei and East Mian with approximately 2,500 speakers in and around Timeilmin, Temsakmin, Sokamin, Gubil, Fiak and Hotmin. Phonologically, Mian is very similar to other Papuan languages in the size of its phoneme inventory, but it nevertheless has some peculiarities, such as its contrast between a plain [a] and a pharyngealized [aˤ]. It is also a tonal language.
in scheme: Lexvo - ISO 639-3 language codes
notation: mpt

Makuráp
type: Language
type: Concept
ISO 639-3 code: mpu
alternative label: Makurap language
definition: Makurap (Macurapi) is a Tupian language of Brazil.
in scheme: Lexvo - ISO 639-3 language codes
notation: mpu

Mungkip
type: Language
type: Concept
ISO 639-3 code: mpv
in scheme: Lexvo - ISO 639-3 language codes
notation: mpv

Bokha
type: Language
type: Concept
ISO 639-3 code: ybk
in scheme: Lexvo - ISO 639-3 language codes
notation: ybk

Mapidian
type: Language
type: Concept
ISO 639-3 code: mpw
alternative label: Mapidian language
definition: Mapidian (Maopidyán) is a moribund Arawakan language of Brazil and formerly of Guyana.
in scheme: Lexvo - ISO 639-3 language codes
notation: mpw

Misima-Panaeati
type: Language
type: Concept
ISO 639-3 code: mpx
alternative label: Misima-Paneati language
definition: Misima-Paneati, also called Misiman, is an indigenous Austronesian language spoken on the islands of Misima, Panaieti, and the islands of the eastern half of the Calvados Chain of Papua New Guinea.
in scheme: Lexvo - ISO 639-3 language codes
notation: mpx

Mapia
type: Language
type: Concept
ISO 639-3 code: mpy
in scheme: Lexvo - ISO 639-3 language codes
notation: mpy

Mpi
type: Language
type: Concept
ISO 639-3 code: mpz
alternative label: Mpi language
definition: Mpi is a Loloish language of Thailand. The number of speakers is in decline.
in scheme: Lexvo - ISO 639-3 language codes
notation: mpz

Maba
type: Language
type: Concept
ISO 639-3 code: mqa
alternative label: Maba (Indonesia)
in scheme: Lexvo - ISO 639-3 language codes
notation: mqa

Mbuko
type: Language
type: Concept
ISO 639-3 code: mqb
alternative label: Mbuko language
definition: Mbuko is an Afro-Asiatic language spoken in the canton of Doulek, Méri subdivision, department of Diamaré, and also in parts of the canton of Serawa, Tokombéré subdivision, department of Mayo-Sava, in the Far North Region of Cameroon.
in scheme: Lexvo - ISO 639-3 language codes
notation: mqb

Zambian Sign Language
type: Language
type: Concept
ISO 639-3 code: zsl
definition: Zambian Sign Language is a sign language used by the Deaf community in Zambia. It is not clear how many Zambians use Zambian Sign Language, although it is taught in some special schools and interpreters appear on some television programmes. The Association of Sign Language Interpreters of Zambia (ASLIZ) is involved in promoting greater support for and recognition of Zambian Sign Language in schools, in the government and in entertainment media such as television.
in scheme: Lexvo - ISO 639-3 language codes
notation: zsl

Mangole
type: Language
type: Concept
ISO 639-3 code: mqc
in scheme: Lexvo - ISO 639-3 language codes
notation: mqc

Yukuben
type: Language
type: Concept
ISO 639-3 code: ybl
in scheme: Lexvo - ISO 639-3 language codes
notation: ybl

Matepi
type: Language
type: Concept
ISO 639-3 code: mqe
in scheme: Lexvo - ISO 639-3 language codes
notation: mqe

Momuna
type: Language
type: Concept
ISO 639-3 code: mqf
alternative label: Momuna language
definition: Momuna, also known as Somahai (Somage, Sumohai), is a Papuan language of Indonesia.
in scheme: Lexvo - ISO 639-3 language codes
notation: mqf

Kota Bangun Kutai Malay
type: Language
type: Concept
ISO 639-3 code: mqg
alternative label: Malay, Kota Bangun Kutai
in scheme: Lexvo - ISO 639-3 language codes
notation: mqg

Tlazoyaltepec Mixtec
type: Language
type: Concept
ISO 639-3 code: mqh
alternative label: Mixtec, Tlazoyaltepec
in scheme: Lexvo - ISO 639-3 language codes
notation: mqh

Mariri
type: Language
type: Concept
ISO 639-3 code: mqi
in scheme: Lexvo - ISO 639-3 language codes
notation: mqi

Mamasa
type: Language
type: Concept
ISO 639-3 code: mqj
in scheme: Lexvo - ISO 639-3 language codes
notation: mqj

Rajah Kabunsuwan Manobo
type: Language
type: Concept
ISO 639-3 code: mqk
alternative label: Manobo, Rajah Kabunsuwan
in scheme: Lexvo - ISO 639-3 language codes
notation: mqk

Yaben
type: Language
type: Concept
ISO 639-3 code: ybm
in scheme: Lexvo - ISO 639-3 language codes
notation: ybm

Mbelime
type: Language
type: Concept
ISO 639-3 code: mql
alternative label: Mbelime language
definition: Mbelime, or Niende, is a Gur language of Benin.
in scheme: Lexvo - ISO 639-3 language codes
notation: mql

South Marquesan
type: Language
type: Concept
ISO 639-3 code: mqm
alternative label: Marquesan, South
in scheme: Lexvo - ISO 639-3 language codes
notation: mqm

Moronene
type: Language
type: Concept
ISO 639-3 code: mqn
in scheme: Lexvo - ISO 639-3 language codes
notation: mqn

Modole
type: Language
type: Concept
ISO 639-3 code: mqo
in scheme: Lexvo - ISO 639-3 language codes
notation: mqo

Manipa
type: Language
type: Concept
ISO 639-3 code: mqp
in scheme: Lexvo - ISO 639-3 language codes
notation: mqp

Minokok
type: Language
type: Concept
ISO 639-3 code: mqq
in scheme: Lexvo - ISO 639-3 language codes
notation: mqq

Mander
type: Language
type: Concept
ISO 639-3 code: mqr
in scheme: Lexvo - ISO 639-3 language codes
notation: mqr

Yabaâna
type: Language
type: Concept
ISO 639-3 code: ybn
alternative label: Yabaâna language
definition: Yabaâna (Yabaána) is an extinct Arawakan language of Brazil.
in scheme: Lexvo - ISO 639-3 language codes
notation: ybn

West Makian
type: Language
type: Concept
ISO 639-3 code: mqs
alternative label: Makian, West
alternative label: West Makian language
definition: West Makian is the most divergent of the Papuan languages of Halmahera. It is spoken on the coast near Makian Island, and on the western half of that island. It has been strongly influenced by an Austronesian language or languages, and was once classified as Austronesian, as the East Makian language (Taba) still is.
in scheme: Lexvo - ISO 639-3 language codes
notation: mqs

Mok
type: Language
type: Concept
ISO 639-3 code: mqt
in scheme: Lexvo - ISO 639-3 language codes
notation: mqt

Mandari
type: Language
type: Concept
ISO 639-3 code: mqu
alternative label: Mandari dialect
definition: Mundari is an Eastern Nilotic language spoken by the Mundari people of South Sudan.
in scheme: Lexvo - ISO 639-3 language codes
notation: mqu

Mosimo
type: Language
type: Concept
ISO 639-3 code: mqv
in scheme: Lexvo - ISO 639-3 language codes
notation: mqv

Murupi
type: Language
type: Concept
ISO 639-3 code: mqw
in scheme: Lexvo - ISO 639-3 language codes
notation: mqw

Mamuju
type: Language
type: Concept
ISO 639-3 code: mqx
alternative label: Mamuju language
definition: Mamuju is an Austronesian language of Sulawesi, Indonesia. It has no written form.
in scheme: Lexvo - ISO 639-3 language codes
notation: mqx

Manggarai
type: Language
type: Concept
ISO 639-3 code: mqy
alternative label: Manggarainese language
definition: The Manggarainese language (Manggarainese: tombo Manggarai, Indonesian: bahasa Manggarai) is the language of the Manggarainese people from the western parts of the island of Flores, in East Nusa Tenggara Province, Indonesia. In addition, there are also some pockets of Manggarainese speakers in the village of Manggarai in Jakarta, the capital city of Indonesia. It is the native language of more than 730,000 people, based on statistical data reported by Central Agency on Statistics (BPS) in 2009 for the province of East Nusa Tenggara, Indonesia. The data include statistics for the population of the Regency of “Greater Manggarai” on Flores island, which consists of three districts: Manggarai district, West Manggarai district, and East Manggarai district. The Manggarainese language is part of the Austronesian family, and is therefore related to Indonesian and other Malay varieties. Most speakers of Manggarainese also speak Indonesian for official and commercial purposes and to communicate with non-Manggarainese Indonesians.
in scheme: Lexvo - ISO 639-3 language codes
notation: mqy

Pano
type: Language
type: Concept
ISO 639-3 code: mqz
alternative label: Malasanga language
definition: Malasanga or Pano is an Austronesian language spoken by about 900 individuals in two villages on the north coast of Morobe Province, Papua New Guinea.
in scheme: Lexvo - ISO 639-3 language codes
notation: mqz

Mlabri
type: Language
type: Concept
ISO 639-3 code: mra
alternative label: Mlabri language
definition: Mlabri is a language spoken by the Mlabri people in the border area between Thailand and Laos.
in scheme: Lexvo - ISO 639-3 language codes
notation: mra

Marino
type: Language
type: Concept
ISO 639-3 code: mrb
in scheme: Lexvo - ISO 639-3 language codes
notation: mrb

Maricopa
type: Language
type: Concept
ISO 639-3 code: mrc
alternative label: Maricopa language
definition: The Maricopa language is spoken by the Native American Maricopa tribe, on two reservations in Arizona: the Salt River Pima-Maricopa Indian Community and the Gila River Indian Community.
in scheme: Lexvo - ISO 639-3 language codes
notation: mrc

Yabong
type: Language
type: Concept
ISO 639-3 code: ybo
in scheme: Lexvo - ISO 639-3 language codes
notation: ybo

Western Magar
type: Language
type: Concept
ISO 639-3 code: mrd
alternative label: Magar, Western
in scheme: Lexvo - ISO 639-3 language codes
notation: mrd

Martha's Vineyard Sign Language
type: Language
type: Concept
ISO 639-3 code: mre
definition: Marthas Vineyard Sign Language (MVSL) is a sign language once widely used on the island of Marthas Vineyard off the coast of Massachusetts, U.S., from the early 18th century to the year 1952. It was remarkable for its use by both deaf and hearing people in the community; consequently, deafness did not become a barrier to participation in public life. Martha's Vineyard Sign Language is also notable for the role it played in the development of American Sign Language.
in scheme: Lexvo - ISO 639-3 language codes
notation: mre
preferred label: Língua de Sinais de Martha's Vineyard @pt
preferred label: Martha’s Vineyards Gebärdensprache @de

Elseng
type: Language
type: Concept
ISO 639-3 code: mrf
alternative label: Elseng language
definition: Elseng (Morwap) is a poorly documented Papuan language spoken by about 300 people in the Indonesian province of Papua. It is also known as Morwap, which means "what is it?"
in scheme: Lexvo - ISO 639-3 language codes
notation: mrf

Mising
type: Language
type: Concept
ISO 639-3 code: mrg
alternative label: Mishing language
in scheme: Lexvo - ISO 639-3 language codes
notation: mrg
preferred label: Mishmi @fr

Mara Chin
type: Language
type: Concept
ISO 639-3 code: mrh
alternative label: Chin, Mara
alternative label: Mara language
definition: The Mara language is a language spoken by Mara people living in South Mizoram, India and the adjacent people living in Chin State in Burma, formerly Burma.
in scheme: Lexvo - ISO 639-3 language codes
notation: mrh

Maori
type: Language
type: Concept
ISO 639-1 code: mi
ISO 639-2 Bibliographical code: mao
ISO 639-2 Terminological code: mri
ISO 639-3 code: mri
alternative label: Idioma maorí @es
alternative label: Lingua māori @it
alternative label: Língua maori @pt
alternative label: Maori de Nouvelle-Zélande @fr
alternative label: Maorische Sprache @de
alternative label: Māori language
definition: Māori or te reo Māori (pronounced ), commonly te reo ("the language"), is the language of the indigenous population of New Zealand, the Māori. It has the status of an official language in New Zealand. Linguists classify it within the Eastern Polynesian languages as being closely related to Cook Islands Māori, Tuamotuan and Tahitian; somewhat less closely to Hawaiian and Marquesan; and more distantly to the languages of Western Polynesia, including Samoan, Tokelauan, Niuean and Tongan. According to the Maori Language Commission, the number of fluent adult speakers fell to about 10,000 in 1995.
in scheme: Lexvo - ISO 639-3 language codes
notation: mri
preferred label: maori @fr
preferred label: maorí @es

Western Mari
type: Language
type: Concept
ISO 639-3 code: mrj
alternative label: Hill Mari language
alternative label: Mari, Western
definition: Hill Mari or Western Mari is a language spoken in the Gornomariysky, Yurinsky and Kilemarsky districts of Mari El, Russia. It is a Uralic language related to Meadow Mari. It is written using the Hill Mari Cyrillic script and is co-official with Russian and Meadow Mari in the Mari El Republic.
in scheme: Lexvo - ISO 639-3 language codes
notation: mrj
preferred label: Mari des montagnes @fr

Yawiyo
type: Language
type: Concept
ISO 639-3 code: ybx
in scheme: Lexvo - ISO 639-3 language codes
notation: ybx

Hmwaveke
type: Language
type: Concept
ISO 639-3 code: mrk
in scheme: Lexvo - ISO 639-3 language codes
notation: mrk

Mortlockese
type: Language
type: Concept
ISO 639-3 code: mrl
in scheme: Lexvo - ISO 639-3 language codes
notation: mrl

Merlav
type: Language
type: Concept
ISO 639-3 code: mrm
preferred label: Mwerlap
alternative label: Mwerlap language
definition: Mwerlap is an Oceanic language spoken in the south of the Banks Islands in Vanuatu. Its 900 speakers live mostly in Merelava and Merig, but a fair proportion have also settled the east coast of Gaua island. Besides, a number of Mwerlap speakers live in the two cities of Vanuatu, Port Vila and Luganville.
in scheme: Lexvo - ISO 639-3 language codes
notation: mrm

Cheke Holo
type: Language
type: Concept
ISO 639-3 code: mrn
in scheme: Lexvo - ISO 639-3 language codes
notation: mrn

Mru
type: Language
type: Concept
ISO 639-3 code: mro
alternative label: Mru language
definition: The Mru language is a part of Tibeto-Burman languages and one of the recognized languages of Bangladesh.
in scheme: Lexvo - ISO 639-3 language codes
notation: mro

Morouas
type: Language
type: Concept
ISO 639-3 code: mrp
in scheme: Lexvo - ISO 639-3 language codes
notation: mrp

North Marquesan
type: Language
type: Concept
ISO 639-3 code: mrq
alternative label: Marquesan, North
in scheme: Lexvo - ISO 639-3 language codes
notation: mrq

Yaweyuha
type: Language
type: Concept
ISO 639-3 code: yby
in scheme: Lexvo - ISO 639-3 language codes
notation: yby

Maria
type: Language
type: Concept
ISO 639-3 code: mrr
alternative label: Maria (India)
alternative label: Maria language
definition: Maria is a Dravidian language spoken in India by approximately 165,000 people.
in scheme: Lexvo - ISO 639-3 language codes
notation: mrr

Maragus
type: Language
type: Concept
ISO 639-3 code: mrs
in scheme: Lexvo - ISO 639-3 language codes
notation: mrs

Margi language
type: Language
type: Concept
ISO 639-3 code: mrt
alternative label: Marghi Central
definition: Margi, also known as Marghi and Marghi Central, is a Chadic language spoken in Nigeria. It is perhaps the best described of the Biu–Mandara branch of that family. Marghi South and Patai are closely related, and sometimes considered dialects of Margi.
in scheme: Lexvo - ISO 639-3 language codes
notation: mrt

Mono
type: Language
type: Concept
ISO 639-3 code: mru
alternative label: Mono (Cameroon)
in scheme: Lexvo - ISO 639-3 language codes
notation: mru

Mangareva
type: Language
type: Concept
ISO 639-3 code: mrv
alternative label: Mangareva language
definition: Mangareva, also known as the Mangarevan language, is a Polynesian language spoken in the Gambier Islands of French Polynesia by about 1600 people on the islands of Gambier and Mangareva. Speakers also have some bilingualism in Tahitian, in which there is a 50-68% lexical similarity. It is a member of the Marquesic subgroup, and as such is closely related to Hawaiian and to the languages of the Marquesas Islands.
in scheme: Lexvo - ISO 639-3 language codes
notation: mrv
preferred label: Mangarevanische Sprache @de
preferred label: Mangarévien @fr

Maranao
type: Language
type: Concept
ISO 639-3 code: mrw
alternative label: Maranao language
definition: Maranao is an Austronesian language spoken by the Maranao people in the provinces of Lanao del Norte and Lanao del Sur in the Philippines.
in scheme: Lexvo - ISO 639-3 language codes
notation: mrw

Dineor
type: Language
type: Concept
ISO 639-3 code: mrx
alternative label: Maremgi
in scheme: Lexvo - ISO 639-3 language codes
notation: mrx

Chesu
type: Language
type: Concept
ISO 639-3 code: ych
in scheme: Lexvo - ISO 639-3 language codes
notation: ych

Mandaya
type: Language
type: Concept
ISO 639-3 code: mry
in scheme: Lexvo - ISO 639-3 language codes
notation: mry

Marind
type: Language
type: Concept
ISO 639-3 code: mrz
in scheme: Lexvo - ISO 639-3 language codes
notation: mrz

Malay
type: Language
type: Concept
ISO 639-1 code: ms
ISO 639-2 Bibliographical code: may
ISO 639-2 Terminological code: msa
ISO 639-3 code: msa
alternative label: Malay (macrolanguage)
in scheme: Lexvo - ISO 639-3 language codes
notation: msa
preferred label: malais @fr

Masbatenyo
type: Language
type: Concept
ISO 639-3 code: msb
alternative label: Masbateño language
definition: Masbateño is a Visayan language spoken by more than 600,000 people, primarily in the province of Masbate in the Philippines. It is close to Capiznon and Hiligaynon (Ilonggo), both spoken on Panay. It can be considered a Bisakol language, meaning a language intermediate between Visayan languages and Bicolano languages.
in scheme: Lexvo - ISO 639-3 language codes
notation: msb
preferred label: Masbateño @fr

Sankaran Maninka
type: Language
type: Concept
ISO 639-3 code: msc
alternative label: Maninka, Sankaran
in scheme: Lexvo - ISO 639-3 language codes
notation: msc

Limba language
type: Language
type: Concept
ISO 639-3 code: msd
alternative label: Yucatec Maya Sign Language
definition: Limba (Malimba) is a Bantu language of Cameroon. It is very closely related to Duala. Speakers report some degree of mutual intelligibility with Tanga (Batanga), which they call "Old Malimba". Most speak Duala as the local lingua franca.
in scheme: Lexvo - ISO 639-3 language codes
notation: msd

Musey
type: Language
type: Concept
ISO 639-3 code: mse
alternative label: Musey language
definition: Musey is an Afro-Asiatic language of Chad and Cameroon. There is a degree of mutual intelligibility with Masana.
in scheme: Lexvo - ISO 639-3 language codes
notation: mse

Lolopo
type: Language
type: Concept
ISO 639-3 code: ycl
in scheme: Lexvo - ISO 639-3 language codes
notation: ycl

Mekwei
type: Language
type: Concept
ISO 639-3 code: msf
alternative label: Mekwei language
definition: Mekwei (Menggwei) is a Papuan language of Indonesia.
in scheme: Lexvo - ISO 639-3 language codes
notation: msf

Moraid
type: Language
type: Concept
ISO 639-3 code: msg
in scheme: Lexvo - ISO 639-3 language codes
notation: msg

Masikoro Malagasy
type: Language
type: Concept
ISO 639-3 code: msh
alternative label: Malagasy, Masikoro
in scheme: Lexvo - ISO 639-3 language codes
notation: msh

Sabah Malay
type: Language
type: Concept
ISO 639-3 code: msi
alternative label: Malay, Sabah
in scheme: Lexvo - ISO 639-3 language codes
notation: msi

Ma
type: Language
type: Concept
ISO 639-3 code: msj
alternative label: Ma (Democratic Republic of Congo)
alternative label: Ma language
definition: Ma, also known as Amadi, Madi, Madyo, is a Ubangian language spoken in DRC Congo.
in scheme: Lexvo - ISO 639-3 language codes
notation: msj

Mansaka
type: Language
type: Concept
ISO 639-3 code: msk
in scheme: Lexvo - ISO 639-3 language codes
notation: msk

Molof
type: Language
type: Concept
ISO 639-3 code: msl
alternative label: Molof language
alternative label: Poule
definition: Molof (Ampas, Poule) is a poorly documented Papuan language spoken by about 200 people. Wurm (1975) placed it as an independent branch of Trans–New Guinea, but Ross (2005) could not find enough evidence to classify it.
in scheme: Lexvo - ISO 639-3 language codes
notation: msl

Yucuna
type: Language
type: Concept
ISO 639-3 code: ycn
alternative label: Yucuna language
definition: Yucuna (Jukuna) is an Arawakan language of Colombia. Extinct Guarú (Garú) was either a dialect or a closely related language.
in scheme: Lexvo - ISO 639-3 language codes
notation: ycn

Agusan Manobo
type: Language
type: Concept
ISO 639-3 code: msm
alternative label: Manobo, Agusan
in scheme: Lexvo - ISO 639-3 language codes
notation: msm

Vurës
type: Language
type: Concept
ISO 639-3 code: msn
in scheme: Lexvo - ISO 639-3 language codes
notation: msn

Mombum
type: Language
type: Concept
ISO 639-3 code: mso
in scheme: Lexvo - ISO 639-3 language codes
notation: mso

Maritsauá
type: Language
type: Concept
ISO 639-3 code: msp
in scheme: Lexvo - ISO 639-3 language codes
notation: msp

Caac
type: Language
type: Concept
ISO 639-3 code: msq
in scheme: Lexvo - ISO 639-3 language codes
notation: msq

Mongolian Sign Language
type: Language
type: Concept
ISO 639-3 code: msr
definition: __NOTOC__ Mongolian Sign Language is a sign language used in Mongolia. Ethnologue estimates that there were between 10,000 to 147,000 deaf people in Mongolia ; however, it is not known how many of those are users of MSL.
in scheme: Lexvo - ISO 639-3 language codes
notation: msr
preferred label: Língua de Sinais da Mongólia @pt

West Masela
type: Language
type: Concept
ISO 639-3 code: mss
alternative label: Masela, West
in scheme: Lexvo - ISO 639-3 language codes
notation: mss

Musom
type: Language
type: Concept
ISO 639-3 code: msu
in scheme: Lexvo - ISO 639-3 language codes
notation: msu

Maslam
type: Language
type: Concept
ISO 639-3 code: msv
alternative label: Maslam language
definition: Maslam is an Afro-Asiatic language spoken in northern Cameroon and southwestern Chad. Dialects are Maslam and Sao. Maslam is in rapid decline.
in scheme: Lexvo - ISO 639-3 language codes
notation: msv

Mansoanka
type: Language
type: Concept
ISO 639-3 code: msw
alternative label: Sua language
definition: Sua, also known as Mansoanka or Kunante, is a Mel language of Guinea-Bissau.
in scheme: Lexvo - ISO 639-3 language codes
notation: msw

Moresada
type: Language
type: Concept
ISO 639-3 code: msx
in scheme: Lexvo - ISO 639-3 language codes
notation: msx

Chepya
type: Language
type: Concept
ISO 639-3 code: ycp
in scheme: Lexvo - ISO 639-3 language codes
notation: ycp

Aruamu
type: Language
type: Concept
ISO 639-3 code: msy
alternative label: Aruamu language
definition: Aruamu Mikarew (Mikarup, Makarup, Makarub), also Ariawiai (Mikarew-Ariaw), is a Ramu language of Papua New Guinea.
in scheme: Lexvo - ISO 639-3 language codes
notation: msy

Momare
type: Language
type: Concept
ISO 639-3 code: msz
in scheme: Lexvo - ISO 639-3 language codes
notation: msz

Cotabato Manobo
type: Language
type: Concept
ISO 639-3 code: mta
alternative label: Cotabato Manobo language
alternative label: Manobo, Cotabato
definition: Cotabato Manobo is a Manobo language spoken in Mindanao, the Philippines.
in scheme: Lexvo - ISO 639-3 language codes
notation: mta

Anyin Morofo
type: Language
type: Concept
ISO 639-3 code: mtb
in scheme: Lexvo - ISO 639-3 language codes
notation: mtb

Munit
type: Language
type: Concept
ISO 639-3 code: mtc
in scheme: Lexvo - ISO 639-3 language codes
notation: mtc

Mualang
type: Language
type: Concept
ISO 639-3 code: mtd
in scheme: Lexvo - ISO 639-3 language codes
notation: mtd

Malay
type: Language
type: Concept
ISO 639-3 code: zsm
alternative label: Malay, Standard
alternative label: Standard Malay
in scheme: Lexvo - ISO 639-3 language codes
notation: zsm
preferred label: Malaiisch @de
preferred label: malaio @pt
preferred label: malais @fr
preferred label: malayo @es
preferred label: malese @it

Mono
type: Language
type: Concept
ISO 639-3 code: mte
alternative label: Mono (Solomon Islands)
alternative label: Mono language
definition: The Mono language is an Oceanic language of the Solomon Islands spoken by 700 people on Treasury Island (Mono proper), 2300 on Shortland Island (Alu dialect), and 14 on Fauro Island.
in scheme: Lexvo - ISO 639-3 language codes
notation: mte

Yanda
type: Language
type: Concept
in scheme: Lexvo - ISO 639-3 language codes

Murik
type: Language
type: Concept
ISO 639-3 code: mtf
alternative label: Murik (Papua New Guinea)
alternative label: Murik language
definition: Murik Nor is a Lower Sepik language spoken in Papua New Guinea.
in scheme: Lexvo - ISO 639-3 language codes
notation: mtf

Una
type: Language
type: Concept
ISO 639-3 code: mtg
in scheme: Lexvo - ISO 639-3 language codes
notation: mtg

Munggui
type: Language
type: Concept
ISO 639-3 code: mth
in scheme: Lexvo - ISO 639-3 language codes
notation: mth

Maiwa
type: Language
type: Concept
ISO 639-3 code: mti
alternative label: Maiwa (Papua New Guinea)
in scheme: Lexvo - ISO 639-3 language codes
notation: mti

Moskona
type: Language
type: Concept
ISO 639-3 code: mtj
alternative label: Moskona language
definition: Meninggo, or Moskona, is a Papuan language of the north coast of Papua, Indonesia.
in scheme: Lexvo - ISO 639-3 language codes
notation: mtj

Eastern Yiddish
type: Language
type: Concept
ISO 639-3 code: ydd
alternative label: Yiddish, Eastern
in scheme: Lexvo - ISO 639-3 language codes
notation: ydd

Mbe'
type: Language
type: Concept
ISO 639-3 code: mtk
in scheme: Lexvo - ISO 639-3 language codes
notation: mtk

Montol
type: Language
type: Concept
ISO 639-3 code: mtl
alternative label: Montol language
definition: Montol is an Afro-Asiatic language spoken in Plateau State, Nigeria. Dialects are Baltap-Lalin and Montol.
in scheme: Lexvo - ISO 639-3 language codes
notation: mtl

Mator
type: Language
type: Concept
ISO 639-3 code: mtm
alternative label: Mator language
definition: Mator or Motor was a Uralic language belonging to the group of Samoyedic languages, extinct since the 1840s. It was spoken in the northern region of the Sayan Mountains in Siberia, close to the Mongolian north border. The speakers of Mator lived in a wide area from the eastern parts of the Minusinsk District (okrug) along the Yenisei River to the region of Lake Baikal. Three dialects of Mator were recorded: Mator proper as well as Taygi and Karagas (occasionally considered as separate languages, but their differences are few).
in scheme: Lexvo - ISO 639-3 language codes
notation: mtm
preferred label: Idioma mator @es
preferred label: Lingua mator @it
preferred label: Matorische Sprache @de

Matagalpa
type: Language
type: Concept
ISO 639-3 code: mtn
alternative label: Matagalpa language
definition: Matagalpa is an extinct Misumalpan language formerly spoken in the central highlands of Nicaragua. The language became extinct in the nineteenth century, and only few short wordlists remain. It was closely related to Cacaopera. The ethnic group, which numbers about 20,000 now speaks Spanish.
in scheme: Lexvo - ISO 639-3 language codes
notation: mtn
preferred label: Idioma matagalpa @es

Totontepec Mixe
type: Language
type: Concept
ISO 639-3 code: mto
alternative label: Mixe, Totontepec
definition: Totontepec Mixe, called North Highland Mixe in Wichmann (1995), is a Mixe language spoken in Mexico, in the town of Totontepec Villa de Morelos, Oaxaca.
in scheme: Lexvo - ISO 639-3 language codes
notation: mto

Wichí Lhamtés Nocten
type: Language
type: Concept
ISO 639-3 code: mtp
definition: Wichí Lhamtés Nocten is a Wichí language primarily spoken in Bolivia, where an estimated 1,810 Wichí people spoke it in 1994. An additional one hundred people spoke the language in Argentina in 1994. In Bolivia, the language is spoken in the north-central Tarija Department, southwest of Pilcomayo River, and in Cordillera de Pirapo. In Argentina, it is spoken in from the northern border south to Tartagal, Salta. The language is also called Mataco, Bolivian, Mataco Nocten, Nocten, Noctenes, Oktenai, and Weenhayek.
in scheme: Lexvo - ISO 639-3 language codes
notation: mtp

Muong
type: Language
type: Concept
ISO 639-3 code: mtq
alternative label: Muong language
definition: The Mường language is spoken by the Mường people of Vietnam. It is in the Austroasiatic language family and closely related to Vietnamese. It is a tonal language with five tones.
in scheme: Lexvo - ISO 639-3 language codes
notation: mtq

Mewari
type: Language
type: Concept
ISO 639-3 code: mtr
alternative label: Mewari language
definition: Mewari is one of the major dialects of Rajasthani language of Indo-Aryan languages family. It is spoken by about five million speakers in Rajsamand, Bhilwara, Udaipur, and Chittorgarh districts of Rajasthan state of India. It has SOV word order.
in scheme: Lexvo - ISO 639-3 language codes
notation: mtr

Yangum Dey
type: Language
type: Concept
ISO 639-3 code: yde
in scheme: Lexvo - ISO 639-3 language codes
notation: yde

Yora
type: Language
type: Concept
ISO 639-3 code: mts
alternative label: Yora language
definition: The Yora language also called Yura or Yuranahua is an indigenous language of Peru in the region of Manú National Park on the Panagua River. It belongs to the Panoan language family which also counts Cashibo language, Shipibo language the languages most closely related to Yora are the Yaminahua and Sharanahua languages. According to the Ethnologue there were 350 to 400 speakers of Yora in 1998, but the language was vigorous in the communities.
in scheme: Lexvo - ISO 639-3 language codes
notation: mts

Mota
type: Language
type: Concept
ISO 639-3 code: mtt
alternative label: Mota language
definition: Mota is an Oceanic language spoken by about 750 people on Mota island, in the Banks Islands of Vanuatu.
in scheme: Lexvo - ISO 639-3 language codes
notation: mtt

Tututepec Mixtec
type: Language
type: Concept
ISO 639-3 code: mtu
alternative label: Mixtec, Tututepec
in scheme: Lexvo - ISO 639-3 language codes
notation: mtu

Asaro'o
type: Language
type: Concept
ISO 639-3 code: mtv
in scheme: Lexvo - ISO 639-3 language codes
notation: mtv

Southern Binukidnon
type: Language
type: Concept
ISO 639-3 code: mtw
alternative label: Binukidnon, Southern
in scheme: Lexvo - ISO 639-3 language codes
notation: mtw

Tidaá Mixtec
type: Language
type: Concept
ISO 639-3 code: mtx
alternative label: Mixtec, Tidaá
in scheme: Lexvo - ISO 639-3 language codes
notation: mtx

Nabi
type: Language
type: Concept
ISO 639-3 code: mty
alternative label: Nabi language
definition: Nabi (Nambi), Metan, is a Torricelli language of Papua New Guinea. It was assigned to the Maimai branch in Ross (2005).
in scheme: Lexvo - ISO 639-3 language codes
notation: mty

Yidgha
type: Language
type: Concept
ISO 639-3 code: ydg
alternative label: Yidgha language
definition: The Yidgha language is a Pamir language spoken in the Upper Lutkuh Valley (Tehsil Lotkuh) of Chitral, Khyber Pakhtunkhwa west of Garam Chashma in Pakistan. Yidgha is similar to the Munji language spoken on the Afghan side of the border.
in scheme: Lexvo - ISO 639-3 language codes
notation: ydg

Mundang
type: Language
type: Concept
ISO 639-3 code: mua
alternative label: Moundang @fr
alternative label: Mundang language
definition: Mundang is an Mbum language of southern Chad and northern Cameroon.
in scheme: Lexvo - ISO 639-3 language codes
notation: mua
preferred label: mundang @es

Mubi
type: Language
type: Concept
ISO 639-3 code: mub
alternative label: Mubi language
definition: Mubi (also known as Moubi) is an Afro-Asiatic language spoken in central Chad.
in scheme: Lexvo - ISO 639-3 language codes
notation: mub

Mbu'
type: Language
type: Concept
ISO 639-3 code: muc
alternative label: Ajumbu
alternative label: Mbu’ language
definition: Mbu’ is a Bantoid language of Cameroon. It is traditionally classified as a Western Beboid language, but that has not been demonstrated to be a valid family. Inasmuch as Western Beboid may be valid, Mbu’ would appear to be the most divergent of its languages.
in scheme: Lexvo - ISO 639-3 language codes
notation: muc

Mednyj Aleut
type: Language
type: Concept
ISO 639-3 code: mud
alternative label: Aleut, Mednyj
alternative label: Medny Aleut language
definition: Mednyj Aleut (Also called Copper Island Creole or Copper Island Aleut) is a nearly extinct mixed language spoken on Bering Island. It is characterized by Aleut nouns and Russian verbs, each with the full inflectional complexity of the source languages. There are only 5 native speakers left.
in scheme: Lexvo - ISO 639-3 language codes
notation: mud

Media Lengua
type: Language
type: Concept
ISO 639-3 code: mue
definition: Media Lengua (Spanish for "half language" or "in-between language") is a language spoken in Salcedo, about 100 km south of Quito, Ecuador, by about 1,000 people of Native American ancestry. It is usually classified as a mixed language as it combines Spanish vocabulary with a Quechua grammatical system, most conspicuously morphology. Most of its lexemes, especially almost all content words, are of Spanish origin, only adapted to Quechua phonology, while its morphology, syntax and some particles are Quechua.
in scheme: Lexvo - ISO 639-3 language codes
notation: mue

Musgu
type: Language
type: Concept
ISO 639-3 code: mug
alternative label: Musgu language
definition: Musgu is a Biu–Mandara (Chadic) language of Cameroon and Chad. The endonym is Mulwi. Speakers of the extinct related language Muskum have switched to Musgu.
in scheme: Lexvo - ISO 639-3 language codes
notation: mug

Mündü
type: Language
type: Concept
ISO 639-3 code: muh
alternative label: Mündü language
definition: Mündü (Mondo) is a Ubangian language of South Sudan, with a few thousand speakers in the Democratic Republic of the Congo.
in scheme: Lexvo - ISO 639-3 language codes
notation: muh

Musi
type: Language
type: Concept
ISO 639-3 code: mui
alternative label: Musi language
definition: Musi, also known as Palembang and Sekayu, is a Malay language spoken by about 1.4 million residents of the Palembang metropolitan area, Palembang being the capital of South Sumatra, Indonesia, and has about 2.5 million additional speakers in the surrounding area. In recent times, the Palembang language has become a lingua franca in South Sumatra province , although South Sumatra also has other regional languages and dialects. Palembang is highly influenced by Javanese, because the first speakers came from Demak, Central Java in 18th century.
in scheme: Lexvo - ISO 639-3 language codes
notation: mui

Mabire
type: Language
type: Concept
ISO 639-3 code: muj
alternative label: Mabire language
definition: Mabire is a nearly extinct Afro-Asiatic language spoken in Oulek village in Chad.
in scheme: Lexvo - ISO 639-3 language codes
notation: muj

Mugom
type: Language
type: Concept
ISO 639-3 code: muk
alternative label: Mugom language
definition: Mugom (Mugu, Mugum) is a Bodish language spoken by over 6,000 people in Nepal and about 500 in India.
in scheme: Lexvo - ISO 639-3 language codes
notation: muk

Multiple languages
type: Language
type: Concept
ISO 639-2 Bibliographical code: mul
alternative label: Multiple Languages
in scheme: Lexvo - ISO 639-3 language codes
preferred label: Mehrsprachig @de
preferred label: idiomas múltiplos @pt
preferred label: lenguas múltiples @es
preferred label: multilingua @it
preferred label: multilingue @fr

Yoidik
type: Language
type: Concept
ISO 639-3 code: ydk
in scheme: Lexvo - ISO 639-3 language codes
notation: ydk

Maiwala
type: Language
type: Concept
ISO 639-3 code: mum
in scheme: Lexvo - ISO 639-3 language codes
notation: mum

Nyong
type: Language
type: Concept
ISO 639-3 code: muo
alternative label: Nyong language
definition: Nyong (Daganyonga) is a Leko language spoken in two well-separated enclaves in Cameroon and Nigeria. Cameroonian speakers consider themselves to be ethnically Chamba.
in scheme: Lexvo - ISO 639-3 language codes
notation: muo

Malvi
type: Language
type: Concept
ISO 639-3 code: mup
alternative label: Malvi language
definition: Malvi (Malavi, Mallow, Malwada, Malwi) is the Rajasthani language of the Malva region of India, with ten million speakers. Nimadi, spoken in the Nimar region of Madhya Pradesh and in Rajasthan, is its closest relative. The dialects of Malvi are Ujjaini (Ujjain, Indore, Dewas, Shajapur, Sehore districts), Rajawadi (Ratlam, Mandsaur, Neemuch districts), Umathwadi (Rajgarh district), and Sondhwadi (Jhalawar district). Ujjaini is the prestige dialect, and the language as a whole sometimes goes by that name. About 75% of the Malvi population can converse in Hindi, which is the official language of the Madhya Pradesh state, and literacy rate in a second language such as Hindi is about 40%.There are many unpublished materials in this language.
in scheme: Lexvo - ISO 639-3 language codes
notation: mup

Eastern Xiangxi Miao
type: Language
type: Concept
ISO 639-3 code: muq
alternative label: Miao, Eastern Xiangxi
in scheme: Lexvo - ISO 639-3 language codes
notation: muq

Murle
type: Language
type: Concept
ISO 639-3 code: mur
alternative label: Murle language
definition: Murle (also Ajibba, Beir, Merule, Mourle, Murele, Murule) is a Nilo-Saharan Eastern Sudanic language spoken by the Murle people, spoken in the southeast of South Sudan, near the Ethiopian border. A very small number of Murle live across the border in southwestern Ethiopia.
in scheme: Lexvo - ISO 639-3 language codes
notation: mur

Creek
type: Language
type: Concept
ISO 639-2 Bibliographical code: mus
ISO 639-2 Terminological code: mus
ISO 639-3 code: mus
alternative label: Creek language
alternative label: Idioma creek @es
alternative label: Língua creek @pt
preferred label: creek @es
alternative label: muskogee @fr
definition: The Creek language, also known as Muskogee or Muscogee (Mvskoke in Creek), is a Muskogean language spoken by Muscogee (Creek) and Seminole people primarily in the U.S. states of Oklahoma and Florida.
in scheme: Lexvo - ISO 639-3 language codes
notation: mus
preferred label: Muskogee-Sprache @de

Western Muria
type: Language
type: Concept
ISO 639-3 code: mut
alternative label: Muria, Western
in scheme: Lexvo - ISO 639-3 language codes
notation: mut

Yiddish Sign Language
type: Language
type: Concept
ISO 639-3 code: yds
in scheme: Lexvo - ISO 639-3 language codes
notation: yds

Yaaku
type: Language
type: Concept
ISO 639-3 code: muu
alternative label: Yaaku language
definition: Yaaku (also known as Mukogodo, Mogogodo, Mukoquodo, Siegu, Yaakua, Ndorobo) is an endangered Afro-Asiatic language spoken in Kenya. It is Cushitic, but its position within that family in unclear. Speakers are all older adults.
in scheme: Lexvo - ISO 639-3 language codes
notation: muu

Muthuvan
type: Language
type: Concept
ISO 639-3 code: muv
in scheme: Lexvo - ISO 639-3 language codes
notation: muv

Bo-Ung
type: Language
type: Concept
ISO 639-3 code: mux
in scheme: Lexvo - ISO 639-3 language codes
notation: mux

Muyang
type: Language
type: Concept
ISO 639-3 code: muy
alternative label: Muyang language
definition: Muyang is an Afro-Asiatic language spoken in northern Cameroon.
in scheme: Lexvo - ISO 639-3 language codes
notation: muy

Mursi
type: Language
type: Concept
ISO 639-3 code: muz
alternative label: Mursi language
definition: Mursi (also Dama, Merdu, Meritu, Murzi, Murzu) is a Nilo-Saharan Eastern Sudanic language spoken by the Mursi people, in the Central Omo region of southwest Ethiopia. It is similar to Suri, spoken in most of the immediately surrounding area.
in scheme: Lexvo - ISO 639-3 language codes
notation: muz

Manam
type: Language
type: Concept
ISO 639-3 code: mva
alternative label: Manam language
definition: Manam is a Kairiru–Manam language spoken mainly on the volcanic Manam Island, northeast of New Guinea.
in scheme: Lexvo - ISO 639-3 language codes
notation: mva

Mattole
type: Language
type: Concept
ISO 639-3 code: mvb
alternative label: Mattole language
definition: Mattole is an extinct Athabaskan language (of Na-Dené stock).
in scheme: Lexvo - ISO 639-3 language codes
notation: mvb

Ravula
type: Language
type: Concept
ISO 639-3 code: yea
in scheme: Lexvo - ISO 639-3 language codes
notation: yea

Mamboru
type: Language
type: Concept
ISO 639-3 code: mvd
in scheme: Lexvo - ISO 639-3 language codes
notation: mvd

Marwari
type: Language
type: Concept
ISO 639-3 code: mve
alternative label: Marwari (Pakistan)
in scheme: Lexvo - ISO 639-3 language codes
notation: mve

Peripheral Mongolian
type: Language
type: Concept
ISO 639-3 code: mvf
alternative label: Mongolian, Peripheral
in scheme: Lexvo - ISO 639-3 language codes
notation: mvf

Yucuañe Mixtec
type: Language
type: Concept
ISO 639-3 code: mvg
alternative label: Mixtec, Yucuañe
in scheme: Lexvo - ISO 639-3 language codes
notation: mvg

Mulgi
type: Language
type: Concept
ISO 639-3 code: mvh
alternative label: Mire language
definition: Mire is an Afro-Asiatic language spoken in the southwestern Chadian prefectures of Tandjile Prefecture and Lai Prefecture. Most of the speakers, who generally practice traditional religions or Christianity, speak Ndam (65% lexical similarity) or Kimré (32% lexical similarity) as a second language.
in scheme: Lexvo - ISO 639-3 language codes
notation: mvh

Miyako
type: Language
type: Concept
ISO 639-3 code: mvi
alternative label: Miyako language
definition: Miyako ( Myaakufutsu ) is a language spoken in the Miyako Islands, located southwest of Okinawa. The combined population of the islands is about 52,000 (as of 2011). Miyako is a Ryukyuan language, most closely related to Yaeyama. The number of competent native speakers is not known - as a consequence of Japanese language policy, reflected in the education system, people below the age of 60 tend to not use the language except in songs and rituals, and the younger generation mostly uses Japanese as their first language. Miyako is notable among the Japonic languages in that it allows non-nasal syllable-final consonants, something not found in most Japonic varieties.
in scheme: Lexvo - ISO 639-3 language codes
notation: mvi
preferred label: Idioma miyako @es
preferred label: Língua miyako @pt
preferred label: Miyako-Sprache @de

Mekmek
type: Language
type: Concept
ISO 639-3 code: mvk
alternative label: Mekmek language
definition: Mekmek is a Yuat language of Papua New Guinea.
in scheme: Lexvo - ISO 639-3 language codes
notation: mvk

Yeniche
type: Language
type: Concept
ISO 639-3 code: yec
in scheme: Lexvo - ISO 639-3 language codes
notation: yec

Mbara
type: Language
type: Concept
ISO 639-3 code: mvl
alternative label: Mbara (Australia)
alternative label: Mbara language
definition: Mbara is an extinct aboriginal language of Australia. It was spoken by tribal aborigines. No district or region was recorded on Ethnologue, so it is unknown where Mbara was spoken. It could be that the language has been extinct for too long. It has certainly been many years since any aborigines spoke Mbara, and the ethnic population is unknown.
in scheme: Lexvo - ISO 639-3 language codes
notation: mvl

Muya
type: Language
type: Concept
ISO 639-3 code: mvm
alternative label: Muya language
definition: Munya or Muya is one of the Qiangic languages spoken in China. There are two dialects, which are not mutually intelligible. Most research on Munya has been conducted by Ikeda Takumi.
in scheme: Lexvo - ISO 639-3 language codes
notation: mvm

Minaveha
type: Language
type: Concept
ISO 639-3 code: mvn
in scheme: Lexvo - ISO 639-3 language codes
notation: mvn

Marovo
type: Language
type: Concept
ISO 639-3 code: mvo
alternative label: Marovo language
definition: Marovo is an Austronesian language of the Solomon Islands. It is spoken in the New Georgia Group on islands in Marovo Lagoon and on the neighbouring islands of New Georgia, Vangunu and Nggatokae. The usual word order in sentences is verb-subject-object.
in scheme: Lexvo - ISO 639-3 language codes
notation: mvo

Duri
type: Language
type: Concept
ISO 639-3 code: mvp
in scheme: Lexvo - ISO 639-3 language codes
notation: mvp

Moere
type: Language
type: Concept
ISO 639-3 code: mvq
in scheme: Lexvo - ISO 639-3 language codes
notation: mvq

Marau
type: Language
type: Concept
ISO 639-3 code: mvr
in scheme: Lexvo - ISO 639-3 language codes
notation: mvr

Idioma yimas
type: Language
type: Concept
ISO 639-3 code: yee
alternative label: Yimas language
definition: The Yimas language is spoken by the Yimas people of Papua New Guinea. It is a polysynthetic language with (somewhat) free word order. It is an ergative-absolutive language morphologically but not syntactically, although it has several other case-like relations encoded on its verbs. It has over 9 classes (genders) of nouns, and a unique number system.
in scheme: Lexvo - ISO 639-3 language codes
notation: yee
preferred label: Yimas

Massep
type: Language
type: Concept
ISO 639-3 code: mvs
alternative label: Massep language
definition: Massep (Masep, Potafa, Wotaf) is a poorly documented Papuan language spoken by under 50 people in a single village. Despite the small number of speakers, however, language use is vigorous. Donohue et al. (2002) conclude that it is definitely not a Kwerba language, as it had been classified by Wurm (1975), and they did not notice connections to any other language family. Ethnologue (2009) thus considers it a language isolate, but it has not been included in wider surveys such as Ross (2005). The pronouns are not dissimilar from those Trans–New Guinea languages, but Massep is geographically distant from that family.
in scheme: Lexvo - ISO 639-3 language codes
notation: mvs

Mpotovoro
type: Language
type: Concept
ISO 639-3 code: mvt
in scheme: Lexvo - ISO 639-3 language codes
notation: mvt

Marfa
type: Language
type: Concept
ISO 639-3 code: mvu
alternative label: Marfa language
definition: Marfa is a Maban language language of Chad.
in scheme: Lexvo - ISO 639-3 language codes
notation: mvu

Tagal Murut
type: Language
type: Concept
ISO 639-3 code: mvv
alternative label: Murut, Tagal
alternative label: Tagol Murut language
definition: The Tagol Murut language is spoken by the Tagol (lowland) subgroup of the Murut people, and serves as the lingua franca of the whole group. It belongs to the Bornean subdivision of the Austronesian language family. Murut Tagol people can be found in Sabah and Sarawak, usually in areas around Lawas, Limbang & along the border areas shared with Brunei and Indonesia.
in scheme: Lexvo - ISO 639-3 language codes
notation: mvv

Machinga
type: Language
type: Concept
ISO 639-3 code: mvw
in scheme: Lexvo - ISO 639-3 language codes
notation: mvw

Meoswar
type: Language
type: Concept
ISO 639-3 code: mvx
in scheme: Lexvo - ISO 639-3 language codes
notation: mvx

Indus Kohistani
type: Language
type: Concept
ISO 639-3 code: mvy
alternative label: Kohistani, Indus
in scheme: Lexvo - ISO 639-3 language codes
notation: mvy

Mesqan
type: Language
type: Concept
ISO 639-3 code: mvz
alternative label: Mesqan language
definition: Mesqan (also Masqan, Meskan) is an Afro-Asiatic Ethiopian Semitic language spoken in the West Gurage region of Ethiopia.
in scheme: Lexvo - ISO 639-3 language codes
notation: mvz

Mwatebu
type: Language
type: Concept
ISO 639-3 code: mwa
in scheme: Lexvo - ISO 639-3 language codes
notation: mwa

Juwal
type: Language
type: Concept
ISO 639-3 code: mwb
alternative label: Juwal language
definition: Juwal Muniwara is a Torricelli language of Papua New Guinea. Other names are Mambe and Tumara ~ Tumaru.
in scheme: Lexvo - ISO 639-3 language codes
notation: mwb

Are
type: Language
type: Concept
ISO 639-3 code: mwc
alternative label: Are language
definition: The Are language is an Austronesian language of the eastern Papua New Guinean mainland, It's spoken by about 1,230 people.
in scheme: Lexvo - ISO 639-3 language codes
notation: mwc

Mudbura
type: Language
type: Concept
ISO 639-3 code: mwd
alternative label: Mudbura language
definition: Mudbura (Mudburra), also known as Karranga and Pinkangama, is an aboriginal language of Australia.
in scheme: Lexvo - ISO 639-3 language codes
notation: mwd

Mwera
type: Language
type: Concept
ISO 639-3 code: mwe
alternative label: Mwera (Chimwera)
alternative label: Mwera language
definition: Mwera is a Bantu language of Tanzania.
in scheme: Lexvo - ISO 639-3 language codes
notation: mwe

Murrinh-Patha
type: Language
type: Concept
ISO 639-3 code: mwf
alternative label: Murrinh-patha language
definition: Murrinh-patha (literally "language-good"), sometimes also called Garama, is an Australian Aboriginal language spoken by over 1,500 people, most of whom live in Wadeye in the Northern Territory, where it is the dominant language of the community. It is spoken by people of the Murrinh-Patha group, as well as several other groups whose languages are extinct or nearly so, including the Mati Ke and Marri-Djabin. Because of its role as the lingua franca in the region, It is one of few Australian Aboriginal languages whose speakers have increased over the past generation.
in scheme: Lexvo - ISO 639-3 language codes
notation: mwf

Yeni
type: Language
type: Concept
ISO 639-3 code: yei
alternative label: Yeni language
definition: The Yeni language is an extinct language of Cameroon, formerly spoken around Djeni Mountain in the Nyalang area. All that remains of the language, apparently, is a song remembered by some Sandani speakers. However, according to Bruce Connell (the first linguist to report its existence, in 1995), comparison of the song's words to neighboring languages suggests that "it was closely related to [the Mambiloid languages] Cambap, Njerep, and Kasabe" .
in scheme: Lexvo - ISO 639-3 language codes
notation: yei

Aiklep
type: Language
type: Concept
ISO 639-3 code: mwg
in scheme: Lexvo - ISO 639-3 language codes
notation: mwg

Mouk-Aria
type: Language
type: Concept
ISO 639-3 code: mwh
alternative label: Mouk-Aria language
definition: Mouk-Aria is an Austronesian language spoken by about 600 individuals along coastal West New Britain Province, Papua New Guinea on the island of New Britain.
in scheme: Lexvo - ISO 639-3 language codes
notation: mwh

Labo
type: Language
type: Concept
ISO 639-3 code: mwi
alternative label: Ninde
alternative label: Ninde language
definition: Ninde, or Labo (also Nide, Meaun, Mewun) is an Oceanic language spoken by about 1,100 people in the Southwest Bay area of Malekula island, in Vanuatu.
in scheme: Lexvo - ISO 639-3 language codes
notation: mwi

Maligo
type: Language
type: Concept
ISO 639-3 code: mwj
in scheme: Lexvo - ISO 639-3 language codes
notation: mwj

Kita Maninkakan
type: Language
type: Concept
ISO 639-3 code: mwk
alternative label: Maninkakan, Kita
in scheme: Lexvo - ISO 639-3 language codes
notation: mwk

Mirandese
type: Language
type: Concept
ISO 639-2 Bibliographical code: mwl
ISO 639-2 Terminological code: mwl
ISO 639-3 code: mwl
alternative label: Idioma mirandés @es
alternative label: Lingua mirandese @it
alternative label: Língua mirandesa @pt
alternative label: Mirandese language
alternative label: Mirandesisch @de
alternative label: mirandais @fr
definition: The Mirandese language (autonym: mirandés or lhéngua mirandesa; or ) is a Romance language belonging to the Astur-Leonese linguistic group, sparsely spoken in a small area of northeastern Portugal, in the municipalities of Miranda do Douro, Mogadouro and Vimioso. The Portuguese Parliament granted it co-official recognition (along with the Portuguese language) for local matters on 17 September 1998 with the law 7/99 of 29 January 1999.
in scheme: Lexvo - ISO 639-3 language codes
notation: mwl
preferred label: Mirandais @fr
preferred label: Mirandés @de
preferred label: mirandese @it
preferred label: mirandés @es
preferred label: mirandês @pt

Sar
type: Language
type: Concept
ISO 639-3 code: mwm
alternative label: Sar language
definition: Sar or Sara, also known as Madjingay and Sara Madjingay is a Bongo–Bagirmi language of southern Chad, and the lingua franca of regional capital of Sarh.
in scheme: Lexvo - ISO 639-3 language codes
notation: mwm

Nyamwanga
type: Language
type: Concept
ISO 639-3 code: mwn
alternative label: Mwanga language
definition: Mwanga, or Namwanga, is a Bantu language spoken by the Namwanga in the Northern Province of Zambia (mainly in the districts of Isoka and Nakonde) and in southwestern Tanzania. In 1993 the Namwanga population was estimated to number 256,000, with 169,000 residing in Zambia and 87,000 in Tanzania.
in scheme: Lexvo - ISO 639-3 language codes
notation: mwn

Central Maewo
type: Language
type: Concept
ISO 639-3 code: mwo
alternative label: Maewo, Central
in scheme: Lexvo - ISO 639-3 language codes
notation: mwo

Kala Lagaw Ya
type: Language
type: Concept
ISO 639-3 code: mwp
definition: Kala Lagaw Ya (correctly Kalaw Lagaw Ya [back/west+gen place+gen speech]; several other names; see below) is a language belonging to all the western and central Torres Strait Islands, Queensland, Australia. On some islands it has now largely been replaced by Brokan (Torres Strait Creole English). It has the highest speaker population of any indigenous language within Australian territory, with between 3000 and 4000 people speaking the language (Ethnologue) as their first language.
in scheme: Lexvo - ISO 639-3 language codes
notation: mwp

Mün Chin
type: Language
type: Concept
ISO 639-3 code: mwq
alternative label: Chin, Mün
alternative label: Mün language
definition: Mün (Mün Chin) is a Kukish language of Burma.
in scheme: Lexvo - ISO 639-3 language codes
notation: mwq

Marwari
type: Language
type: Concept
ISO 639-2 Bibliographical code: mwr
ISO 639-2 Terminological code: mwr
ISO 639-3 code: mwr
alternative label: Lingua marwari @it
alternative label: Marwari language
alternative label: marwarî @fr
definition: The Marwari language (Mārwāṛī;मारवाड़ी) , also variously Marvari, Marwadi, Marvadi), is spoken in the Indian state of Rajasthan. Marwari is also found in the neighboring state of Gujarat and Haryana and in Eastern Pakistan. With some 13.2 million speakers (as of 1997, ca.) , it is the largest language by number of speakers of the Marwari subgroup of the "Rajasthani language". There are 13 million speakers in Rajasthan and rest 200,000 in Eastern Pakistan. There about 23 dialects of the Marwari Language.
in scheme: Lexvo - ISO 639-3 language codes
notation: mwr
preferred label: marvari @fr
preferred label: marwari @es

Yevanic
type: Language
type: Concept
ISO 639-3 code: yej
alternative label: Yevanic language
definition: Yevanic, otherwise known as Judeo-Greek, was the dialect of the Romaniotes, the group of Greek Jews whose existence in Greece is documented since the Hellenistic period. Its linguistic lineage stems from the Hellenistic Koine and includes Hebrew elements as well. It was mutually intelligible with Greek of the Christian population. The Romaniotes used Hebrew alphabet to write Greek and Yevanic texts.
in scheme: Lexvo - ISO 639-3 language codes
notation: yej
preferred label: Jevanische Sprache @de
preferred label: Yévanique @fr

Mwimbi-Muthambi
type: Language
type: Concept
ISO 639-3 code: mws
in scheme: Lexvo - ISO 639-3 language codes
notation: mws

Moken
type: Language
type: Concept
ISO 639-3 code: mwt
alternative label: Moken language
definition: Moken is an Austronesian Sea Gypsy language of southern Burma. Like its relative Moklen, it has been strongly influenced by Mon–Khmer languages.
in scheme: Lexvo - ISO 639-3 language codes
notation: mwt

Mittu
type: Language
type: Concept
ISO 639-3 code: mwu
in scheme: Lexvo - ISO 639-3 language codes
notation: mwu

Mentawai
type: Language
type: Concept
ISO 639-3 code: mwv
alternative label: Mentawai language
definition: The Mentawai language is an Austronesian language, spoken by the Mentawai-people of the Mentawai Islands, West Sumatra. The dialects of the language include: – Silabu, Sipura – Simalegi, Sakalagan, Saumanganja – North Siberut, South Siberut – Taikaku – Pagai.
in scheme: Lexvo - ISO 639-3 language codes
notation: mwv

Hmong Daw
type: Language
type: Concept
ISO 639-3 code: mww
in scheme: Lexvo - ISO 639-3 language codes
notation: mww

Mediak
type: Language
type: Concept
ISO 639-3 code: mwx
in scheme: Lexvo - ISO 639-3 language codes
notation: mwx

Mosiro
type: Language
type: Concept
ISO 639-3 code: mwy
in scheme: Lexvo - ISO 639-3 language codes
notation: mwy

Moingi
type: Language
type: Concept
ISO 639-3 code: mwz
in scheme: Lexvo - ISO 639-3 language codes
notation: mwz

Northwest Oaxaca Mixtec
type: Language
type: Concept
ISO 639-3 code: mxa
alternative label: Mixtec, Northwest Oaxaca
in scheme: Lexvo - ISO 639-3 language codes
notation: mxa

Tezoatlán Mixtec
type: Language
type: Concept
ISO 639-3 code: mxb
alternative label: Mixtec, Tezoatlán
in scheme: Lexvo - ISO 639-3 language codes
notation: mxb

Manyika
type: Language
type: Concept
ISO 639-3 code: mxc
in scheme: Lexvo - ISO 639-3 language codes
notation: mxc

Modang
type: Language
type: Concept
ISO 639-3 code: mxd
in scheme: Lexvo - ISO 639-3 language codes
notation: mxd

Mele-Fila
type: Language
type: Concept
ISO 639-3 code: mxe
in scheme: Lexvo - ISO 639-3 language codes
notation: mxe

Yela
type: Language
type: Concept
ISO 639-3 code: yel
in scheme: Lexvo - ISO 639-3 language codes
notation: yel

Malgbe
type: Language
type: Concept
ISO 639-3 code: mxf
alternative label: Malgbe language
definition: Malgbe is an Afro-Asiatic language spoken in northern Cameroon and southwestern Chad. Dialects are Douguia, Dro, Malgbe, Mara, and Walia.
in scheme: Lexvo - ISO 639-3 language codes
notation: mxf

Mbangala
type: Language
type: Concept
ISO 639-3 code: mxg
in scheme: Lexvo - ISO 639-3 language codes
notation: mxg

Mvuba
type: Language
type: Concept
ISO 639-3 code: mxh
alternative label: Mvuba language
definition: Mvuba is a Central Sudanic language of northeastern Congo, with a thousand speakers in Uganda. It is similar to Lese.
in scheme: Lexvo - ISO 639-3 language codes
notation: mxh

Mozarabic
type: Language
type: Concept
ISO 639-3 code: mxi
alternative label: Mozarabic language
definition: Mozarabic was a continuum of closely related Romance dialects spoken in Muslim-dominated areas of the Iberian Peninsula during the early stages of the Romance languages' development in Iberia. Mozarabic descends from Late Latin and early Romance dialects spoken in the Iberian Peninsula from the 5th to the 8th centuries, and was spoken until the 14th century. This set of dialects came to be called the Mozarabic language by 19th century Spanish scholars, though there was never a common standard. The word, Mozarab is a loanword from Arabic musta`rab, meaning "Arabized".
in scheme: Lexvo - ISO 639-3 language codes
notation: mxi
preferred label: Idioma mozárabe @es
preferred label: Langue mozarabe @fr
preferred label: Lingua mozarabica @it
preferred label: Língua moçárabe @pt
preferred label: Mozarabische Sprache @de

Geman Deng
type: Language
type: Concept
ISO 639-3 code: mxj
alternative label: Deng, Geman
alternative label: Miju Mishmi language
alternative label: Miju-Mishmi
definition: Kaman (Chinese Geman), or Miju Mishmi, is a small Tibeto-Burman language of India and slightly into China.
in scheme: Lexvo - ISO 639-3 language codes
notation: mxj

Monumbo
type: Language
type: Concept
ISO 639-3 code: mxk
alternative label: Monumbo language
definition: Monumbo is a Torricelli language of Papua New Guinea.
in scheme: Lexvo - ISO 639-3 language codes
notation: mxk

Maxi Gbe
type: Language
type: Concept
ISO 639-3 code: mxl
alternative label: Gbe, Maxi
in scheme: Lexvo - ISO 639-3 language codes
notation: mxl

Tarok
type: Language
type: Concept
ISO 639-3 code: yer
alternative label: Tarok language
definition: Tarok is a regionally important Plateau language of Nigeria.
in scheme: Lexvo - ISO 639-3 language codes
notation: yer

Meramera
type: Language
type: Concept
ISO 639-3 code: mxm
in scheme: Lexvo - ISO 639-3 language codes
notation: mxm

Moi
type: Language
type: Concept
ISO 639-3 code: mxn
alternative label: Moi (Indonesia)
alternative label: Moi language
definition: Moi, or Mekwei, is a Papuan language of the Bird's Head Peninsula of New Guinea.
in scheme: Lexvo - ISO 639-3 language codes
notation: mxn

Mbowe
type: Language
type: Concept
ISO 639-3 code: mxo
in scheme: Lexvo - ISO 639-3 language codes
notation: mxo

Tlahuitoltepec Mixe
type: Language
type: Concept
ISO 639-3 code: mxp
alternative label: Mixe, Tlahuitoltepec
definition: Tlahuitoltepec Mixe, called South Highland Mixe in Wichmann (1995), is a Mixe language spoken in Mexico.
in scheme: Lexvo - ISO 639-3 language codes
notation: mxp

Juquila Mixe
type: Language
type: Concept
ISO 639-3 code: mxq
alternative label: Mixe, Juquila
in scheme: Lexvo - ISO 639-3 language codes
notation: mxq

Murik
type: Language
type: Concept
ISO 639-3 code: mxr
alternative label: Murik (Malaysia)
in scheme: Lexvo - ISO 639-3 language codes
notation: mxr

Huitepec Mixtec
type: Language
type: Concept
ISO 639-3 code: mxs
alternative label: Mixtec, Huitepec
in scheme: Lexvo - ISO 639-3 language codes
notation: mxs

Jamiltepec Mixtec
type: Language
type: Concept
ISO 639-3 code: mxt
alternative label: Mixtec, Jamiltepec
in scheme: Lexvo - ISO 639-3 language codes
notation: mxt

Mada
type: Language
type: Concept
ISO 639-3 code: mxu
alternative label: Mada (Cameroon)
alternative label: Mada language
definition: Mada is a Chadic language spoken in northern Cameroon.
in scheme: Lexvo - ISO 639-3 language codes
notation: mxu

Metlatónoc Mixtec
type: Language
type: Concept
ISO 639-3 code: mxv
alternative label: Mixtec, Metlatónoc
in scheme: Lexvo - ISO 639-3 language codes
notation: mxv

Namo
type: Language
type: Concept
ISO 639-3 code: mxw
in scheme: Lexvo - ISO 639-3 language codes
notation: mxw

Nyankpa
type: Language
type: Concept
ISO 639-3 code: yes
alternative label: Yeskwa language
definition: Yeskwa is a Plateau language of Nigeria. It sometimes appears in the literature as Nyenkpa, which is a dialect. The prestige dialect is Tattara.
in scheme: Lexvo - ISO 639-3 language codes
notation: yes

Mahou
type: Language
type: Concept
ISO 639-3 code: mxx
alternative label: Mawukakan
in scheme: Lexvo - ISO 639-3 language codes
notation: mxx

Southeastern Nochixtlán Mixtec
type: Language
type: Concept
ISO 639-3 code: mxy
alternative label: Mixtec, Southeastern Nochixtlán
in scheme: Lexvo - ISO 639-3 language codes
notation: mxy

Central Masela
type: Language
type: Concept
ISO 639-3 code: mxz
alternative label: Masela, Central
in scheme: Lexvo - ISO 639-3 language codes
notation: mxz

Burmese
type: Language
type: Concept
ISO 639-1 code: my
ISO 639-2 Bibliographical code: bur
ISO 639-2 Terminological code: mya
ISO 639-3 code: mya
alternative label: Birmanische Sprache @de
alternative label: Burmese language
alternative label: Idioma birmano @es
alternative label: Lingua birmana @it
alternative label: Língua birmanesa @pt
alternative label: birman @fr
definition: The Burmese language (; ; MLCTS: myanma bhasa) is the official language of Burma. Burmese is the native language of the Bamar and related sub-ethnic groups of the Bamar, as well as that of some ethnic minorities in Burma like the Mon. Burmese is spoken by 32 million as a first language and as a second language by 10 million, particularly ethnic minorities in Burma and those in neighboring countries. (Although the constitution officially recognizes the English name of the language as the Myanmar language, most English speakers continue to refer to the language as Burmese.)
in scheme: Lexvo - ISO 639-3 language codes
notation: mya
preferred label: Birman @fr
preferred label: Birmanisch @de
preferred label: birmano @es
preferred label: birmanês @pt

Mbay
type: Language
type: Concept
ISO 639-3 code: myb
alternative label: Mbay language
definition: Mbay, or Sara Mbay, is a Bongo–Bagirmi language of Chad and the Central African Republic.
in scheme: Lexvo - ISO 639-3 language codes
notation: myb

Mayeka
type: Language
type: Concept
ISO 639-3 code: myc
in scheme: Lexvo - ISO 639-3 language codes
notation: myc

Maramba
type: Language
type: Concept
ISO 639-3 code: myd
in scheme: Lexvo - ISO 639-3 language codes
notation: myd

Myene
type: Language
type: Concept
ISO 639-3 code: mye
alternative label: Myene language
alternative label: myènè @fr
definition: Myene is a cluster of closely related Bantu varieties spoken in Gabon by about 46,000 people. It is perhaps the most divergent of the Narrow Bantu languages, though Nurse & Philippson (2003) place it in with the Tsogo languages (B.30). The more distinctive varieties are Mpongwe (Pongoué), Galwa (Galloa), and Nkomi.
in scheme: Lexvo - ISO 639-3 language codes
notation: mye
preferred label: Myènè @fr
preferred label: myene @es

Bambassi
type: Language
type: Concept
ISO 639-3 code: myf
alternative label: Bambassi language
definition: Bambassi is an Omotic Afroasiatic language spoken in Ethiopia around the town of Bambasi in the area east of Asosa in Benishangul-Gumuz Region. The parent language group is the East Mao group. Alternative names for the language are Bambeshi, Siggoyo, Amam, Fadiro, Northern Mao, Didessa and Kere.
in scheme: Lexvo - ISO 639-3 language codes
notation: myf

Manta
type: Language
type: Concept
ISO 639-3 code: myg
alternative label: Manta language
definition: Manta (Anta, Banta) is a Grassfields language of Cameroon.
in scheme: Lexvo - ISO 639-3 language codes
notation: myg

Southern Rincon Zapotec
type: Language
type: Concept
ISO 639-3 code: zsr
alternative label: Zapotec, Southern Rincon
in scheme: Lexvo - ISO 639-3 language codes
notation: zsr

Makah
type: Language
type: Concept
ISO 639-3 code: myh
alternative label: Makah language
definition: The Makah language is the Indigenous language spoken by the Makah people. Makah has been extinct as a first language since 2002, when its last fluent native speaker died. However, it survives as a second language, and the Makah tribe is attempting to revive the language, including through preschool classes. The endonymous name for Makah is qʷi·qʷi·diččaq.
in scheme: Lexvo - ISO 639-3 language codes
notation: myh

Yetfa
type: Language
type: Concept
ISO 639-3 code: yet
alternative label: Yetfa language
definition: Yetfa or Biksi (Biaksi) is a Sepik language spoken in West Papua, Indonesia, and across the border in Papua New Guinea. It's a trade language in West Papua up to the PNG border.
in scheme: Lexvo - ISO 639-3 language codes
notation: yet

Mina
type: Language
type: Concept
ISO 639-3 code: myi
alternative label: Mina (India)
in scheme: Lexvo - ISO 639-3 language codes
notation: myi

Mangayat
type: Language
type: Concept
ISO 639-3 code: myj
alternative label: Mangaya language
definition: Mangaya (Buga) is a Ubangian language of South Sudan. The endonym is Bug.
in scheme: Lexvo - ISO 639-3 language codes
notation: myj

Mamara Senoufo
type: Language
type: Concept
ISO 639-3 code: myk
alternative label: Minyanka language
alternative label: Senoufo, Mamara
definition: Minyanka (also known as Mamara, Miniyanka, Minya, Mianka, Minianka, or Tupiire) is a northern Senufo language spoken by about 700,000 people in southeastern Mali. It is closely related to Supyire. Minyanka is one of the national languages of Mali.
in scheme: Lexvo - ISO 639-3 language codes
notation: myk
preferred label: Mamara @de

Moma
type: Language
type: Concept
ISO 639-3 code: myl
in scheme: Lexvo - ISO 639-3 language codes
notation: myl

Me'en
type: Language
type: Concept
ISO 639-3 code: mym
alternative label: Me'en language
definition: Meen (also Mekan, Mieen, Mieken, Meqan, Men) is a Nilo-Saharan language (Eastern Sudanic, Surmic) spoken in Ethiopia by the Meen people. In recent years, it has been written with the Geez alphabet, but in 2007 a decision was made to use the Latin alphabet. Dialects include Bodi (Podi) and Tishena (Teshina, Teshenna).
in scheme: Lexvo - ISO 639-3 language codes
notation: mym

Anfillo
type: Language
type: Concept
ISO 639-3 code: myo
alternative label: Anfillo language
definition: Anfillo (also known as Southern Mao) is a Northern Omotic language spoken in western Ethiopia by a few hundred people. The term Anfillo is used to refer both to the language and the people found in a small community in the Anfillo woreda, part of the Mirab Welega Zone. The language is on the verge of extinction as it is spoken only by adults above the age of sixty. All younger generations have shifted to Western Oromo.
in scheme: Lexvo - ISO 639-3 language codes
notation: myo

Idioma pirahã
type: Language
type: Concept
ISO 639-3 code: myp
alternative label: Pirahã language
definition: Pirahã (also spelled Pirahá, Pirahán) is a language spoken by the Pirahã. The Pirahã are an indigenous people of Amazonas, Brazil, living along the Maici River, a tributary of the Amazon.
in scheme: Lexvo - ISO 639-3 language codes
notation: myp
preferred label: Língua pirarrã @pt
preferred label: Pirahã

Forest Maninka
type: Language
type: Concept
ISO 639-3 code: myq
in scheme: Lexvo - ISO 639-3 language codes
notation: myq

Muniche
type: Language
type: Concept
ISO 639-3 code: myr
alternative label: Munichi language
definition: Munichi is a recently extinct language which was spoken in the village of Munichis, about 10 miles or 16 km West of Yurimaguas, Loreto Region, Peru. The last known mother-tongue speaker, Victoria Huancho Icahuate, died in the late 1990s, though some people remain in the village who know a few phrases. In 1988, there were two mother-tongue speakers, but they had not met since the 1970s.
in scheme: Lexvo - ISO 639-3 language codes
notation: myr
preferred label: Idioma muniche @es

Mesmes
type: Language
type: Concept
ISO 639-3 code: mys
alternative label: Mesmes language
definition: The Mesmes language is an extinct language, one of the West Gurage languages, a cluster of Semitic languages in Ethiopia. There are still many people who claim the Mesmes ethnic identity, but none who speak the language. The last speaker of the language was interviewed by a language survey team when he was approximately 80 years old. He had not spoken the language for 30 years, when his brother had died.
in scheme: Lexvo - ISO 639-3 language codes
notation: mys

Mundurukú
type: Language
type: Concept
ISO 639-3 code: myu
alternative label: Munduruku language
definition: Mundurukú is a Tupi language spoken by 10,000 people in the Tapajós River basin in north central Brazil, of which most of the women and children are monolingual.
in scheme: Lexvo - ISO 639-3 language codes
notation: myu
preferred label: Língua mundurucu @pt

Yerukula
type: Language
type: Concept
ISO 639-3 code: yeu
alternative label: Yerukala language
definition: Yerukula is a Dravidian language mainly spoken by the Yerukala tribe. This language is also called Kurru basha or Kulavatha. Yerukala is linguistically close to South Dravidian languages such as Ravula and Irula. Lexical similarity among these languages ranges from 53% to 81%; in the case of Irula, it varies from 33% to 38%; in case of Ravula, it varies from 28% to 45%; in case of modern Tamil, it varies from 27% to 45%.
in scheme: Lexvo - ISO 639-3 language codes
notation: yeu
preferred label: Língua kurru @pt

Erzya
type: Language
type: Concept
ISO 639-2 Bibliographical code: myv
ISO 639-2 Terminological code: myv
ISO 639-3 code: myv
alternative label: Ersjanische Sprache @de
alternative label: Erzya language
alternative label: Idioma erzya @es
alternative label: Lingua ersiana @it
preferred label: erzya @es
definition: The Erzya language (эрзянь кель) is spoken by about 500,000 people in the northern and eastern and north-western parts of the Republic of Mordovia and adjacent regions of Nizhniy Novgorod, Chuvashia, Penza, Samara, Saratov, Orenburg, Ulyanovsk, Tatarstan and Bashkortostan in Russia. A diaspora can also be found in Armenia, Estonia as well as in Kazakhstan and other newly independent states of Central Asia. Erzya is currently written using Cyrillic with no modifications to the variant used by the Russian language. In Mordovia, Erzya is co-official with Moksha and Russian.
in scheme: Lexvo - ISO 639-3 language codes
notation: myv
preferred label: Ersja-Mordwinisch @de
preferred label: erza @fr

Muyuw
type: Language
type: Concept
ISO 639-3 code: myw
alternative label: Muyuw language
definition: Muyuw language (Egum, Murua, Murua Dukwayasi, Murua Kaulae, Muruwa, Muyu, Muyua, Muyuwa) is one of the Kilivila–Louisiades languages (of the Austronesian language family), spoken on the Woodlark Island (Papua New Guinea).
in scheme: Lexvo - ISO 639-3 language codes
notation: myw

Masaaba
type: Language
type: Concept
ISO 639-3 code: myx
alternative label: Masaba language
definition: Masaba (Lumasaaba), sometimes known as Gisu (Lugisu) after one of its dialects, is a Bantu language spoken by about 1,500,000 people in eastern Uganda in the administrative region of Bugisu on the border to Kenya. The language is closely related to, and mutually intelligible with Bukusu, spoken in western Kenya. Its speakers, formerly known as the Bagisu, prefer to be called Bamasaba. Masaba is the local name of Mount Elgon. Like other Bantu languages, Masaba has a large set of prefixes used as noun classifiers. This is similar to how gender is used in many Germanic and Romance languages, except that instead of the usual two or three, there are around eighteen different noun classes, most of them rather only generally defined. The language is tonal and has a quite complex verb...
in scheme: Lexvo - ISO 639-3 language codes
notation: myx
preferred label: Língua masaba @pt

Macuna
type: Language
type: Concept
ISO 639-3 code: myy
in scheme: Lexvo - ISO 639-3 language codes
notation: myy

Classical Mandaic
type: Language
type: Concept
ISO 639-3 code: myz
alternative label: Mandaic, Classical
in scheme: Lexvo - ISO 639-3 language codes
notation: myz

Santa María Zacatepec Mixtec
type: Language
type: Concept
ISO 639-3 code: mza
alternative label: Mixtec, Santa María Zacatepec
in scheme: Lexvo - ISO 639-3 language codes
notation: mza

Tumzabt
type: Language
type: Concept
ISO 639-3 code: mzb
alternative label: Mozabite language
definition: Mozabite, or , is a dialect of the Berber language spoken by the Mozabites, an Ibadi group inhabiting the seven cities of the M'zab in the northern Saharan Algeria. It is also spoken by small numbers of Mozabite emigrants in the cities of Algeria and elsewhere. It is very closely related to the nearby Berber dialects of Ouargla, Oued Righ and the more distant Gourara.
in scheme: Lexvo - ISO 639-3 language codes
notation: mzb
preferred label: Mozabite @fr
preferred label: Mzab-Wargla @de

Madagascar Sign Language
type: Language
type: Concept
ISO 639-3 code: mzc
in scheme: Lexvo - ISO 639-3 language codes
notation: mzc

Malimba
type: Language
type: Concept
ISO 639-3 code: mzd
in scheme: Lexvo - ISO 639-3 language codes
notation: mzd

Morawa
type: Language
type: Concept
ISO 639-3 code: mze
in scheme: Lexvo - ISO 639-3 language codes
notation: mze

Monastic Sign Language
type: Language
type: Concept
ISO 639-3 code: mzg
alternative label: Monastic sign languages
definition: Monastic sign languages have been used in Europe from at least the 10th century by Christian monks, and some, such as Cistercian and Trappist sign, are still in use today—not only in Europe but also in Japan, China and the USA. Unlike deaf sign languages, they are better understood as forms of symbolic gestural communication rather than languages, and some writers have preferred to describe them as sign lexicons.
in scheme: Lexvo - ISO 639-3 language codes
notation: mzg
preferred label: Langue des signes monastique @fr

Wichí Lhamtés Güisnay
type: Language
type: Concept
ISO 639-3 code: mzh
definition: Wichí Lhamtés Güisnay or Wiznay is a Wichí language. Wichí Lhamtés Güisnay had an estimated 15,000 speakers in 1999 in Argentina and Chile. The language is centered in the Pilcomayo River region. Other names for the language include Güisnay, Mataco, Mataco Güisnay, Mataco Pilcomayo, and Wichí Lhamtés. A grammar book has been written for the language.
in scheme: Lexvo - ISO 639-3 language codes
notation: mzh
preferred label: Wichi @fr

Yapunda
type: Language
type: Concept
ISO 639-3 code: yev
in scheme: Lexvo - ISO 639-3 language codes
notation: yev

Ixcatlán Mazatec
type: Language
type: Concept
ISO 639-3 code: mzi
alternative label: Mazatec, Ixcatlán
in scheme: Lexvo - ISO 639-3 language codes
notation: mzi

Manya
type: Language
type: Concept
ISO 639-3 code: mzj
in scheme: Lexvo - ISO 639-3 language codes
notation: mzj

Nigeria Mambila
type: Language
type: Concept
ISO 639-3 code: mzk
alternative label: Mambila, Nigeria
in scheme: Lexvo - ISO 639-3 language codes
notation: mzk

Mazatlán Mixe
type: Language
type: Concept
ISO 639-3 code: mzl
alternative label: Mixe, Mazatlán
in scheme: Lexvo - ISO 639-3 language codes
notation: mzl

Mumuye
type: Language
type: Concept
ISO 639-3 code: mzm
alternative label: Mumuye language
definition: Mumuye is the most important of the Adamawa languages. It is currently classified in the Leko–Nimbari branch of Savanna languages, as Adamawa is no longer considered a valid family. According to Ethnologue, there are multiple dialects: Zinna, Dong, Yoro, Lankaviri, Gola (Bajama), Gongla, Kasaa, Saawa, Jalingo, Nyaaja, Jeng, Gnoore, Yaa, Sagbee, Shaari, Kugong, Mang, Kwaji, Meeka, Yakoko.
in scheme: Lexvo - ISO 639-3 language codes
notation: mzm

Mazanderani
type: Language
type: Concept
ISO 639-3 code: mzn
alternative label: Mazandarani language
definition: Mazandarani (مازندرانی) or Tabari (تبری) (Also known as: Mazaniki) is an Iranian language of the Northwestern branch, spoken mainly in Iran's Mazandaran, Gilan and Golestan provinces. As a member of the Northwestern branch (the northern branch of Western Iranian), genetically speaking it is rather closely related to Gilaki, and more distantly related to Persian, which belongs to the Southwestern branch.
in scheme: Lexvo - ISO 639-3 language codes
notation: mzn
preferred label: Idioma mazandaraní @es
preferred label: Masanderanische Sprache @de
preferred label: Mazandarani @fr

Matipuhy
type: Language
type: Concept
ISO 639-3 code: mzo
in scheme: Lexvo - ISO 639-3 language codes
notation: mzo

Yeyi
type: Language
type: Concept
ISO 639-3 code: yey
alternative label: Yeyi language
definition: Yeyi (autoethnonym Shiyeyi) is an endangered Bantu language spoken by many of the approximately 50,000 Yeyi people along the Okavango River in Namibia and Botswana. Yeyi, influenced by Juu languages, is one of several Bantu languages along the Okavango with clicks. Indeed, it has the largest known inventory of clicks of any Bantu language, with dental, alveolar, palatal, and lateral articulations. Though most of its older speakers prefer Yeyi in normal conversation, it is being gradually phased out in Botswana by a popular move towards Tswana, with Yeyi only being learned by children in a few villages. Yeyi speakers in the Caprivi Strip of north-eastern Namibia, however, retain Yeyi in villages (including Linyanti), but may also speak the regional lingua franca, Lozi.
in scheme: Lexvo - ISO 639-3 language codes
notation: yey

Movima
type: Language
type: Concept
ISO 639-3 code: mzp
alternative label: Movima language
in scheme: Lexvo - ISO 639-3 language codes
notation: mzp
preferred label: Idioma movima @es

Mori Atas
type: Language
type: Concept
ISO 639-3 code: mzq
in scheme: Lexvo - ISO 639-3 language codes
notation: mzq

Marúbo
type: Language
type: Concept
ISO 639-3 code: mzr
alternative label: Marúbo language
definition: Marúbo is a Panoan language of Brazil.
in scheme: Lexvo - ISO 639-3 language codes
notation: mzr

Macanese
type: Language
type: Concept
ISO 639-3 code: mzs
alternative label: Macanese language
definition: Macanese or Macau Creole (known as Patuá to its speakers) is a creole language derived mainly from Malay, Sinhalese, Cantonese, and Portuguese, which was originally spoken by the Macanese community of the Portuguese colony of Macau. It is now spoken by a few families in Macau and in the Macanese diaspora.
in scheme: Lexvo - ISO 639-3 language codes
notation: mzs
preferred label: Macaista @de
preferred label: Patois macanais @fr
preferred label: Patuá macaense @pt

Mintil
type: Language
type: Concept
ISO 639-3 code: mzt
alternative label: Mintil language
definition: Mintil is a possibly extinct aboriginal Mon–Khmer language of Malaya.
in scheme: Lexvo - ISO 639-3 language codes
notation: mzt

Inapang
type: Language
type: Concept
ISO 639-3 code: mzu
alternative label: Inapang language
definition: Inapang Midsivindi is a Ramu language of Papua New Guinea.
in scheme: Lexvo - ISO 639-3 language codes
notation: mzu

Manza
type: Language
type: Concept
ISO 639-3 code: mzv
in scheme: Lexvo - ISO 639-3 language codes
notation: mzv

Deg
type: Language
type: Concept
ISO 639-3 code: mzw
alternative label: Deg language
definition: Deg (Degha) is a Gur language of Ghana, with a thousand speakers in Ivory Coast.
in scheme: Lexvo - ISO 639-3 language codes
notation: mzw

Mawayana
type: Language
type: Concept
ISO 639-3 code: mzx
alternative label: Mawayana language
definition: Mawayana (Mahuayana) is an Arawakan language of Guyana.
in scheme: Lexvo - ISO 639-3 language codes
notation: mzx

Mozambican Sign Language
type: Language
type: Concept
ISO 639-3 code: mzy
in scheme: Lexvo - ISO 639-3 language codes
notation: mzy

Maiadomu
type: Language
type: Concept
ISO 639-3 code: mzz
in scheme: Lexvo - ISO 639-3 language codes
notation: mzz

Malyangapa
type: Language
type: Concept
ISO 639-3 code: yga
in scheme: Lexvo - ISO 639-3 language codes
notation: yga

Namla
type: Language
type: Concept
ISO 639-3 code: naa
alternative label: Namla language
definition: Namla is a recently discovered and poorly documented Papuan language of Indonesia. It may be related to Tofanma, a neighboring language which like Namla remains unclassified.
in scheme: Lexvo - ISO 639-3 language codes
notation: naa

Southern Nambikuára
type: Language
type: Concept
ISO 639-3 code: nab
alternative label: Nambikuára, Southern
alternative label: Nambikwara language
definition: The Nambikwara language (Southern Nambikwara or Kitãulhu, contrasting with Northern Nambikwara or Mamaindé; also spelled Nambikuára, Nhambikwara or Nambiquara) is an indigenous language of Brazil, spoken by about 1200 Nambikwara people in the Mato Grosso state. It forms a small Nambikwaran language family, which are often considered dialects of a single language despite not being mutually intelligible. They are a language isolate; Joseph Greenberg had included in his Gê–Pano–Carib phylum, but this has not been followed by other linguists. Nambikwara is in vigorous use in the Nambikwara communities and in spite of having few speakers the language is not endangered. The name Nambikwara is of Tupi origin.
in scheme: Lexvo - ISO 639-3 language codes
notation: nab
preferred label: Língua nambiquara @pt
preferred label: Nambikwara du Sud @fr
preferred label: Nambikwara-Sprachen @de

Narak
type: Language
type: Concept
ISO 639-3 code: nac
in scheme: Lexvo - ISO 639-3 language codes
notation: nac

Nijadali
type: Language
type: Concept
ISO 639-3 code: nad
in scheme: Lexvo - ISO 639-3 language codes
notation: nad

Naka'ela
type: Language
type: Concept
ISO 639-3 code: nae
in scheme: Lexvo - ISO 639-3 language codes
notation: nae

Nabak
type: Language
type: Concept
ISO 639-3 code: naf
alternative label: Nabak language
definition: Nabak (Naba, Napa) is a Papuan language spoken in Morobe Province, Papua New Guinea. It's also known as Wain.
in scheme: Lexvo - ISO 639-3 language codes
notation: naf

Naga Pidgin
type: Language
type: Concept
ISO 639-3 code: nag
alternative label: Nagamese creole
definition: Nagamese ("Naga Pidgin") is a creole used in Nagaland. It is based on Assamese. Since Nagaland is inhabited by people belonging to different Naga tribes speaking languages which are mutually unintelligible, Nagamese is the preferred form of communication for all. It is used in the Nagaland Legislature, as a means of explanation in Nagaland schools and in mixed households. It has been described as a creole, which was stable by 1936 and which is unlikely to decreolize. English is the official language of Nagaland and 67.11% of the population is educated.
in scheme: Lexvo - ISO 639-3 language codes
notation: nag

Yiningayi
type: Language
type: Concept
in scheme: Lexvo - ISO 639-3 language codes

Nalu
type: Language
type: Concept
ISO 639-3 code: naj
alternative label: Nalu language
definition: Nalu is a Senegambian language of Guinea and Guinea-Bissau.
in scheme: Lexvo - ISO 639-3 language codes
notation: naj

Nakanai
type: Language
type: Concept
ISO 639-3 code: nak
alternative label: Nakanai language
definition: The Nakanai language is spoken by the Nakanai tribe in West New Britain, a province of Papua New Guinea. It is an Austronesian language, belonging to the Malayo-Polynesian subgroup.
in scheme: Lexvo - ISO 639-3 language codes
notation: nak

Nalik
type: Language
type: Concept
ISO 639-3 code: nal
alternative label: Nalik language
definition: The Nalik language is spoken by approximately 5,000 people, based in 17 villages in Kavieng District, New Ireland, Papua New Guinea.
in scheme: Lexvo - ISO 639-3 language codes
notation: nal

Ngan'gityemerri
type: Language
type: Concept
ISO 639-3 code: nam
alternative label: Ngangikurrunggurr language
in scheme: Lexvo - ISO 639-3 language codes
notation: nam
preferred label: Língua ngangikurrunggurr @pt

Chino min nan
type: Language
type: Concept
ISO 639-3 code: nan
alternative label: Chinese, Min Nan
alternative label: Min Nan Chinese
definition: The Southern Min languages, or Min Nan , are a family of Chinese languages spoken in southern Fujian, eastern Guangdong, Hainan, Taiwan, and southern Zhejiang provinces of China, and by descendants of emigrants from these areas in diaspora.
in scheme: Lexvo - ISO 639-3 language codes
notation: nan
preferred label: Lingua min nan @it
preferred label: Min Nan
preferred label: Minnan @fr

Yangum Gel
type: Language
type: Concept
ISO 639-3 code: ygl
in scheme: Lexvo - ISO 639-3 language codes
notation: ygl

Naaba
type: Language
type: Concept
ISO 639-3 code: nao
in scheme: Lexvo - ISO 639-3 language codes
notation: nao

Neapolitan
type: Language
type: Concept
ISO 639-2 Bibliographical code: nap
ISO 639-2 Terminological code: nap
ISO 639-3 code: nap
alternative label: Dialetti italiani meridionali @it
alternative label: Neapolitanisch @de
alternative label: Southern Italian
definition: Southern Italian (Dialetti italiani meridionali), or Napoletano-Calabrese, is a group of Italo-Dalmatian Romance dialects spoken in Southern Lazio, Southern Marche, Abruzzo, Molise, Campania, Basilicata, Apulia, and Northern Calabria. Part of a language continuum, they are all mutually intelligible and are often referred to as Neapolitan languages (based on Naples' historic role as capital of the region). According to Ethnologue, the dialects are grouped as Napoletano-Calabrese and are given the status of language. Some consider the dialects simply as Italian dialects affected by a samnite substratum.
in scheme: Lexvo - ISO 639-3 language codes
notation: nap
preferred label: Süditalienisch @de
preferred label: napoletano @it
preferred label: napolitain @fr
preferred label: napolitano @es

Nama
type: Language
type: Concept
ISO 639-3 code: naq
alternative label: Nama (Namibia)
in scheme: Lexvo - ISO 639-3 language codes
notation: naq
preferred label: nama @es
preferred label: nama khoe @fr

Iguta
type: Language
type: Concept
ISO 639-3 code: nar
in scheme: Lexvo - ISO 639-3 language codes
notation: nar

Naasioi
type: Language
type: Concept
ISO 639-3 code: nas
alternative label: Naasioi language
definition: Naasioi (also Nasioi, Kieta, Kieta Talk, Aunge) is an East Papuan language spoken in the central mountains and southeast coast of Kieta District, Bougainville Province, Papua New Guinea.
in scheme: Lexvo - ISO 639-3 language codes
notation: nas

Hungworo
type: Language
type: Concept
ISO 639-3 code: nat
alternative label: Hungworo language
definition: Hungworo, or Ngwe, is a Kainji language spoken in Nigeria.
in scheme: Lexvo - ISO 639-3 language codes
notation: nat

Nauru
type: Language
type: Concept
ISO 639-1 code: na
ISO 639-2 Bibliographical code: nau
ISO 639-2 Terminological code: nau
ISO 639-3 code: nau
alternative label: Idioma nauruano @es
alternative label: Lingua nauruana @it
alternative label: Língua nauruana @pt
alternative label: Nauruan @fr
alternative label: Nauruan language
alternative label: Nauruische Sprache @de
definition: The Nauruan language (dorerin Naoero) is an Austronesian language spoken in Nauru. It is estimated that it has 7,000 speakers. Almost all speakers are bilingual in English.
in scheme: Lexvo - ISO 639-3 language codes
notation: nau
preferred label: Nauruisch @de
preferred label: nauru @it
preferred label: nauruan @fr
preferred label: nauruano @es